harmony-alerts mailing list archives

Site index · List index
Message view « Date » · « Thread »
Top « Date » · « Thread »
From nom...@intel.com
Subject [build-test alert] FAILED Windows 2003 x86_64: struts_test
Date Tue, 01 Jan 2008 15:50:00 GMT
svn.revision=607327
BUILD FAILED:
	Ant Error Message:
C:\cc\cc-suites\scripts\cc-exec-adaptor.xml:104: The following error occurred while executing
this line: C:\cc\cc-suites\adaptors\struts_test\adaptor.xml:67: The following error occurred
while executing this line: C:\cc\cc-suites\adaptors\struts_test\adaptor.xml:229: Test failed

Date of build:	2008-01-01 18:49:18 +0300
Time to build:	35 seconds
Last changed:	12/29/2007 12:23:12
Last log entry:	snapshot

***********************************************************
Errors/Warnings:	(2)
            
The execution FAILED with the following exception:
The following error occurred while executing this line:
C:\cc\cc-suites\adaptors\struts_test\adaptor.xml:67: The following error occurred while executing
this line:
C:\cc\cc-suites\adaptors\struts_test\adaptor.xml:229: Test failed

***********************************************************
Unit Tests: (1)
        
error: unknown org.apache.harmony.struts.test.WebAppTest
Unit Test Error Details:	(1)
                
Test: unknownClass: org.apache.harmony.struts.test.WebAppTestjunit.framework.AssertionFailedError:
file520468537.html: Lines 147 don't match:
Remote: "        <p>Copyright &copy; 2003-2008 The Apache Software Foundation.</p>"
 Local: "        <p>Copyright &copy; 2003-2007 The Apache Software Foundation.</p>"

	at org.apache.harmony.struts.test.WebAppTest.checkResponse(Unknown Source)
	at org.apache.harmony.struts.test.WebAppTest.performTest(Unknown Source)
	at org.apache.harmony.struts.test.WebAppTest.launchSpiderR(Unknown Source)
	at org.apache.harmony.struts.test.WebAppTest.test(Unknown Source)
	at org.junit.internal.runners.TestMethodRunner.executeMethodBody(TestMethodRunner.java:99)
	at org.junit.internal.runners.TestMethodRunner.runUnprotected(TestMethodRunner.java:81)
	at org.junit.internal.runners.BeforeAndAfterRunner.runProtected(BeforeAndAfterRunner.java:34)
	at org.junit.internal.runners.TestMethodRunner.runMethod(TestMethodRunner.java:75)
	at org.junit.internal.runners.TestMethodRunner.run(TestMethodRunner.java:45)
	at org.junit.internal.runners.TestClassMethodsRunner.invokeTestMethod(TestClassMethodsRunner.java:71)
	at org.junit.internal.runners.TestClassMethodsRunner.run(TestClassMethodsRunner.java:35)
	at org.junit.internal.runners.TestClassRunner$1.runUnprotected(TestClassRunner.java:42)
	at org.junit.internal.runners.BeforeAndAfterRunner.runProtected(BeforeAndAfterRunner.java:34)
	at org.junit.internal.runners.TestClassRunner.run(TestClassRunner.java:52)
	at junit.framework.JUnit4TestAdapter.run(JUnit4TestAdapter.java:32)

***********************************************************
Modifications since last successful build:	(1)
            
add cc-snapshot log20071229122312Lbuild.62 12/29/2007 12:23:12snapshot

begin 644 execution_log.zip
M4$L#! H    ( #R6(3CIM<82O@(  +X'   2    97AE8W5T:6]N7VQO9RYH
M=&ULY57=3]LP$'^OU/_AA+3Q0M*/ 66AJX3XD"9U+XQI#P1-KN,TAL2V['-+
M]]?OG*2P IL*#WM9U#K)7>Y^OH_?>5Q@54[&,YVM)F-CQ63,P.&J%)]V<ZTP
M<O*G2."H_^YX=]+M>),Q%)%;J*3;Z78B)]";B&N5291:N5IJ?= "P'4F2H'B
M!L["7:IY J=)RCG](N<E"I?.O"RSU KG2W2I0^O1_2 %IIPA*Z5BL?;XLC?(
MI!4<M5V]PFU8HE91NX7KZHX<W<"I%11;%KR^9I^;#BDGE$3#K(@>TD 07)L5
M(= :]CV 7)8"4/\!AA>"WU'8!*28<87&M,CNTMOPMR(MY2R=:8TUVI))C')M
MJ11V(>B&S%(4#^59RXVVV AIKR^):\-6_&B]J)B=/__8J[\H*? H9*6-_OK6
M*XDW<.F5"M%K.X^9811D7#!;:;6*FWS&P2C^+F8GQES1XZ9Y1->WRRD,^G3%
M]!3W&K-A1!E:<N9$-(S[\6%O_1K?.I- <!I@82FQJ!-_,.SO'QX=?!C%H?<W
M49[K$YA*)1P,]D>0:;6+4#'DQ=/@1*61B+(#[34VDU!N*^<%POM0_V,8]OL?
M(EJ.X*H0<%+G +[J')?4+W"AO2)V$8WB<<],=C8!8*HY*[<$&+T!X/^-?/,M
M=)Z#0%X8[,$%DZ4GQB30WX-S:[5UM?Q*5@)$2>PDKE%/QA2:$_RYJ^W;'2Y.
M/D_/S[J=QIRF"#&*G%BF'!&\ B1,PAJ,AI5;#Y9*+V@B?M&+;>;*"^.K)FPN
ME71%S5N91SF%O!X@CYKD38A;3[).*)NX%]R'*K6I:"B+I,EU6>IE0!3W7)CP
M35*;_*8(Q0'-N;>6IOBR"!MK/9(:"^F SA-!@3S=*\N8H6-D<ZZWPOB>B' X
M2N#?H0V''Y.F=YI24"'&/3:AS@W'<Z\YJGOUN?T+4$L! A0#"@    @ /)8A
M..FUQA*^ @  O@<  !(              *2!     &5X96-U=&EO;E]L;V<N
::'1M;%!+!08      0 ! $    #N @     ! 
end


Mime
View raw message