harmony-alerts mailing list archives

Site index · List index
Message view « Date » · « Thread »
Top « Date » · « Thread »
From nom...@intel.com
Subject [build-test alert] FAILED Windows 2003 x86_64: JettyScenario
Date Fri, 28 Dec 2007 08:44:44 GMT
Jetty server JRE:

Apache Harmony Launcher : (c) Copyright 1991, 2007 The Apache Software Foundation or its licensors,
as applicable.
java version "1.5.0" 
pre-alpha : not complete or compatible
svn = r606926, (Dec 27 2007), Windows/em64t/msvc 1400, release build
http://harmony.apache.org


Scenario framework JRE:

Apache Harmony Launcher : (c) Copyright 1991, 2007 The Apache Software Foundation or its licensors,
as applicable.
java version "1.5.0" 
pre-alpha : not complete or compatible
svn = r606926, (Dec 27 2007), Windows/em64t/msvc 1400, release build
http://harmony.apache.org


================================================================================
Scenario results:

Testsuite: org.apache.harmony.test.jetty.JettyScenario
Tests run: 5, Failures: 0, Errors: 0, Time elapsed: 4.187 sec
------------- Standard Output ---------------
Setup completed.

==============================================================testInitialPage===
Starting initial page test case.
Loading page from server: http://localhost:7070/test/
Getting resource with name: initial_page.html
Found resource: C:\cc\cc-suites\build\checkouts\JettyScenario/resources\JettyScenario\initial_page.html
Saving content of downloaded page to: C:\cc\cc-suites\build\results\JettyScenario\JettyScenario\initial_page.html
Comparing page content with etalon: initial_page.html
Page is equal to etalon.
Initial page test case passed.

============================================================testStaticContent===
Starting static content page test case.
Loading page from server: http://localhost:7070/test/data.txt
Getting resource with name: static_content.txt
Found resource: C:\cc\cc-suites\build\checkouts\JettyScenario/resources\JettyScenario\static_content.txt
Saving content of downloaded page to: C:\cc\cc-suites\build\results\JettyScenario\JettyScenario\static_content.txt
Comparing page content with etalon: static_content.txt
Page is equal to etalon.
Static content page test case passed.

=======================================================testSessionDumpServlet===
Starting servlet test case.
Loading page from server: http://localhost:7070/test/session/
Getting resource with name: session_dump.html
Found resource: C:\cc\cc-suites\build\checkouts\JettyScenario/resources\JettyScenario\session_dump.html
Saving content of downloaded page to: C:\cc\cc-suites\build\results\JettyScenario\JettyScenario\session_dump.html
Comparing page content with etalon: session_dump.html
Page is equal to etalon.
Session dump servlet page is OK.
Getting resource with name: session_dump_new.html
Found resource: C:\cc\cc-suites\build\checkouts\JettyScenario/resources\JettyScenario\session_dump_new.html
Saving content of downloaded page to: C:\cc\cc-suites\build\results\JettyScenario\JettyScenario\session_dump_new.html
Comparing page content with etalon: session_dump_new.html
Page is equal to etalon.
Session create page is OK.
Getting resource with name: session_dump_set.html
Found resource: C:\cc\cc-suites\build\checkouts\JettyScenario/resources\JettyScenario\session_dump_set.html
Saving content of downloaded page to: C:\cc\cc-suites\build\results\JettyScenario\JettyScenario\session_dump_set.html
Comparing page content with etalon: session_dump_set.html
Page is equal to etalon.
Session set page is OK.
Getting resource with name: session_dump_remove.html
Found resource: C:\cc\cc-suites\build\checkouts\JettyScenario/resources\JettyScenario\session_dump_remove.html
Saving content of downloaded page to: C:\cc\cc-suites\build\results\JettyScenario\JettyScenario\session_dump_remove.html
Comparing page content with etalon: session_dump_remove.html
Page is equal to etalon.
Session remove page is OK.
Getting resource with name: session_dump_invalidate.html
Found resource: C:\cc\cc-suites\build\checkouts\JettyScenario/resources\JettyScenario\session_dump_invalidate.html
Saving content of downloaded page to: C:\cc\cc-suites\build\results\JettyScenario\JettyScenario\session_dump_invalidate.html
Comparing page content with etalon: session_dump_invalidate.html
Page is equal to etalon.
Session invalidate page is OK.
Servlet test case passed.

===========================================================testRequestDumpJSP===
Starting JSP test case.
Loading page from server: http://localhost:7070/test/snoop.jsp
Getting resource with name: request_dump_JSP.html
Found resource: C:\cc\cc-suites\build\checkouts\JettyScenario/resources\JettyScenario\request_dump_JSP.html
Saving content of downloaded page to: C:\cc\cc-suites\build\results\JettyScenario\JettyScenario\request_dump_JSP.html
Comparing page content with etalon: request_dump_JSP.html
Page is equal to etalon.
JSP test case passed.

=====================================================testGZippedStaticContent===
Starting gzipped static content test case.
Loading page from server: http://localhost:7070/test/data.txt.gz
Unpacking content from archive.
Getting resource with name: static_content_ungzipped.txt
Found resource: C:\cc\cc-suites\build\checkouts\JettyScenario/resources\JettyScenario\static_content_ungzipped.txt
Saving content of downloaded page to: C:\cc\cc-suites\build\results\JettyScenario\JettyScenario\static_content_ungzipped.txt
Comparing page content with etalon: static_content_ungzipped.txt
Page is equal to etalon.
Gzipped static content test case passed.
------------- ---------------- ---------------

Testcase: testInitialPage took 1.219 sec
Testcase: testStaticContent took 0.25 sec
Testcase: testSessionDumpServlet took 0.39 sec
Testcase: testRequestDumpJSP took 1.703 sec
Testcase: testGZippedStaticContent took 0.453 sec

================================================================================
Jetty server output:

2007-12-27 13:33:57.061::INFO:  Logging to STDERR via org.mortbay.log.StdErrLog
2007-12-27 13:33:57.499::INFO:  Statistics on = false for SelectChannelConnector @ 0.0.0.0:7070
2007-12-27 13:33:57.577::INFO:  jetty-6.1.2rc1
2007-12-27 13:33:57.655::INFO:  Deploy C:\cc\cc-suites\build\libs\jetty-6.1.2rc1\contexts\javadoc.xml
-> org.mortbay.jetty.servlet.Context@14d2bd2{/javadoc,file:/C:/cc/cc-suites/build/libs/jetty-6.1.2rc1/javadoc/}
2007-12-27 13:33:57.717::INFO:  Deploy C:\cc\cc-suites\build\libs\jetty-6.1.2rc1\contexts\test.xml
-> org.mortbay.jetty.webapp.WebAppContext@14f663a{/test,C:\cc\cc-suites\build\libs\jetty-6.1.2rc1/webapps/test}
2007-12-27 13:34:01.483::WARN:  Unknown realm: Test JAAS Realm
2007-12-27 13:34:03.936::INFO:  Started SelectChannelConnector @ 0.0.0.0:7070

================================================================================

BUILD FAILED:
	Ant Error Message:
C:\cc\cc-suites\scripts\cc-exec-adaptor.xml:104: The following error occurred while executing
this line: C:\cc\cc-suites\adaptors\JettyScenario\adaptor.xml:133: Jetty server startup timeout
exceeded

Date of build:	2007-12-28 11:39:26 +0300
Time to build:	5 minutes 12 seconds
Last changed:	12/28/2007 11:39:15
Last log entry:	snapshot

***********************************************************
Errors/Warnings:	(2)
            
The execution FAILED with the following exception:
The following error occurred while executing this line:
C:\cc\cc-suites\adaptors\JettyScenario\adaptor.xml:133: Jetty server startup timeout exceeded

***********************************************************
Unit Tests: (5)
        
All Tests Passed

***********************************************************
Modifications since last successful build:	(1)
            
add cc-snapshot log20071228113915Lbuild.61 12/28/2007 11:39:15snapshot

begin 644 execution_log.zip
M4$L#! H    ( )1=G#>WHH8%40$  "H"   2    97AE8W5T:6]N7VQO9RYH
M=&UL75)-;\(P#+U7ZG_P9>+4%H2TH:Q40F.3AG:"W58.(34T*#15XA38KU]2
MA@18^5!B^R7OV7E-!U7D&UV=B[PU6.0<+)T53@=;W5!BY2\RF R?7@=%'+FV
MXH2)[1H61Q#L!T\HUC C,-A)*W4#S\.7T622QE$<)4(?6JDPD=ND0:RP8N':
MN)M\4>LU3&\-9A5O21O8^KE HO-*8,.-U R6KH$T[9-_*E1(N(9YV&6S8_#&
M2B'\2*R3A+;<.*FJTJ!UBFQY!U7NPRE5>G?_DQ5Q$\ N#X-%TZ&YANQYQ]>P
M\"LL>U &R2B.HN\:(0CA* CP,?O\>I_#45(-Y#U;K90^!DP\"6Q##.M3;AS&
M>*Y:"&<,5G"LO6A71.^F6EI0LD$OVR-'?A'KD=[_=7HZ*#8:C]D='U]BS]*U
M0/* VE'_L5 >7YP\XT6>]:V07=HBZWOD#U!+ 0(4 PH    ( )1=G#>WHH8%
M40$  "H"   2              "D@0    !E>&5C=71I;VY?;&]G+FAT;6Q0
52P4&      $  0!     @0$      
end


Mime
View raw message