harmony-alerts mailing list archives

Site index · List index
Message view « Date » · « Thread »
Top « Date » · « Thread »
From nom...@intel.com
Subject [build-test alert] FAILED Windows 2003 x86: stress
Date Fri, 28 Dec 2007 04:31:06 GMT
svn.revision=606926
BUILD FAILED:
	Ant Error Message:
C:\cc\cc-suites\scripts\cc-exec-adaptor.xml:104: The following error occurred while executing
this line: C:\cc\cc-suites\adaptors\stress\adaptor.xml:93: The following error occurred while
executing this line: C:\cc\cc-suites\adaptors\stress\adaptor.xml:109: The following error
occurred while executing this line: C:\cc\cc-suites\scripts\framework.xml:1079: Java returned:
1

Date of build:	2007-12-28 09:33:05 +0600
Time to build:	57 minutes 54 seconds
Last changed:	12/27/2007 13:52:40
Last log entry:	snapshot

***********************************************************
Errors/Warnings:	(4)
            
BUILD FAILED
C:\cc\cc-suites\tests\stress\qa\build.xml:170: Java returned: -1
Total time: 57 minutes 51 seconds
The execution FAILED with the following exception:
The following error occurred while executing this line:
C:\cc\cc-suites\adaptors\stress\adaptor.xml:93: The following error occurred while executing
this line:
C:\cc\cc-suites\adaptors\stress\adaptor.xml:109: The following error occurred while executing
this line:
C:\cc\cc-suites\scripts\framework.xml:1079: Java returned: 1

***********************************************************
Unit Tests: (182)
        
failure: test stress.org.apache.harmony.test.stress.gc.frag.FragmentationFinalizer.FragmentationFinalizerWaitTest
failure: test stress.org.apache.harmony.test.stress.jpda.jdwp.scenario.EVENT014.EventTest014
failure: test stress.org.apache.harmony.test.stress.jpda.jdwp.scenario.FRAME001.FrameTest001
failure: test stress.org.apache.harmony.test.stress.jpda.jdwp.scenario.FRAME002.FrameTest002
failure: test stress.org.apache.harmony.test.stress.jpda.jdwp.scenario.FRAME003.FrameTest003
Unit Test Error Details:	(5)
                
Test: testClass: stress.org.apache.harmony.test.stress.gc.frag.FragmentationFinalizer.FragmentationFinalizerWaitTestjava
version "1.5.0" 
pre-alpha : not complete or compatible
svn = r606926, (Dec 27 2007), Windows/ia32/msvc 1310, release build
http://harmony.apache.org

[concurrent] Starting org.apache.harmony.test.stress.gc.frag.FragmentationFinalizerWaitTest
org.apache.harmony.test.stress.gc.frag.FragmentationFinalizerWaitTest
test() - [112102.099427ms,98.64069037139416%]
java.lang.AssertionError: Expected 14760, but got 12248
total: 1, failures:1 (RED) - 112333.180527ms
1)
Apache Harmony Launcher : (c) Copyright 1991, 2007 The Apache Software Foundation or its licensors,
as applicable.
[debug] total = 268435456, used = 1780284, ratio = 13, sizes = 1 - 2097152
Test: testClass: stress.org.apache.harmony.test.stress.jpda.jdwp.scenario.EVENT014.EventTest014java
version "1.5.0" 
pre-alpha : not complete or compatible
svn = r606926, (Dec 27 2007), Windows/ia32/msvc 1310, release build
http://harmony.apache.org

10:23:38| Test: class org.apache.harmony.test.stress.jpda.jdwp.scenario.EVENT014.EventTest014
		test case(s) to run 1
10:23:38| Launching as a server listening on: NSTDRLXW5:1789
10:23:38| Launching: C:\cc\cc-suites\build\checkouts\snapshot\hdk\jdk\jre/bin/java -cp "C:/cc/cc-suites/build/classes/stress/classes;C:/cc/cc-suites/build/results/stress/temp;C:\cc\cc-suites\build\classes\stress\classes;C:\cc\cc-suites\build\classes\stress\lib;C:\cc\cc-suites\build\classes\stress\tools\th.jar;C:\cc\cc-suites\tests\stress\classlib\trunk\depends\punit\trunk\punit.extension\lib\junit-4.3.1.jar;C:\cc\cc-suites\tests\stress\classlib\trunk\depends\punit\trunk\punit\p-unit-0.12.jar;C:\cc\cc-suites\tests\stress\classlib\trunk\depends\punit\trunk\punit.extension\p-unit-extension-0.12.jar;C:\cc\cc-suites\tests\stress\classlib\trunk\depen...
Test: testClass: stress.org.apache.harmony.test.stress.jpda.jdwp.scenario.FRAME001.FrameTest001java
version "1.5.0" 
pre-alpha : not complete or compatible
svn = r606926, (Dec 27 2007), Windows/ia32/msvc 1310, release build
http://harmony.apache.org

10:23:44| Test: class org.apache.harmony.test.stress.jpda.jdwp.scenario.FRAME001.FrameTest001
		test case(s) to run 1
10:23:44| Launching as a server listening on: NSTDRLXW5:1791
10:23:44| Launching: C:\cc\cc-suites\build\checkouts\snapshot\hdk\jdk\jre/bin/java -cp "C:/cc/cc-suites/build/classes/stress/classes;C:/cc/cc-suites/build/results/stress/temp;C:\cc\cc-suites\build\classes\stress\classes;C:\cc\cc-suites\build\classes\stress\lib;C:\cc\cc-suites\build\classes\stress\tools\th.jar;C:\cc\cc-suites\tests\stress\classlib\trunk\depends\punit\trunk\punit.extension\lib\junit-4.3.1.jar;C:\cc\cc-suites\tests\stress\classlib\trunk\depends\punit\trunk\punit\p-unit-0.12.jar;C:\cc\cc-suites\tests\stress\classlib\trunk\depends\punit\trunk\punit.extension\p-unit-extension-0.12.jar;C:\cc\cc-suites\tests\stress\classlib\trunk\depen...
Test: testClass: stress.org.apache.harmony.test.stress.jpda.jdwp.scenario.FRAME002.FrameTest002java
version "1.5.0" 
pre-alpha : not complete or compatible
svn = r606926, (Dec 27 2007), Windows/ia32/msvc 1310, release build
http://harmony.apache.org

10:23:48| Test: class org.apache.harmony.test.stress.jpda.jdwp.scenario.FRAME002.FrameTest002
		test case(s) to run 1
10:23:48| Launching as a server listening on: NSTDRLXW5:1793
10:23:48| Launching: C:\cc\cc-suites\build\checkouts\snapshot\hdk\jdk\jre/bin/java -cp "C:/cc/cc-suites/build/classes/stress/classes;C:/cc/cc-suites/build/results/stress/temp;C:\cc\cc-suites\build\classes\stress\classes;C:\cc\cc-suites\build\classes\stress\lib;C:\cc\cc-suites\build\classes\stress\tools\th.jar;C:\cc\cc-suites\tests\stress\classlib\trunk\depends\punit\trunk\punit.extension\lib\junit-4.3.1.jar;C:\cc\cc-suites\tests\stress\classlib\trunk\depends\punit\trunk\punit\p-unit-0.12.jar;C:\cc\cc-suites\tests\stress\classlib\trunk\depends\punit\trunk\punit.extension\p-unit-extension-0.12.jar;C:\cc\cc-suites\tests\stress\classlib\trunk\depen...
Test: testClass: stress.org.apache.harmony.test.stress.jpda.jdwp.scenario.FRAME003.FrameTest003java
version "1.5.0" 
pre-alpha : not complete or compatible
svn = r606926, (Dec 27 2007), Windows/ia32/msvc 1310, release build
http://harmony.apache.org

10:23:52| Test: class org.apache.harmony.test.stress.jpda.jdwp.scenario.FRAME003.FrameTest003
		test case(s) to run 1
10:23:52| Launching as a server listening on: NSTDRLXW5:1795
10:23:52| Launching: C:\cc\cc-suites\build\checkouts\snapshot\hdk\jdk\jre/bin/java -cp "C:/cc/cc-suites/build/classes/stress/classes;C:/cc/cc-suites/build/results/stress/temp;C:\cc\cc-suites\build\classes\stress\classes;C:\cc\cc-suites\build\classes\stress\lib;C:\cc\cc-suites\build\classes\stress\tools\th.jar;C:\cc\cc-suites\tests\stress\classlib\trunk\depends\punit\trunk\punit.extension\lib\junit-4.3.1.jar;C:\cc\cc-suites\tests\stress\classlib\trunk\depends\punit\trunk\punit\p-unit-0.12.jar;C:\cc\cc-suites\tests\stress\classlib\trunk\depends\punit\trunk\punit.extension\p-unit-extension-0.12.jar;C:\cc\cc-suites\tests\stress\classlib\trunk\depen...

***********************************************************
Modifications since last successful build:	(1)
            
add cc-snapshot log20071227135240Lbuild.58 12/27/2007 13:52:40snapshot

begin 644 execution_log.zip
M4$L#! H    ( .%3G#?STD=0D0L  +>5   2    97AE8W5T:6]N7VQO9RYH
M=&ULU9W]4]LX&L=_AIG^#YJ=NX'.E#A.R)N/[0P+8=HN+QU"E[LY.HRPE43%
MD5Q))F1O[G\_28E#'.PT]-K5$P:(+<O2QU\]>JR76#X8JE'\]N".1Y.W!XD@
M;P\PDFH2DU]W^IRI/4G_) %J5__^CYVWK[;3),**[,D'%KS:?K4MB4H3NR52
M$X(0^G=$8J+(9W1L/BD;(+_=07T:$XGZ@H_047 3AOIW3Z94$7ESE](XNA%$
MIK&2-U+I+6E3TFE]P0_X,_K-Q# I!,A&KCR.XGR,_%XX).%])>2L3P=!_M!T
MFX1#_AD=V0BIP(IR%J#L9TS9+<7UVNU(/H3E9_]Q-H5!?_O/PVB6V7\#%)&[
M=%!^UA61BD3H@SZ M&2*CHA.0-G0RBQ I[*DD6=S\NQU\51)3S*<R"%7WC"Z
M][Z8/T&\.\H\DV.%/))"@D<2?D:'"=;IH'=8C#B;H%.<,KTO4(!VP]=:DV0B
MZ&"HD-_I^&]0K5IMH2L=?W9:C_?5& N"3GC*(JL<X@)1)5%,0\(D%_(-PA+A
M)-$!^"XFE7(6$X(>B) FF5_\2J-2_0651]?6N8?C9(@U+.,*A7R4&%LS!&9;
MX^C\RL_75HM^1:)9;79JS3=H]YB$J-:RU_CZ#;JF+.)CZ9FR]TS9([_N5]\@
MH>T82S(M[?+$ATHE@><-I[I6L-6KPL4*8]!EP+2QHW#1$&U5T38QG!ZLA/W!
M<X.X,1:359:;K]C3L<S?+6$/SVO'8I[=QS!.(Y+E\M58BPVIQ%2J-7/*3C&)
MK*J(VJ K]OS"6CC=-L9EXJ#9!<_M@4I4K>BR:58;?A/MGN$)\IO6(INO5R2G
MDYKI&IQARK8TP^YK?5F":,>5ESI %[^_("6IL%"]"3L:8L9(;%+MF2 D)[H*
M"<ZTI]2^QQY$^@(2KH]U],]Z>1Q3<:)-D(BMOOXPJ6N#'B+%D218A$.KDC2R
M' 5>&'I/WL$>\*9%Y.DBDB*T8=YZ&4^W613KK F+NC$9$:8,@"D;K)2@=ZG6
M;L>Z?M[?"XV66K\=Q/M(9>6W8_Z?D_%1C*4\Y5A?B;]C</&=U.F92DI&B9K\
M""@RW44[AZD:<K$FR _+?GU-3@0>F#/M,9.H7ZWMNU&E' 6"+DTHJC2!:#+4
MD2);3$T(RBSCN-:G:_+7_A+'VNL*DP4 E4J@7&LU)[HD#_2!@*ENY5Q@% /D
MLHN98"D%P545$0%3Z1:D22U@0=.KV6C4 =K6 A<TQ=I^IP90L#D6*+UJ#7#&
ME2&!T@E6JP%B>^$:4P6D,5K,Y%HI,X!X2?I -%JF :0.D"9"$9%KE:X)OH=C
M0\LT+V!8'* TX1*-B2!(ZMQ#12(S/HEV%5<X1GZ[MN:HYS&5"59F3-\D?<I#
M;(<J.T&]KG_19<I0; (K]BPSOF@&L'4A!":3]?+H*2[()9&'\L.G+1Q%V06@
M,99FU!?-!B.Y&'C3D?!L8'PZ,#D[C!-J9RP\RK,@,\Q A/2.=/Q#(?#DT@8L
M[U\+JHCHV7-LQFCWXV&OUSU>4Z2??P$?:4*B&?S"-GQPS4;98$:^N ,-/<9L
MH*G[7N]6US]=<5AHQQ!NJWY!$"#:F4]=)BX*ADU=*PEV1!V: ?_8#OA[9_1Q
M.F:I70EG4F&F/G(>V_A''T]'RI6T+X($IN0))7$D-9>-/-\#)F4))3 M3[$8
M$#M%=8Y'Q)Z1#[J]!*;K&L0;I_'UQFE\#4SC,\PFEFXV$;VP#TS;%:30-"6Z
MTQ$=BL$,=+X+3=$R3I!ZFNJ3W15R(2!5+:4%IFTO3=XSU9_7J-D^,$U+*#=#
MR_I&4.[#HKP2A"QZ^X5]8+:Y@A28?5X+S@:+J.?=(_,%*V""EF%"5_-Z(\2\
MWB M@7G.$DH(GO.<FZ^VAL/5XQ$ 03>D'_T=V"^N8N4C_^V@]FS@WTXUC###
M Q*960#S! >J-S=((1"=]^_ AN [E[%7=(XATI9U/,&REG;G !(#[M*MB0JQ
MAJUHY@.D+6M#;P+J]8:10JA8%XQ,*3=EF/\EP"#NN$_ D.]>RY20[UM/K+WT
M;KGQ\A0$BA3V7>")$ZY3_28C!'>Z1E]Z0S AN,Y-[/#_]-Z^>V80_>]-['RO
MV_,&IR_P*?3UQ@C@J0I_>OHEO. L867K$!PM\(G+=5G!Z0IY\G(M4/B*?F?[
MNW3>8K\>U#OK35RT_MHG%UZJR::4'80)TW4X74V9DL>0).:I'XT\-5FOIW!X
M_XF-*8LH&YB;R\7=%Q(J^XR$7'W8E5G\X,L 6QI%[":L[0AX$'I]@0=>[@$R
M[]D:-.9).]B$3<A\"VO50**</Y";#WZ^:,P&0!<NW;))W!"KV5K,FV#21>N*
M;""V7=UC [G-(AN;AEUK;)S2F^7PLE4@-//)X?M3$,SSYT;SP0MK#D!2^-NT
MT/Q<"?'"B@7N:$=DY)V1$1<3<W[=;-L-*$3-C,BA7S)$O1&.8[,(]]/6.;&=
M&%<#5]\$<WCS60WFV+C*P1QZC=5@#7!@,"T?IMG#M'G'!I_HL\U D<&9CF&]
MPW'_HPUU;%S/T2!A7=%LT.__%*QDO-^O!K5JT*BN-^#O5]O.=7!?.E\8]; 8
MI*9M)[W#;,MATVY*)/#$X)@/]_(LPU0AT;BZ:Q3"N+K=%\*X:G@7PG0<PEA?
M*$A?>M97ZJZ;17(UB6&0I)E2F4ZLN*[?RR@N*]0RBZO&5Q&+JR97 0L@60"I
MXM+Y+J&X=+U+*"X=K[2K'V9+(CIOR13@N'5VSW#<5NQG.&YKU#,<M[7J&4X+
M%HZSYDP28>]+-$X\&1*&!>5>]X_N^56UZGO=!]V;,FE6G2W%68Y76\1SY@A*
M\3J+>,Z\>!F>O[^ 9]M&+F;%"O!.+@_/NL;V3@0>D2?;@X576\2K@<.K+^+5
MX>"==<\N+O]E2O=IH@F4:\D :SE 0,XE ZSG )VU.\H!]W. +^YFK!@CW0_\
MUIICI/O[4.1HY.1PUC K!VSF )TUU<H!6SE 9XVW L#W_^P>6Y]&'TD$SZ5-
M\6J+>( <VL5O'[I'5\9?3.<4OM-?_'S 1@X04 W. )LY0$ U. -LY0 !U> ,
ML)T#!-0ARP [.4! G8JK=Y?=0^L$G[Y]#LH+9H"U'" @/Y@!UG. @!IV&>!^
M#A"0H\X &SE 0(XZ VSF  $YZ@RPE0,$Y*@SP'8.$)"CS@ [.4!XCMJO+@*Z
M^T9 .6#N3N+#NY/XN3N)LUG7$96A=X3CV*SL8,]WR&$GK2X>B.C'?.P<9L+"
M2Q*F0LZ>V7,)8YX^..>*]B<.252V'H3=?<\4$2)-;&/28_SBXJRK/WH7W:((
MSMIR:T"/J1J68;NJEWGL#YQ:$_3"(::L2.PL!A"=BX'S0L^1@6D<3U_=MTID
M5XW"M8A+5';53LPS]V)"DC*/,3\(Q(J?P>:E?<*%8<&]5":$1:7J/AU^N;XK
MQM-;0:.]YGAZN^I0GMF2&'[-"E00!J(0\W?ZHG+,QP!258JQ\_5E"?S%E:;D
M=;_6M"Y^+T]#V;CV/<!;^VV_/")"B5DH)=KR6ZU5L?J8QCI68U4<W8;@8FMK
MA<$C).]IDNB$:IW.JF@INV=\S%:E=<P9J: >(?8MRZ80!4FX4(@R&Q)104)=
M[BM>K+QU%'AAJ'_W9$JU9-Y=2N/(TP67QDK.2GUU0<G9JY!U@QDI.B+!5K4:
M-%I!K8$PBU"MW1JM2L&^J-F>AQHM-*(LU1AHOX,D"3F+ED[-[_WVZ?WI,9I.
M4^>/' 4W87@SOZP;:PTWT\NY^8IO[&56'D=QX+>J ?J@3]+BJ53;7!2@/7]5
MKB7(#?\)>=N^#GLNRY00F8IA"Z;/8]W7H6R YHNQ!/:4A0/&DA /=5=$:&<Z
M'FKCRU+4A]602A131H)7V\O7BB.<Z%*?7^YLWUYMIQZ@OR0CO]KY@3G)4-!$
M%V#??$%AS,7]+(]6YUG9^=NOM@\\_/; 2P31_^]X--$?0S6*W_X/4$L! A0#
M"@    @ X5.<-_/21U"1"P  MY4  !(              *2!     &5X96-U
C=&EO;E]L;V<N:'1M;%!+!08      0 ! $    #!"P     ! 
end


Mime
View raw message