harmony-alerts mailing list archives

Site index · List index
Message view « Date » · « Thread »
Top « Date » · « Thread »
From nom...@intel.com
Subject [build-test alert] FAILED Linux x86_64: struts_test
Date Thu, 27 Dec 2007 17:10:09 GMT
svn.revision=606926
BUILD FAILED:
	Ant Error Message:
/export/users/cc/cc-suites/scripts/cc-exec-adaptor.xml:104: The following error occurred while
executing this line: /export/users/cc/cc-suites/adaptors/struts_test/adaptor.xml:64: The following
error occurred while executing this line: /export/users/cc/cc-suites/adaptors/struts_test/adaptor.xml:285:
The following error occurred while executing this line: /export/users/cc/cc-suites/adaptors/struts_test/adaptor.xml:421:
Java returned: 1

Date of build:	2007-12-27 23:10:01 +0600
Time to build:	2 seconds
Last changed:	12/27/2007 18:52:22
Last log entry:	snapshot

***********************************************************
Errors/Warnings:	(1)
            
The execution FAILED with the following exception:
The following error occurred while executing this line:
/export/users/cc/cc-suites/adaptors/struts_test/adaptor.xml:64: The following error occurred
while executing this line:
/export/users/cc/cc-suites/adaptors/struts_test/adaptor.xml:285: The following error occurred
while executing this line:
/export/users/cc/cc-suites/adaptors/struts_test/adaptor.xml:421: Java returned: 1

***********************************************************
Unit Tests: (0)
        
No Tests Run: This project doesn't have any tests

***********************************************************
Modifications since last successful build:	(1)
            
add cc-snapshot log20071227185222Lbuild.62 12/27/2007 18:52:22snapshot

begin 644 execution_log.zip
M4$L#! H    ( $*YFS?!@*-2AP$  /<#   2    97AE8W5T:6]N7VQO9RYH
M=&ULQ5--BQ0Q$+WWKZB+["D;9UEE:=L&<144C]Z613))C1TGTQ4JE?GPUUN9
MG0$716$O"YTT72_]7NH]:IADD\9A2>$P#IEQ'!P4.21\>[&B64R)/[&'FY<O
MWER,7<W!"9JRG?NN,P6E9N-I#E$BS45K7!4!@+N "07OX;:]X_R]!XO[3"RV
M%N1BO=?'E!H%BUW6F()E+#5)L46X2OFF@%COQ*4XNTNJ\E=>")'1"_'A:0)M
M,R>@"<#=9JV4]_">45L-C?^)=W]$W1GU-CM&<[9(I3SE@RKIWCI9P"HF!*'_
MR_D)_5HM4<'9Y3*1V"FL[8^V&&V*2[LDDH>,=/$6V33*%IM>Z<]B$<?G8OO>
MN2AF17P^=\0Q*/1U0L ]^MHRAX_O/GWY< N[*!.((BM*B7:M'=Q[S.U,?_SE
M-X"9&,C[RJP&[Z;6]8E189EB <T<^^X?/KC@LJ;^V/%3\7*_2?WKZQZ>0_?J
MYM7S"%]?+7KX[+8.6.>29PT+%MU@W3C8XUS;AQFWQX'_!5!+ 0(4 PH    (
M $*YFS?!@*-2AP$  /<#   2              "D@0    !E>&5C=71I;VY?
>;&]G+FAT;6Q02P4&      $  0!     MP$      
end


Mime
View raw message