harmony-alerts mailing list archives

Site index · List index
Message view « Date » · « Thread »
Top « Date » · « Thread »
From nom...@intel.com
Subject [build-test alert] FAILED Linux x86_64: tomcat-scenario
Date Thu, 27 Dec 2007 17:09:57 GMT
svn.revision=606926
BUILD FAILED:
	Ant Error Message:
/export/users/cc/cc-suites/scripts/cc-exec-adaptor.xml:104: The following error occurred while
executing this line: /export/users/cc/cc-suites/adaptors/tomcat-scenario/adaptor.xml:100:
Tomcat server startup timeout exceeded

Date of build:	2007-12-27 23:04:50 +0600
Time to build:	5 minutes 1 second
Last changed:	12/27/2007 18:52:22
Last log entry:	snapshot

***********************************************************
Errors/Warnings:	(1)
            
The execution FAILED with the following exception:
The following error occurred while executing this line:
/export/users/cc/cc-suites/adaptors/tomcat-scenario/adaptor.xml:100: Tomcat server startup
timeout exceeded

***********************************************************
Unit Tests: (0)
        
No Tests Run: This project doesn't have any tests

***********************************************************
Modifications since last successful build:	(1)
            
add cc-snapshot log20071227185222Lbuild.62 12/27/2007 18:52:22snapshot

begin 644 execution_log.zip
M4$L#! H    ( #NYFS> \,-&*P$  $P"   2    97AE8W5T:6]N7VQO9RYH
M=&ULK5+!2L0P$+WW*^8B>VK3!16IM2"L@N!Q;R*23:;;2-J$R63;]>M-ZPJ"
ML%Z$@3F\F?<>CU=WW-NFWCE];&I/V-02 A\MWJU:-W >S =6<%->W*Z:+'HM
M&?-P&*HL4Q9EV@#PHM$BXRMLYFV&?04")^^(10Q(02B5)@_1, :QB\9J01BB
MY2#8]4HF&86#)..$&31.13+UW\3OP;^=888K:(W% "VY_F\5:W9!2"]5A_E)
MZ;HHB_6EL&X?LHSB'-&V0\ )563C!GB\?WI^V,!HN -.2.NL=>.LC9-"/]]4
MR\L/@,@1.*4B$6H8NV3QFS'!W)D U@Q896<<2RT]._H=R0DHIMY6Z[*L8+L<
M0*(X(*4:2.+H@4V/+O+B$C7JK!:RJ<52%O%5'+&TZ!-02P$"% ,*    "  [
MN9LW@/##1BL!  !, @  $@              I($     97AE8W5T:6]N7VQO
<9RYH=&UL4$L%!@     !  $ 0    %L!      $! 
end


Mime
View raw message