harmony-alerts mailing list archives

Site index · List index
Message view « Date » · « Thread »
Top « Date » · « Thread »
From nom...@intel.com
Subject [build-test alert] FAILED Linux x86_64: ehwa
Date Thu, 27 Dec 2007 17:00:32 GMT
svn.revision=606926
BUILD FAILED:
	Ant Error Message:
/export/users/cc/cc-suites/scripts/cc-exec-adaptor.xml:104: The following error occurred while
executing this line: /export/users/cc/cc-suites/adaptors/ehwa/adaptor.xml:82: The following
error occurred while executing this line: /export/users/cc/cc-suites/scripts/framework.xml:1079:
Java returned: 1

Date of build:	2007-12-27 22:54:13 +0600
Time to build:	6 minutes 15 seconds
Last changed:	12/27/2007 18:52:22
Last log entry:	snapshot

***********************************************************
Errors/Warnings:	(36)
            
[exec] Result: 25
[echo]
[echo]
[echo] ========================== EHWA.log =======================
[echo]
[echo] Eclipse Home = /export/users/cc/cc-suites/build/libs/eclipse-3.2.1-lnx-x86_64/eclipse
[echo] Tested JRE = /export/users/cc/cc-suites/build/checkouts/snapshot/hdk/jdk/jre
[echo] Tested JRE options for Eclipse launching =
[echo] Delay factor = 2
[echo]
[echo] --- Automated EHWA scenario for Eclipse 3.2.1 ---
[echo]
[echo] Start:
[echo]
[echo] Run Eclipse
[echo] Select workspace
[echo]  wait window 'Workspace Launcher' to appear ...
[echo] ERROR: Window 'Workspace Launcher' didn't appear for 360 sec!
[echo]
[echo] Kill Eclipse:
[echo] 	Eclipse process wasn't found
[echo]
[echo]
[echo] EHWA FAILED!
[echo]
[echo] ======================= eclipse.log =======================
[echo] Loading error /export/users/cc/cc-suites/build/checkouts/snapshot/hdk/jdk/jre/bin/default/libgc_gen.so:
undefined symbol: _Z23free_set_pool_put_entryP12Vector_BlockP11GC_Metadata
[echo] GC library cannot be loaded: libgc_gen.so
[echo] HMYEXEL062E Internal VM error: Failed to create Java VM
[echo] FAILED to invoke JVM.
[echo]
[echo] ===========================================================
BUILD FAILED
/export/users/cc/cc-suites/build/checkouts/ehwa/ehwa_run.xml:210: EHWA FAILED!
Total time: 6 minutes 13 seconds
The execution FAILED with the following exception:
The following error occurred while executing this line:
/export/users/cc/cc-suites/adaptors/ehwa/adaptor.xml:82: The following error occurred while
executing this line:
/export/users/cc/cc-suites/scripts/framework.xml:1079: Java returned: 1

***********************************************************
Unit Tests: (0)
        
No Tests Run: This project doesn't have any tests

***********************************************************
Modifications since last successful build:	(1)
            
add cc-snapshot log20071227185222Lbuild.62 12/27/2007 18:52:22snapshot

begin 644 execution_log.zip
M4$L#! H    (  ZXFS=0><_Z;00  '\2   2    97AE8W5T:6]N7VQO9RYH
M=&ULS5AM<^(V$/Y<?H7ZH9,OQ0;GCJ0NR4Q>N$NNR31#TZ1MYL8CY#7H$))'
MDGGIK^]*0 IW$4E([U(/,'BTVGV>U;[9[8$=B<-V3^6SPW:IX;!-B;$S 0<[
MA9*V;OC?D)+]Q@\_[QS6JC*G%NIF+--:35?X2]QU]XF.Z4=R7'&1%UR@/ PF
M-$.!:#H2:S)K-U]HF/\'-E ?2;U>)]U*DL[9[1$Q#"357!$EB1T *900:L)E
MGS E"]ZO-+4<UW!34.$U& LY^=#MD ,2P[14VL:5 6UBQO!3-Q6W8.*>HQ&S
M ;"AJJR)C:2E&2@;#_)A_,E]-3S%B"H=)(/&@M(=)GAI@)RI$3P%E. ]$\-\
M4WTW2J)F7<AI?;K?REIOE@M!:Z<@Z(P4E%FET5JRR?7;7>&C]NZ,:&45M^EC
M8M8[,4(_/RJZX/Q4N6B,GL53"8?=B0 J76 MSV8]P*(H"F[]C8Z!4-Q0SH@J
M @JL^H^..5[3&_4H&U;E ]@<'*2%OX[57I.X##7?&,==#@(L^!@$ZX#D7(,+
MQ-E7@1$KW;\_<V7Z_'\%B"D-$18_RT=?9.NK IO7]U>'%!FPSHX)IEH71FJ\
MFJ43I8>FI P>RM 7$?BW$;BF%M\;VEQ!2%7Z)DA<+7/F-E:.$PW4X])@*F'-
M"KZ'MMV-ABBPV(;=!F_2QXDL=,]I)(W&7C-)]K)FX^V;<$6S5-OU#AR4O4+:
M!GXD!N E6&)G+1*JCSU>DQPLY>+!.)@"PP;:[?[:3<DME[F:D)W;^RBXH)7$
MD],[Z)Q<[EA"RQ*H]DIW6PU$R;XGU)+(0\@6<9CY (U*00270)*D]>"9>=-=
M3R$ER=MP[RDUES8JD$(T F-H'\*-)[@07CD(7N3>BR&!Y^/XML/*:TUK+D"6
M3(4/(I>7&_SU^52UA6?=J'N$H]'(9_/ZP+N*QSO12S_?AD_E=(N-?@9?  AK
MQ\+*[$H5#D?SA'(4W)"P.)DLDG53R7Q9YC_?#;]P(99^V.#&[Y:N*K5BF/)(
MUS@0A:IDOH79,'\7)>^.SB\ZIQOH/+]XD.4LL%7QN% T=_D"6J.[7YBV<8_+
M.(>"8IUUU:3/LC[(R*B4H#.AP!*=$S,;]91(2?97LEMH@ QGAZQ42F1E93.0
M5L^NFLF-[Z;9L5!L>-5LOC_)+K&SX+!#@U3>GV 3Z&F*/9A1*94E/:P(R _R
ME*RB"6HXN_RS\T?GHM%*.N1<6M"2"G)S.7=.2MYA6T "&.[,]W'R 37@>E#?
M_+3=!B[':H@;;B[#";)-VWCT>O3Y8OYX\:2GB]49(-Q"CW\_OSA=4%];>.[@
MMOI*(DV:C70MA<( KI7%8W.C>DI:9,1EA29(<]<5$B5S4ZM=#X"XF:#R#WB+
M4YIP._CL505,&?@ND_HM*PL^6Q1CE=88$9.!<^%"(R[; 3=^($EK&TAC-)<8
MXPNVBSM/=C])R5<P:)CF)7JWT'0$KO)[8\W&WD_I/)0UV$I+ER[-6CNFA^W8
MOU^*Y^^:8O_BZ1]02P$"% ,*    "  .N)LW4'G/^FT$  !_$@  $@      
M        I($     97AE8W5T:6]N7VQO9RYH=&UL4$L%!@     !  $ 0   
' )T$      $! 
end


Mime
View raw message