harmony-alerts mailing list archives

Site index · List index
Message view « Date » · « Thread »
Top « Date » · « Thread »
From nom...@intel.com
Subject [build-test alert] FAILED Linux x86_64: drlvm-test
Date Thu, 27 Dec 2007 16:53:09 GMT
svn.revision=606926
BUILD FAILED:
	Ant Error Message:
/export/users/cc/cc-suites/scripts/cc-exec-adaptor.xml:104: The following error occurred while executing this line: /export/users/cc/cc-suites/adaptors/drlvm-test/adaptor.xml:76: There were drlvm-test failures

Date of build:	2007-12-27 20:46:21 +0600
Time to build:	126 minutes 39 seconds
Last changed:	12/27/2007 18:52:22
Last log entry:	snapshot

***********************************************************
Errors/Warnings:	(402)
            
[junit] Test Breakpoint1.Breakpoint1 FAILED
[junit] Test PopFrame1.PopFrame1 FAILED
[junit] Test SingleStep1.SingleStep1 FAILED
[junit] Test VMInit1.VMInit1 FAILED
[junit] Test Breakpoint1.Breakpoint1 FAILED
[junit] Test PopFrame1.PopFrame1 FAILED
[junit] Test SingleStep1.SingleStep1 FAILED
[junit] Test VMInit1.VMInit1 FAILED
[junit] Test Breakpoint1.Breakpoint1 FAILED
[junit] Test PopFrame1.PopFrame1 FAILED
[junit] Test SingleStep1.SingleStep1 FAILED
[junit] Test VMInit1.VMInit1 FAILED
[exec] Result: 139
[exec] Result: 139
[exec] Result: 139
[exec] Result: 139
[exec] Result: 139
[exec] Result: 139
[exec] Result: 139
[exec] Result: 139
[exec] Result: 143
[exec] Result: 143
[exec] Result: 143
[exec] Result: 139
[exec] Result: 139
[exec] Result: 139
[exec] Result: 143
[exec] Result: 139
[java] Java Result: 1
[java] Java Result: 1
[java] Java Result: 1
[java] Java Result: 1
[java] Java Result: 1
[java] Java Result: 1
[java] Java Result: 1
[java] Java Result: 1
[java] Java Result: 1
[java] Java Result: 1
[java] Java Result: 1
[java] Java Result: 1
[java] Java Result: 1
[java] Java Result: 1
[java] Java Result: 1
[java] Java Result: 1
[java] Java Result: 1
[java] Java Result: 1
[java] Java Result: 1
[java] Java Result: 1
[java] Java Result: 1
[java] Java Result: 1
[java] Java Result: 1
[java] Java Result: 1
[java] Java Result: 1
[java] Java Result: 1
[java] Java Result: 1
[java] Java Result: 1
[java] Java Result: 1
[java] Java Result: 1
[java] Java Result: 1
[java] Java Result: 1
[java] Java Result: 1
[java] Java Result: 1
[java] Java Result: 1
[java] Java Result: 1
[java] Java Result: 1
[java] Java Result: 1
[java] Java Result: 1
[java] Java Result: 1
[java] Java Result: 1
[java] Java Result: 1
[java] Java Result: 1
[java] Java Result: 1
[java] Java Result: 1
[java] Java Result: 1
[java] Java Result: 1
[java] Java Result: 1
[java] Java Result: 1
[java] Java Result: 1
[java] Java Result: 1
[java] Java Result: 1
[java] Java Result: 1
[java] Java Result: 1
[java] Java Result: 1
[java] Java Result: 1
[java] Java Result: 1
[java] Java Result: 1
[java] Java Result: 1
[java] Java Result: 1
[java] Java Result: 1
[java] Java Result: 1
[java] Java Result: 1
[java] Java Result: 1
[java] Java Result: 1
[java] Java Result: 1
[java] Java Result: 1
[java] Java Result: 1
[java] Java Result: 1
[java] Java Result: 1
[java] Java Result: 1
[java] Java Result: 1
[java] Java Result: 1
[java] Java Result: 1
[java] Java Result: 1
[java] Java Result: 1
[java] Java Result: 1
[java] Java Result: 1
[java] Java Result: 1
[java] Java Result: 1
[java] Java Result: 1
[java] Java Result: 1
[java] Java Result: 1
[java] Java Result: 1
[java] Java Result: 1
[java] Java Result: 1
[java] Java Result: 1
[java] Java Result: 1
[java] Java Result: 1
[java] Java Result: 1
[java] Java Result: 1
[java] Java Result: 1
[java] Java Result: 1
[java] Java Result: 1
[java] Java Result: 1
[java] Java Result: 1
[java] Java Result: 1
[java] Java Result: 1
[java] Java Result: 1
[java] Java Result: 1
[java] Java Result: 1
[java] Java Result: 1
[java] Java Result: 1
[java] Java Result: 1
[java] Java Result: 1
[java] Java Result: 1
[java] Java Result: 1
[java] Java Result: 1
[java] Java Result: 1
[java] Java Result: 1
[java] Java Result: 1
[java] Java Result: 1
[java] Java Result: 1
[java] Java Result: 1
[java] Java Result: 1
[java] Java Result: 1
[java] Java Result: 1
[java] Java Result: 1
[java] Java Result: 1
[java] Java Result: 1
[java] Java Result: 1
[java] Java Result: 1
[java] Java Result: 1
[java] Java Result: 1
[java] Java Result: 1
[java] Java Result: 1
[java] Java Result: 1
[java] Java Result: 1
[java] Java Result: 1
[java] Java Result: 1
[java] Java Result: 1
[java] Java Result: 1
[java] Java Result: 1
[java] Java Result: 1
[java] Java Result: 1
[java] Java Result: 1
[java] Java Result: 1
[java] Java Result: 1
[java] Java Result: 1
[java] Java Result: 1
[java] Java Result: 1
[java] Java Result: 1
[java] Java Result: 1
[java] Java Result: 1
[java] Java Result: 1
[java] Java Result: 1
[java] Java Result: 1
[java] Java Result: 1
[java] Java Result: 1
[java] Java Result: 1
[java] Java Result: 1
[java] Java Result: 1
[java] Java Result: 1
[java] Java Result: 1
[java] Java Result: 1
[java] Java Result: 1
[java] Java Result: 1
[java] Java Result: 1
[java] Java Result: 1
[java] Java Result: 1
[java] Java Result: 1
[java] Java Result: 1
[java] Java Result: 1
[java] Java Result: 1
[java] Java Result: 1
[java] Java Result: 1
[java] Java Result: 1
[java] Java Result: 1
[java] Java Result: 1
[java] Java Result: 1
[java] Java Result: 1
[java] Java Result: 1
[java] Java Result: 1
[java] Java Result: 1
[java] Java Result: 1
[java] Java Result: 1
[java] Java Result: 1
[java] Java Result: 1
[java] Java Result: 1
[java] Java Result: 1
[java] Java Result: 1
[java] Java Result: 1
[java] Java Result: 1
[java] Java Result: 1
[java] Java Result: 1
[java] Java Result: 1
[java] Java Result: 1
[java] Java Result: 1
[java] Java Result: 1
[java] Java Result: 1
[java] Java Result: 1
[java] Java Result: 1
[java] Java Result: 1
[java] Java Result: 1
[java] Java Result: 1
[java] Java Result: 1
[java] Java Result: 1
[java] Java Result: 1
[java] Java Result: 1
[java] Java Result: 1
[java] Java Result: 1
[java] Java Result: 1
[java] Java Result: 1
[java] Java Result: 1
[java] Java Result: 1
[java] Java Result: 1
[java] Java Result: 1
[java] Java Result: 1
[java] Java Result: 1
[java] Java Result: 1
[java] Java Result: 1
[java] Java Result: 1
[java] Java Result: 1
[java] Java Result: 1
[java] Java Result: 1
[java] Java Result: 1
[java] Java Result: 1
[java] Java Result: 1
[java] Java Result: 1
[java] Java Result: 1
[java] Java Result: 1
[java] Java Result: 1
[java] Java Result: 1
[java] Java Result: 1
[java] Java Result: 1
[java] Java Result: 1
[java] Java Result: 1
[java] Java Result: 1
[java] Java Result: 1
[java] Java Result: 1
[java] Java Result: 1
[java] Java Result: 1
[java] Java Result: 1
[java] Java Result: 1
[java] Java Result: 1
[java] Java Result: 1
[java] Java Result: 1
[java] Java Result: 1
[java] Java Result: 1
[java] Java Result: 1
[java] Java Result: 1
[java] Java Result: 1
[java] Java Result: 1
[java] Java Result: 1
[java] Java Result: 1
[java] Java Result: 1
[java] Java Result: 1
[java] Java Result: 1
[java] Java Result: 1
[java] Java Result: 1
[java] Java Result: 1
[java] Java Result: 1
[java] Java Result: 1
[java] Java Result: 1
[java] Java Result: 1
[java] Java Result: 1
[java] Java Result: 1
[java] Java Result: 1
[java] Java Result: 1
[java] Java Result: 1
[java] Java Result: 1
[java] Java Result: 1
[java] Java Result: 1
[java] Java Result: 1
[java] Java Result: 1
[java] Java Result: 1
[java] Java Result: 1
[java] Java Result: 1
[java] Java Result: 1
[java] Java Result: 1
[java] Java Result: 1
[java] Java Result: 1
[java] Java Result: 1
[java] Java Result: 1
[java] Java Result: 1
[java] Java Result: 1
[java] Java Result: 1
[java] Java Result: 1
[java] Java Result: 1
[java] Java Result: 1
[java] Java Result: 1
[java] Java Result: 1
[java] Java Result: 1
[java] Java Result: 1
[java] Java Result: 1
[java] Java Result: 1
[java] Java Result: 1
[java] Java Result: 1
[java] Java Result: 1
[java] Java Result: 1
[java] Java Result: 1
[java] Java Result: 1
[java] Java Result: 1
[java] Java Result: 1
[java] Java Result: 1
[java] Java Result: 1
[java] Java Result: 1
[java] Java Result: 1
[java] Java Result: 1
[java] Java Result: 1
[java] Java Result: 1
[java] Java Result: 1
[java] Java Result: 1
[java] Java Result: 1
[java] Java Result: 1
[java] Java Result: 1
[java] Java Result: 1
[java] Java Result: 1
[java] Java Result: 1
[java] Java Result: 1
[java] Java Result: 1
[java] Java Result: 1
[java] Java Result: 1
[java] Java Result: 1
[java] Java Result: 1
[java] Java Result: 1
[java] Java Result: 1
[java] Java Result: 1
[java] Java Result: 1
[java] Java Result: 1
[java] Java Result: 1
[java] Java Result: 1
[java] Java Result: 1
[java] Java Result: 1
[java] Java Result: 1
[java] Java Result: 1
[java] Java Result: 1
[java] Java Result: 1
[java] Java Result: 1
[java] Java Result: 1
[java] Java Result: 1
[java] Java Result: 1
[java] Java Result: 1
[java] Java Result: 1
[java] Java Result: 1
[java] Java Result: 1
[java] Java Result: 1
[java] Java Result: 1
[java] Java Result: 1
[java] Java Result: 1
[java] Java Result: 1
[java] Java Result: 1
[java] Java Result: 1
[java] Java Result: 1
[java] Java Result: 1
[java] Java Result: 1
[java] Java Result: 1
[java] Java Result: 1
[java] Java Result: 1
[java] Java Result: 1
[java] Java Result: 1
[java] Java Result: 1
[java] Java Result: 1
[java] Java Result: 1
[java] Java Result: 1
[java] Java Result: 1
[java] Java Result: 1
[java] Java Result: 1
[java] Java Result: 1
[java] Java Result: 1
[java] Java Result: 1
[java] Java Result: 1
[java] Java Result: 1
[java] Java Result: 130
[junit] Tests FAILED
[junit] Tests FAILED
[junit] Tests FAILED
[junit] Tests FAILED
[junit] Tests FAILED
BUILD FAILED
/export/users/cc/cc-suites/build/checkouts/hdk/working_vm/build/make/build.xml:506: Some tests failed
Total time: 126 minutes 17 seconds
The execution FAILED with the following exception:
The following error occurred while executing this line:
/export/users/cc/cc-suites/adaptors/drlvm-test/adaptor.xml:76: There were drlvm-test failures

***********************************************************
Unit Tests: (1210)
        
failure: test test_java_attrs
failure: test test_java_basic
failure: test test_java_identify
failure: test test_java_interrupt
failure: test test_java_monitors
failure: test test_java_park
failure: test test_java_ptr_conv
failure: test test_java_suspend
failure: test test_native_basic
failure: test test_native_suspend
failure: test test_native_thin_monitor
failure: test test_ti_instrum
failure: test test_ti_local_storage
failure: test test_ti_monitor_info
failure: test test_ti_raw_monitors
failure: test test_ti_state
failure: interpreter Hi_int
failure: jitrino.JET Hi_jet
failure: Client mode JIT (default) Hi_jit
failure: jitrino.OPT Hi_opt
failure: Server mode JIT Hi_srv
failure: interpreter StackTest_int
failure: jitrino.JET StackTest_jet
failure: Client mode JIT (default) StackTest_jit
failure: jitrino.OPT StackTest_opt
failure: Server mode JIT StackTest_srv
failure: interpreter classloader.ClassTestGetDeclaringClass_int
failure: jitrino.JET classloader.ClassTestGetDeclaringClass_jet
failure: Client mode JIT (default) classloader.ClassTestGetDeclaringClass_jit
failure: jitrino.OPT classloader.ClassTestGetDeclaringClass_opt
failure: Server mode JIT classloader.ClassTestGetDeclaringClass_srv
failure: interpreter classloader.ExceptionInInitializerTest_int
failure: jitrino.JET classloader.ExceptionInInitializerTest_jet
failure: Client mode JIT (default) classloader.ExceptionInInitializerTest_jit
failure: jitrino.OPT classloader.ExceptionInInitializerTest_opt
failure: Server mode JIT classloader.ExceptionInInitializerTest_srv
failure: interpreter classloader.LogLoader_int
failure: jitrino.JET classloader.LogLoader_jet
failure: Client mode JIT (default) classloader.LogLoader_jit
failure: jitrino.OPT classloader.LogLoader_opt
failure: Server mode JIT classloader.LogLoader_srv
failure: interpreter classloader.NotFound_int
failure: jitrino.JET classloader.NotFound_jet
failure: Client mode JIT (default) classloader.NotFound_jit
failure: jitrino.OPT classloader.NotFound_opt
failure: Server mode JIT classloader.NotFound_srv
failure: interpreter classloader.StressLoader_int
failure: jitrino.JET classloader.StressLoader_jet
failure: Client mode JIT (default) classloader.StressLoader_jit
failure: jitrino.OPT classloader.StressLoader_opt
failure: Server mode JIT classloader.StressLoader_srv
failure: interpreter exception.ExceptionStackTest_int
failure: jitrino.JET exception.ExceptionStackTest_jet
failure: Client mode JIT (default) exception.ExceptionStackTest_jit
failure: jitrino.OPT exception.ExceptionStackTest_opt
failure: Server mode JIT exception.ExceptionStackTest_srv
failure: interpreter exception.FinalizeStackTest_int
failure: jitrino.JET exception.FinalizeStackTest_jet
failure: interpreter exception.NPE_int
failure: jitrino.JET exception.NPE_jet
failure: Client mode JIT (default) exception.NPE_jit
failure: jitrino.OPT exception.NPE_opt
failure: Server mode JIT exception.NPE_srv
failure: interpreter gc.FinAlloc_int
failure: jitrino.JET gc.FinAlloc_jet
failure: Client mode JIT (default) gc.FinAlloc_jit
failure: jitrino.OPT gc.FinAlloc_opt
failure: Server mode JIT gc.FinAlloc_srv
failure: interpreter gc.Finalizer_int
failure: jitrino.JET gc.Finalizer_jet
failure: Client mode JIT (default) gc.Finalizer_jit
failure: jitrino.OPT gc.Finalizer_opt
failure: Server mode JIT gc.Finalizer_srv
failure: interpreter gc.Force_int
failure: jitrino.JET gc.Force_jet
failure: Client mode JIT (default) gc.Force_jit
failure: jitrino.OPT gc.Force_opt
failure: Server mode JIT gc.Force_srv
failure: interpreter gc.Fragment_int
failure: jitrino.JET gc.Fragment_jet
failure: Client mode JIT (default) gc.Fragment_jit
failure: jitrino.OPT gc.Fragment_opt
failure: Server mode JIT gc.Fragment_srv
failure: interpreter gc.Free_int
failure: jitrino.JET gc.Free_jet
failure: Client mode JIT (default) gc.Free_jit
failure: jitrino.OPT gc.Free_opt
failure: Server mode JIT gc.Free_srv
failure: interpreter gc.LOS_int
failure: jitrino.JET gc.LOS_jet
failure: Client mode JIT (default) gc.LOS_jit
failure: jitrino.OPT gc.LOS_opt
failure: Server mode JIT gc.LOS_srv
failure: interpreter gc.List_int
failure: jitrino.JET gc.List_jet
failure: Client mode JIT (default) gc.List_jit
failure: jitrino.OPT gc.List_opt
failure: Server mode JIT gc.List_srv
failure: jitrino.JET gc.Mark_jet
failure: Client mode JIT (default) gc.Mark_jit
failure: jitrino.OPT gc.Mark_opt
failure: Server mode JIT gc.Mark_srv
failure: interpreter gc.MultiThreads_int
failure: jitrino.JET gc.MultiThreads_jet
failure: Client mode JIT (default) gc.MultiThreads_jit
failure: jitrino.OPT gc.MultiThreads_opt
failure: Server mode JIT gc.MultiThreads_srv
failure: interpreter gc.NPE_int
failure: interpreter gc.PhantomReferenceQueueTest_int
failure: jitrino.JET gc.PhantomReferenceQueueTest_jet
failure: Client mode JIT (default) gc.PhantomReferenceQueueTest_jit
failure: jitrino.OPT gc.PhantomReferenceQueueTest_opt
failure: Server mode JIT gc.PhantomReferenceQueueTest_srv
failure: interpreter gc.RefRemove_int
failure: jitrino.JET gc.RefRemove_jet
failure: Client mode JIT (default) gc.RefRemove_jit
failure: jitrino.OPT gc.RefRemove_opt
failure: Server mode JIT gc.RefRemove_srv
failure: interpreter gc.RunFinalizersOnExitTest_int
failure: jitrino.JET gc.RunFinalizersOnExitTest_jet
failure: Client mode JIT (default) gc.RunFinalizersOnExitTest_jit
failure: jitrino.OPT gc.RunFinalizersOnExitTest_opt
failure: Server mode JIT gc.RunFinalizersOnExitTest_srv
failure: interpreter gc.StressRef_int
failure: jitrino.JET gc.StressRef_jet
failure: Client mode JIT (default) gc.StressRef_jit
failure: jitrino.OPT gc.StressRef_opt
failure: Server mode JIT gc.StressRef_srv
failure: interpreter gc.SynchronizedFinalizersTest_int
failure: jitrino.JET gc.SynchronizedFinalizersTest_jet
failure: Client mode JIT (default) gc.SynchronizedFinalizersTest_jit
failure: jitrino.OPT gc.SynchronizedFinalizersTest_opt
failure: Server mode JIT gc.SynchronizedFinalizersTest_srv
failure: interpreter gc.ThreadSuspension_int
failure: jitrino.JET gc.ThreadSuspension_jet
failure: Client mode JIT (default) gc.ThreadSuspension_jit
failure: jitrino.OPT gc.ThreadSuspension_opt
failure: Server mode JIT gc.ThreadSuspension_srv
failure: interpreter init.ErrorInInitializer_int
failure: jitrino.JET init.ErrorInInitializer_jet
failure: Client mode JIT (default) init.ErrorInInitializer_jit
failure: jitrino.OPT init.ErrorInInitializer_opt
failure: Server mode JIT init.ErrorInInitializer_srv
failure: interpreter init.Other_int
failure: jitrino.JET init.Other_jet
failure: Client mode JIT (default) init.Other_jit
failure: jitrino.OPT init.Other_opt
failure: Server mode JIT init.Other_srv
failure: interpreter io.ArrayList_int
failure: jitrino.JET io.ArrayList_jet
failure: Client mode JIT (default) io.ArrayList_jit
failure: jitrino.OPT io.ArrayList_opt
failure: Server mode JIT io.ArrayList_srv
failure: jitrino.JET io.Integers_jet
failure: Client mode JIT (default) io.Integers_jit
failure: jitrino.OPT io.Integers_opt
failure: Server mode JIT io.Integers_srv
failure: interpreter jni.LoadLibrary_int
failure: jitrino.JET jni.LoadLibrary_jet
failure: Client mode JIT (default) jni.LoadLibrary_jit
failure: jitrino.OPT jni.LoadLibrary_opt
failure: Server mode JIT jni.LoadLibrary_srv
failure: interpreter outofmemory.Double_int
failure: jitrino.JET outofmemory.Double_jet
failure: Client mode JIT (default) outofmemory.Double_jit
failure: jitrino.OPT outofmemory.Double_opt
failure: Server mode JIT outofmemory.Double_srv
failure: interpreter outofmemory.Int_int
failure: jitrino.JET outofmemory.Int_jet
failure: Client mode JIT (default) outofmemory.Int_jit
failure: jitrino.OPT outofmemory.Int_opt
failure: Server mode JIT outofmemory.Int_srv
failure: interpreter outofmemory.Plain_int
failure: jitrino.JET outofmemory.Plain_jet
failure: Client mode JIT (default) outofmemory.Plain_jit
failure: jitrino.OPT outofmemory.Plain_opt
failure: Server mode JIT outofmemory.Plain_srv
failure: interpreter outofmemory.Ref_int
failure: jitrino.JET outofmemory.Ref_jet
failure: Client mode JIT (default) outofmemory.Ref_jit
failure: jitrino.OPT outofmemory.Ref_opt
failure: Server mode JIT outofmemory.Ref_srv
failure: interpreter outofmemory.Throw_int
failure: jitrino.JET outofmemory.Throw_jet
failure: Client mode JIT (default) outofmemory.Throw_jit
failure: jitrino.OPT outofmemory.Throw_opt
failure: Server mode JIT outofmemory.Throw_srv
failure: interpreter outofmemory.VectorDouble_int
failure: jitrino.JET outofmemory.VectorDouble_jet
failure: Client mode JIT (default) outofmemory.VectorDouble_jit
failure: jitrino.OPT outofmemory.VectorDouble_opt
failure: Server mode JIT outofmemory.VectorDouble_srv
failure: interpreter outofmemory.VectorInt_int
failure: jitrino.JET outofmemory.VectorInt_jet
failure: Client mode JIT (default) outofmemory.VectorInt_jit
failure: jitrino.OPT outofmemory.VectorInt_opt
failure: Server mode JIT outofmemory.VectorInt_srv
failure: interpreter outofmemory.VectorRef_int
failure: jitrino.JET outofmemory.VectorRef_jet
failure: Client mode JIT (default) outofmemory.VectorRef_jit
failure: jitrino.OPT outofmemory.VectorRef_opt
failure: Server mode JIT outofmemory.VectorRef_srv
failure: interpreter outofmemory.Vector_int
failure: jitrino.JET outofmemory.Vector_jet
failure: Client mode JIT (default) outofmemory.Vector_jit
failure: jitrino.OPT outofmemory.Vector_opt
failure: Server mode JIT outofmemory.Vector_srv
failure: interpreter perf.CreateManyExceptions_depth_int
failure: jitrino.JET perf.CreateManyExceptions_depth_jet
failure: Client mode JIT (default) perf.CreateManyExceptions_depth_jit
failure: jitrino.OPT perf.CreateManyExceptions_depth_opt
failure: Server mode JIT perf.CreateManyExceptions_depth_srv
failure: interpreter perf.CreateManyExceptions_int
failure: jitrino.JET perf.CreateManyExceptions_jet
failure: Client mode JIT (default) perf.CreateManyExceptions_jit
failure: jitrino.OPT perf.CreateManyExceptions_opt
failure: Server mode JIT perf.CreateManyExceptions_srv
failure: interpreter perf.MultiThreadsSimple_int
failure: jitrino.JET perf.MultiThreadsSimple_jet
failure: Client mode JIT (default) perf.MultiThreadsSimple_jit
failure: jitrino.OPT perf.MultiThreadsSimple_opt
failure: Server mode JIT perf.MultiThreadsSimple_srv
failure: interpreter perf.SeveralThreads_int
failure: jitrino.JET perf.SeveralThreads_jet
failure: Client mode JIT (default) perf.SeveralThreads_jit
failure: jitrino.OPT perf.SeveralThreads_opt
failure: Server mode JIT perf.SeveralThreads_srv
failure: interpreter perf.StressCornerSize_a_int
failure: jitrino.JET perf.StressCornerSize_a_jet
failure: Client mode JIT (default) perf.StressCornerSize_a_jit
failure: jitrino.OPT perf.StressCornerSize_a_opt
failure: Server mode JIT perf.StressCornerSize_a_srv
failure: interpreter perf.StressCornerSize_int
failure: jitrino.JET perf.StressCornerSize_jet
failure: Client mode JIT (default) perf.StressCornerSize_jit
failure: jitrino.OPT perf.StressCornerSize_opt
failure: Server mode JIT perf.StressCornerSize_srv
failure: interpreter perf.ThrowManyExceptions_depth_int
failure: jitrino.JET perf.ThrowManyExceptions_depth_jet
failure: Client mode JIT (default) perf.ThrowManyExceptions_depth_jit
failure: jitrino.OPT perf.ThrowManyExceptions_depth_opt
failure: Server mode JIT perf.ThrowManyExceptions_depth_srv
failure: interpreter perf.ThrowManyExceptions_int
failure: jitrino.JET perf.ThrowManyExceptions_jet
failure: Client mode JIT (default) perf.ThrowManyExceptions_jit
failure: jitrino.OPT perf.ThrowManyExceptions_opt
failure: Server mode JIT perf.ThrowManyExceptions_srv
failure: interpreter perf.ThrowMany_depth_int
failure: jitrino.JET perf.ThrowMany_depth_jet
failure: Client mode JIT (default) perf.ThrowMany_depth_jit
failure: jitrino.OPT perf.ThrowMany_depth_opt
failure: Server mode JIT perf.ThrowMany_depth_srv
failure: interpreter perf.ThrowMany_int
failure: jitrino.JET perf.ThrowMany_jet
failure: Client mode JIT (default) perf.ThrowMany_jit
failure: jitrino.OPT perf.ThrowMany_opt
failure: Server mode JIT perf.ThrowMany_srv
failure: interpreter reflect.GetMethod_int
failure: jitrino.JET reflect.GetMethod_jet
failure: Client mode JIT (default) reflect.GetMethod_jit
failure: jitrino.OPT reflect.GetMethod_opt
failure: Server mode JIT reflect.GetMethod_srv
failure: interpreter shutdown.TestDaemonOnWait_int
failure: jitrino.JET shutdown.TestDaemonOnWait_jet
failure: Client mode JIT (default) shutdown.TestDaemonOnWait_jit
failure: jitrino.OPT shutdown.TestDaemonOnWait_opt
failure: Server mode JIT shutdown.TestDaemonOnWait_srv
failure: interpreter shutdown.TestFatalError_int
failure: jitrino.JET shutdown.TestFatalError_jet
failure: Client mode JIT (default) shutdown.TestFatalError_jit
failure: jitrino.OPT shutdown.TestFatalError_opt
failure: Server mode JIT shutdown.TestFatalError_srv
failure: interpreter shutdown.TestInterrupt_int
failure: jitrino.JET shutdown.TestInterrupt_jet
failure: Client mode JIT (default) shutdown.TestInterrupt_jit
failure: jitrino.OPT shutdown.TestInterrupt_opt
failure: Server mode JIT shutdown.TestInterrupt_srv
failure: interpreter shutdown.TestLock_int
failure: jitrino.JET shutdown.TestLock_jet
failure: Client mode JIT (default) shutdown.TestLock_jit
failure: jitrino.OPT shutdown.TestLock_opt
failure: Server mode JIT shutdown.TestLock_srv
failure: interpreter stress.BigStringBuffer_int
failure: jitrino.JET stress.BigStringBuffer_jet
failure: Client mode JIT (default) stress.BigStringBuffer_jit
failure: jitrino.OPT stress.BigStringBuffer_opt
failure: Server mode JIT stress.BigStringBuffer_srv
failure: interpreter stress.Finalizer_int
failure: jitrino.JET stress.Finalizer_jet
failure: Client mode JIT (default) stress.Finalizer_jit
failure: jitrino.OPT stress.Finalizer_opt
failure: Server mode JIT stress.Finalizer_srv
failure: jitrino.JET stress.Intern_jet
failure: Client mode JIT (default) stress.Intern_jit
failure: jitrino.OPT stress.Intern_opt
failure: Server mode JIT stress.Intern_srv
failure: interpreter stress.Mix_int
failure: jitrino.JET stress.Mix_jet
failure: Client mode JIT (default) stress.Mix_jit
failure: jitrino.OPT stress.Mix_opt
failure: Server mode JIT stress.Mix_srv
failure: interpreter stress.Stack_int
failure: interpreter stress.Sync_int
failure: jitrino.JET stress.Sync_jet
failure: Client mode JIT (default) stress.Sync_jit
failure: jitrino.OPT stress.Sync_opt
failure: Server mode JIT stress.Sync_srv
failure: interpreter stress.Threads_int
failure: jitrino.JET stress.Threads_jet
failure: Client mode JIT (default) stress.Threads_jit
failure: jitrino.OPT stress.Threads_opt
failure: Server mode JIT stress.Threads_srv
failure: interpreter stress.Vector_int
failure: jitrino.JET stress.Vector_jet
failure: Client mode JIT (default) stress.Vector_jit
failure: jitrino.OPT stress.Vector_opt
failure: Server mode JIT stress.Vector_srv
failure: interpreter stress.WeakHashmapTest_int
failure: jitrino.JET stress.WeakHashmapTest_jet
failure: Client mode JIT (default) stress.WeakHashmapTest_jit
failure: jitrino.OPT stress.WeakHashmapTest_opt
failure: Server mode JIT stress.WeakHashmapTest_srv
failure: interpreter thread.ExitShutdownHook_int
failure: jitrino.JET thread.ExitShutdownHook_jet
failure: Client mode JIT (default) thread.ExitShutdownHook_jit
failure: jitrino.OPT thread.ExitShutdownHook_opt
failure: Server mode JIT thread.ExitShutdownHook_srv
failure: interpreter thread.InfiniteFinalizer_int
failure: jitrino.JET thread.InfiniteFinalizer_jet
failure: Client mode JIT (default) thread.InfiniteFinalizer_jit
failure: jitrino.OPT thread.InfiniteFinalizer_opt
failure: Server mode JIT thread.InfiniteFinalizer_srv
failure: interpreter thread.InterruptWait_int
failure: jitrino.JET thread.InterruptWait_jet
failure: Client mode JIT (default) thread.InterruptWait_jit
failure: jitrino.OPT thread.InterruptWait_opt
failure: Server mode JIT thread.InterruptWait_srv
failure: interpreter thread.Sleep_int
failure: jitrino.JET thread.Sleep_jet
failure: Client mode JIT (default) thread.Sleep_jit
failure: jitrino.OPT thread.Sleep_opt
failure: Server mode JIT thread.Sleep_srv
failure: interpreter thread.SmallStackThreadTest_int
failure: jitrino.JET thread.SmallStackThreadTest_jet
failure: Client mode JIT (default) thread.SmallStackThreadTest_jit
failure: jitrino.OPT thread.SmallStackThreadTest_opt
failure: Server mode JIT thread.SmallStackThreadTest_srv
failure: interpreter thread.ThreadInterrupt_int
failure: jitrino.JET thread.ThreadInterrupt_jet
failure: Client mode JIT (default) thread.ThreadInterrupt_jit
failure: jitrino.OPT thread.ThreadInterrupt_opt
failure: Server mode JIT thread.ThreadInterrupt_srv
failure: interpreter thread.ThreadOOM_int
failure: jitrino.JET thread.ThreadOOM_jet
failure: Client mode JIT (default) thread.ThreadOOM_jit
failure: jitrino.OPT thread.ThreadOOM_opt
failure: Server mode JIT thread.ThreadOOM_srv
failure: interpreter util.Date_int
failure: jitrino.JET util.Date_jet
failure: Client mode JIT (default) util.Date_jit
failure: jitrino.OPT util.Date_opt
failure: Server mode JIT util.Date_srv
failure: interpreter util.DoPriveleged_int
failure: jitrino.JET util.DoPriveleged_jet
failure: Client mode JIT (default) util.DoPriveleged_jit
failure: jitrino.OPT util.DoPriveleged_opt
failure: Server mode JIT util.DoPriveleged_srv
failure: interpreter util.Prop_int
failure: jitrino.JET util.Prop_jet
failure: Client mode JIT (default) util.Prop_jit
failure: jitrino.OPT util.Prop_opt
failure: Server mode JIT util.Prop_srv
failure: interpreter util.StringIntern_int
failure: jitrino.JET util.StringIntern_jet
failure: Client mode JIT (default) util.StringIntern_jit
failure: jitrino.OPT util.StringIntern_opt
failure: Server mode JIT util.StringIntern_srv
Unit Test Error Details:	(377)
                
Test: testClass: test_java_attrsExit code: 139 Err: INFO: TEST test_jthread_get_priority start
Loading error /export/users/cc/cc-suites/build/checkouts/snapshot/hdk/jdk/jre/bin/default/libgc_gen.so: undefined symbol: _Z23free_set_pool_put_entryP12Vector_BlockP11GC_Metadata
GC library cannot be loaded: libgc_gen.so
Test: testClass: test_java_basicExit code: 139 Err: INFO: TEST test_jthread_attach start
Loading error /export/users/cc/cc-suites/build/checkouts/snapshot/hdk/jdk/jre/bin/default/libgc_gen.so: undefined symbol: _Z23free_set_pool_put_entryP12Vector_BlockP11GC_Metadata
GC library cannot be loaded: libgc_gen.so
Test: testClass: test_java_identifyExit code: 139 Err: INFO: TEST test_jthread_self start
Loading error /export/users/cc/cc-suites/build/checkouts/snapshot/hdk/jdk/jre/bin/default/libgc_gen.so: undefined symbol: _Z23free_set_pool_put_entryP12Vector_BlockP11GC_Metadata
GC library cannot be loaded: libgc_gen.so
Test: testClass: test_java_interruptExit code: 139 Err: INFO: TEST test_jthread_interrupt start
Loading error /export/users/cc/cc-suites/build/checkouts/snapshot/hdk/jdk/jre/bin/default/libgc_gen.so: undefined symbol: _Z23free_set_pool_put_entryP12Vector_BlockP11GC_Metadata
GC library cannot be loaded: libgc_gen.so
Test: testClass: test_java_monitorsExit code: 139 Err: INFO: TEST test_jthread_monitor_init start
Loading error /export/users/cc/cc-suites/build/checkouts/snapshot/hdk/jdk/jre/bin/default/libgc_gen.so: undefined symbol: _Z23free_set_pool_put_entryP12Vector_BlockP11GC_Metadata
GC library cannot be loaded: libgc_gen.so
Test: testClass: test_java_parkExit code: 139 Err: INFO: TEST test_jthread_park_unpark start
Loading error /export/users/cc/cc-suites/build/checkouts/snapshot/hdk/jdk/jre/bin/default/libgc_gen.so: undefined symbol: _Z23free_set_pool_put_entryP12Vector_BlockP11GC_Metadata
GC library cannot be loaded: libgc_gen.so
Test: testClass: test_java_ptr_convExit code: 139 Err: INFO: TEST test_jthread_get_java_thread start
Loading error /export/users/cc/cc-suites/build/checkouts/snapshot/hdk/jdk/jre/bin/default/libgc_gen.so: undefined symbol: _Z23free_set_pool_put_entryP12Vector_BlockP11GC_Metadata
GC library cannot be loaded: libgc_gen.so
Test: testClass: test_java_suspendExit code: 139 Err: INFO: TEST test_jthread_suspend_resume start
Loading error /export/users/cc/cc-suites/build/checkouts/snapshot/hdk/jdk/jre/bin/default/libgc_gen.so: undefined symbol: _Z23free_set_pool_put_entryP12Vector_BlockP11GC_Metadata
GC library cannot be loaded: libgc_gen.so
Test: testClass: test_native_basicExit code: 143 Err: INFO: TEST test_hythread_self_base start
Loading error /export/users/cc/cc-suites/build/checkouts/snapshot/hdk/jdk/jre/bin/default/libgc_gen.so: undefined symbol: _Z23free_set_pool_put_entryP12Vector_BlockP11GC_Metadata
GC library cannot be loaded: libgc_gen.so
INFO: TEST test_hythread_self_base: PASSED
INFO: TEST test_hythread_create start
Test: testClass: test_native_suspendExit code: 143 Err: INFO: TEST test_hythread_thread_suspend start
Loading error /export/users/cc/cc-suites/build/checkouts/snapshot/hdk/jdk/jre/bin/default/libgc_gen.so: undefined symbol: _Z23free_set_pool_put_entryP12Vector_BlockP11GC_Metadata
GC library cannot be loaded: libgc_gen.so
INFO: TEST test_hythread_thread_suspend: PASSED
INFO: TEST test_hythread_thread_suspend_all start
Test: testClass: test_native_thin_monitorExit code: 143 Err: INFO: TEST test_hythread_thin_monitor_enter start
Loading error /export/users/cc/cc-suites/build/checkouts/snapshot/hdk/jdk/jre/bin/default/libgc_gen.so: undefined symbol: _Z23frINFO: TEST test_hythread_thin_monitor_enter: PASSED
INFO: TEST test_hythread_thin_monitor_try_enter start
ee_set_pool_put_entryP12Vector_BlockP11GC_Metadata
GC library cannot be loaded: libgc_gen.so
Test: testClass: test_ti_instrumExit code: 139 Err: INFO: TEST test_jthread_get_all_threads start
Loading error /export/users/cc/cc-suites/build/checkouts/snapshot/hdk/jdk/jre/bin/default/libgc_gen.so: undefined symbol: _Z23free_set_pool_put_entryP12Vector_BlockP11GC_Metadata
GC library cannot be loaded: libgc_gen.so
Test: testClass: test_ti_local_storageExit code: 139 Err: INFO: TEST test_jthread_set_and_get_local_storage start
Loading error /export/users/cc/cc-suites/build/checkouts/snapshot/hdk/jdk/jre/bin/default/libgc_gen.so: undefined symbol: _Z23free_set_pool_put_entryP12Vector_BlockP11GC_Metadata
GC library cannot be loaded: libgc_gen.so
Test: testClass: test_ti_monitor_infoExit code: 139 Err: INFO: TEST test_jthread_get_contended_monitor start
Loading error /export/users/cc/cc-suites/build/checkouts/snapshot/hdk/jdk/jre/bin/default/libgc_gen.so: undefined symbol: _Z23free_set_pool_put_entryP12Vector_BlockP11GC_Metadata
GC library cannot be loaded: libgc_gen.so
Test: testClass: test_ti_raw_monitorsExit code: 143 Err: INFO: TEST test_jthread_raw_monitor_create start
Loading error /export/users/cc/cc-suites/build/checkouts/snapshot/hdk/jdk/jre/bin/default/libgc_gen.so: undefined symbol: _Z23free_set_pool_put_entryP12Vector_BlockP11GC_Metadata
GC library cannot be loaded: libgc_gen.so
INFO: TEST test_jthread_raw_monitor_create: PASSED
INFO: TEST test_jthread_raw_monitor_destroy start
Test: testClass: test_ti_stateExit code: 139 Err: INFO: TEST test_jthread_get_jvmti_state_6 start
Loading error /export/users/cc/cc-suites/build/checkouts/snapshot/hdk/jdk/jre/bin/default/libgc_gen.so: undefined symbol: _Z23free_set_pool_put_entryP12Vector_BlockP11GC_Metadata
GC library cannot be loaded: libgc_gen.so
Test: interpreterClass: Hi_intExit code: 1 Err: Loading error /export/users/cc/cc-suites/build/checkouts/snapshot/hdk/jdk/jre/bin/default/libgc_gen.so: undefined symbol: _Z23free_set_pool_put_entryP12Vector_BlockP11GC_Metadata
GC library cannot be loaded: libgc_gen.so
HMYEXEL062E Internal VM error: Failed to create Java VM
FAILED to invoke JVM.
Test: jitrino.JETClass: Hi_jetExit code: 1 Err: Loading error /export/users/cc/cc-suites/build/checkouts/snapshot/hdk/jdk/jre/bin/default/libgc_gen.so: undefined symbol: _Z23free_set_pool_put_entryP12Vector_BlockP11GC_Metadata
GC library cannot be loaded: libgc_gen.so
HMYEXEL062E Internal VM error: Failed to create Java VM
FAILED to invoke JVM.
Test: Client mode JIT (default)Class: Hi_jitExit code: 1 Err: Loading error /export/users/cc/cc-suites/build/checkouts/snapshot/hdk/jdk/jre/bin/default/libgc_gen.so: undefined symbol: _Z23free_set_pool_put_entryP12Vector_BlockP11GC_Metadata
GC library cannot be loaded: libgc_gen.so
HMYEXEL062E Internal VM error: Failed to create Java VM
FAILED to invoke JVM.
Test: jitrino.OPTClass: Hi_optExit code: 1 Err: Loading error /export/users/cc/cc-suites/build/checkouts/snapshot/hdk/jdk/jre/bin/default/libgc_gen.so: undefined symbol: _Z23free_set_pool_put_entryP12Vector_BlockP11GC_Metadata
GC library cannot be loaded: libgc_gen.so
HMYEXEL062E Internal VM error: Failed to create Java VM
FAILED to invoke JVM.
Test: Server mode JITClass: Hi_srvExit code: 1 Err: Loading error /export/users/cc/cc-suites/build/checkouts/snapshot/hdk/jdk/jre/bin/default/libgc_gen.so: undefined symbol: _Z23free_set_pool_put_entryP12Vector_BlockP11GC_Metadata
GC library cannot be loaded: libgc_gen.so
HMYEXEL062E Internal VM error: Failed to create Java VM
FAILED to invoke JVM.
Test: interpreterClass: StackTest_intExit code: 1 Err: Loading error /export/users/cc/cc-suites/build/checkouts/snapshot/hdk/jdk/jre/bin/default/libgc_gen.so: undefined symbol: _Z23free_set_pool_put_entryP12Vector_BlockP11GC_Metadata
GC library cannot be loaded: libgc_gen.so
HMYEXEL062E Internal VM error: Failed to create Java VM
FAILED to invoke JVM.
Test: jitrino.JETClass: StackTest_jetExit code: 1 Err: Loading error /export/users/cc/cc-suites/build/checkouts/snapshot/hdk/jdk/jre/bin/default/libgc_gen.so: undefined symbol: _Z23free_set_pool_put_entryP12Vector_BlockP11GC_Metadata
GC library cannot be loaded: libgc_gen.so
HMYEXEL062E Internal VM error: Failed to create Java VM
FAILED to invoke JVM.
Test: Client mode JIT (default)Class: StackTest_jitExit code: 1 Err: Loading error /export/users/cc/cc-suites/build/checkouts/snapshot/hdk/jdk/jre/bin/default/libgc_gen.so: undefined symbol: _Z23free_set_pool_put_entryP12Vector_BlockP11GC_Metadata
GC library cannot be loaded: libgc_gen.so
HMYEXEL062E Internal VM error: Failed to create Java VM
FAILED to invoke JVM.
Test: jitrino.OPTClass: StackTest_optExit code: 1 Err: Loading error /export/users/cc/cc-suites/build/checkouts/snapshot/hdk/jdk/jre/bin/default/libgc_gen.so: undefined symbol: _Z23free_set_pool_put_entryP12Vector_BlockP11GC_Metadata
GC library cannot be loaded: libgc_gen.so
HMYEXEL062E Internal VM error: Failed to create Java VM
FAILED to invoke JVM.
Test: Server mode JITClass: StackTest_srvExit code: 1 Err: Loading error /export/users/cc/cc-suites/build/checkouts/snapshot/hdk/jdk/jre/bin/default/libgc_gen.so: undefined symbol: _Z23free_set_pool_put_entryP12Vector_BlockP11GC_Metadata
GC library cannot be loaded: libgc_gen.so
HMYEXEL062E Internal VM error: Failed to create Java VM
FAILED to invoke JVM.
Test: interpreterClass: classloader.ClassTestGetDeclaringClass_intExit code: 1 Err: Loading error /export/users/cc/cc-suites/build/checkouts/snapshot/hdk/jdk/jre/bin/default/libgc_gen.so: undefined symbol: _Z23free_set_pool_put_entryP12Vector_BlockP11GC_Metadata
GC library cannot be loaded: libgc_gen.so
HMYEXEL062E Internal VM error: Failed to create Java VM
FAILED to invoke JVM.
Test: jitrino.JETClass: classloader.ClassTestGetDeclaringClass_jetExit code: 1 Err: Loading error /export/users/cc/cc-suites/build/checkouts/snapshot/hdk/jdk/jre/bin/default/libgc_gen.so: undefined symbol: _Z23free_set_pool_put_entryP12Vector_BlockP11GC_Metadata
GC library cannot be loaded: libgc_gen.so
HMYEXEL062E Internal VM error: Failed to create Java VM
FAILED to invoke JVM.
Test: Client mode JIT (default)Class: classloader.ClassTestGetDeclaringClass_jitExit code: 1 Err: Loading error /export/users/cc/cc-suites/build/checkouts/snapshot/hdk/jdk/jre/bin/default/libgc_gen.so: undefined symbol: _Z23free_set_pool_put_entryP12Vector_BlockP11GC_Metadata
GC library cannot be loaded: libgc_gen.so
HMYEXEL062E Internal VM error: Failed to create Java VM
FAILED to invoke JVM.
Test: jitrino.OPTClass: classloader.ClassTestGetDeclaringClass_optExit code: 1 Err: Loading error /export/users/cc/cc-suites/build/checkouts/snapshot/hdk/jdk/jre/bin/default/libgc_gen.so: undefined symbol: _Z23free_set_pool_put_entryP12Vector_BlockP11GC_Metadata
GC library cannot be loaded: libgc_gen.so
HMYEXEL062E Internal VM error: Failed to create Java VM
FAILED to invoke JVM.
Test: Server mode JITClass: classloader.ClassTestGetDeclaringClass_srvExit code: 1 Err: Loading error /export/users/cc/cc-suites/build/checkouts/snapshot/hdk/jdk/jre/bin/default/libgc_gen.so: undefined symbol: _Z23free_set_pool_put_entryP12Vector_BlockP11GC_Metadata
GC library cannot be loaded: libgc_gen.so
HMYEXEL062E Internal VM error: Failed to create Java VM
FAILED to invoke JVM.
Test: interpreterClass: classloader.ExceptionInInitializerTest_intExit code: 1 Err: Loading error /export/users/cc/cc-suites/build/checkouts/snapshot/hdk/jdk/jre/bin/default/libgc_gen.so: undefined symbol: _Z23free_set_pool_put_entryP12Vector_BlockP11GC_Metadata
GC library cannot be loaded: libgc_gen.so
HMYEXEL062E Internal VM error: Failed to create Java VM
FAILED to invoke JVM.
Test: jitrino.JETClass: classloader.ExceptionInInitializerTest_jetExit code: 1 Err: Loading error /export/users/cc/cc-suites/build/checkouts/snapshot/hdk/jdk/jre/bin/default/libgc_gen.so: undefined symbol: _Z23free_set_pool_put_entryP12Vector_BlockP11GC_Metadata
GC library cannot be loaded: libgc_gen.so
HMYEXEL062E Internal VM error: Failed to create Java VM
FAILED to invoke JVM.
Test: Client mode JIT (default)Class: classloader.ExceptionInInitializerTest_jitExit code: 1 Err: Loading error /export/users/cc/cc-suites/build/checkouts/snapshot/hdk/jdk/jre/bin/default/libgc_gen.so: undefined symbol: _Z23free_set_pool_put_entryP12Vector_BlockP11GC_Metadata
GC library cannot be loaded: libgc_gen.so
HMYEXEL062E Internal VM error: Failed to create Java VM
FAILED to invoke JVM.
Test: jitrino.OPTClass: classloader.ExceptionInInitializerTest_optExit code: 1 Err: Loading error /export/users/cc/cc-suites/build/checkouts/snapshot/hdk/jdk/jre/bin/default/libgc_gen.so: undefined symbol: _Z23free_set_pool_put_entryP12Vector_BlockP11GC_Metadata
GC library cannot be loaded: libgc_gen.so
HMYEXEL062E Internal VM error: Failed to create Java VM
FAILED to invoke JVM.
Test: Server mode JITClass: classloader.ExceptionInInitializerTest_srvExit code: 1 Err: Loading error /export/users/cc/cc-suites/build/checkouts/snapshot/hdk/jdk/jre/bin/default/libgc_gen.so: undefined symbol: _Z23free_set_pool_put_entryP12Vector_BlockP11GC_Metadata
GC library cannot be loaded: libgc_gen.so
HMYEXEL062E Internal VM error: Failed to create Java VM
FAILED to invoke JVM.
Test: interpreterClass: classloader.LogLoader_intExit code: 1 Err: Loading error /export/users/cc/cc-suites/build/checkouts/snapshot/hdk/jdk/jre/bin/default/libgc_gen.so: undefined symbol: _Z23free_set_pool_put_entryP12Vector_BlockP11GC_Metadata
GC library cannot be loaded: libgc_gen.so
HMYEXEL062E Internal VM error: Failed to create Java VM
FAILED to invoke JVM.
Test: jitrino.JETClass: classloader.LogLoader_jetExit code: 1 Err: Loading error /export/users/cc/cc-suites/build/checkouts/snapshot/hdk/jdk/jre/bin/default/libgc_gen.so: undefined symbol: _Z23free_set_pool_put_entryP12Vector_BlockP11GC_Metadata
GC library cannot be loaded: libgc_gen.so
HMYEXEL062E Internal VM error: Failed to create Java VM
FAILED to invoke JVM.
Test: Client mode JIT (default)Class: classloader.LogLoader_jitExit code: 1 Err: Loading error /export/users/cc/cc-suites/build/checkouts/snapshot/hdk/jdk/jre/bin/default/libgc_gen.so: undefined symbol: _Z23free_set_pool_put_entryP12Vector_BlockP11GC_Metadata
GC library cannot be loaded: libgc_gen.so
HMYEXEL062E Internal VM error: Failed to create Java VM
FAILED to invoke JVM.
Test: jitrino.OPTClass: classloader.LogLoader_optExit code: 1 Err: Loading error /export/users/cc/cc-suites/build/checkouts/snapshot/hdk/jdk/jre/bin/default/libgc_gen.so: undefined symbol: _Z23free_set_pool_put_entryP12Vector_BlockP11GC_Metadata
GC library cannot be loaded: libgc_gen.so
HMYEXEL062E Internal VM error: Failed to create Java VM
FAILED to invoke JVM.
Test: Server mode JITClass: classloader.LogLoader_srvExit code: 1 Err: Loading error /export/users/cc/cc-suites/build/checkouts/snapshot/hdk/jdk/jre/bin/default/libgc_gen.so: undefined symbol: _Z23free_set_pool_put_entryP12Vector_BlockP11GC_Metadata
GC library cannot be loaded: libgc_gen.so
HMYEXEL062E Internal VM error: Failed to create Java VM
FAILED to invoke JVM.
Test: interpreterClass: classloader.NotFound_intExit code: 1 Err: Loading error /export/users/cc/cc-suites/build/checkouts/snapshot/hdk/jdk/jre/bin/default/libgc_gen.so: undefined symbol: _Z23free_set_pool_put_entryP12Vector_BlockP11GC_Metadata
GC library cannot be loaded: libgc_gen.so
HMYEXEL062E Internal VM error: Failed to create Java VM
FAILED to invoke JVM.
Test: jitrino.JETClass: classloader.NotFound_jetExit code: 1 Err: Loading error /export/users/cc/cc-suites/build/checkouts/snapshot/hdk/jdk/jre/bin/default/libgc_gen.so: undefined symbol: _Z23free_set_pool_put_entryP12Vector_BlockP11GC_Metadata
GC library cannot be loaded: libgc_gen.so
HMYEXEL062E Internal VM error: Failed to create Java VM
FAILED to invoke JVM.
Test: Client mode JIT (default)Class: classloader.NotFound_jitExit code: 1 Err: Loading error /export/users/cc/cc-suites/build/checkouts/snapshot/hdk/jdk/jre/bin/default/libgc_gen.so: undefined symbol: _Z23free_set_pool_put_entryP12Vector_BlockP11GC_Metadata
GC library cannot be loaded: libgc_gen.so
HMYEXEL062E Internal VM error: Failed to create Java VM
FAILED to invoke JVM.
Test: jitrino.OPTClass: classloader.NotFound_optExit code: 1 Err: Loading error /export/users/cc/cc-suites/build/checkouts/snapshot/hdk/jdk/jre/bin/default/libgc_gen.so: undefined symbol: _Z23free_set_pool_put_entryP12Vector_BlockP11GC_Metadata
GC library cannot be loaded: libgc_gen.so
HMYEXEL062E Internal VM error: Failed to create Java VM
FAILED to invoke JVM.
Test: Server mode JITClass: classloader.NotFound_srvExit code: 1 Err: Loading error /export/users/cc/cc-suites/build/checkouts/snapshot/hdk/jdk/jre/bin/default/libgc_gen.so: undefined symbol: _Z23free_set_pool_put_entryP12Vector_BlockP11GC_Metadata
GC library cannot be loaded: libgc_gen.so
HMYEXEL062E Internal VM error: Failed to create Java VM
FAILED to invoke JVM.
Test: interpreterClass: classloader.StressLoader_intExit code: 1 Err: Loading error /export/users/cc/cc-suites/build/checkouts/snapshot/hdk/jdk/jre/bin/default/libgc_gen.so: undefined symbol: _Z23free_set_pool_put_entryP12Vector_BlockP11GC_Metadata
GC library cannot be loaded: libgc_gen.so
HMYEXEL062E Internal VM error: Failed to create Java VM
FAILED to invoke JVM.
Test: jitrino.JETClass: classloader.StressLoader_jetExit code: 1 Err: Loading error /export/users/cc/cc-suites/build/checkouts/snapshot/hdk/jdk/jre/bin/default/libgc_gen.so: undefined symbol: _Z23free_set_pool_put_entryP12Vector_BlockP11GC_Metadata
GC library cannot be loaded: libgc_gen.so
HMYEXEL062E Internal VM error: Failed to create Java VM
FAILED to invoke JVM.
Test: Client mode JIT (default)Class: classloader.StressLoader_jitExit code: 1 Err: Loading error /export/users/cc/cc-suites/build/checkouts/snapshot/hdk/jdk/jre/bin/default/libgc_gen.so: undefined symbol: _Z23free_set_pool_put_entryP12Vector_BlockP11GC_Metadata
GC library cannot be loaded: libgc_gen.so
HMYEXEL062E Internal VM error: Failed to create Java VM
FAILED to invoke JVM.
Test: jitrino.OPTClass: classloader.StressLoader_optExit code: 1 Err: Loading error /export/users/cc/cc-suites/build/checkouts/snapshot/hdk/jdk/jre/bin/default/libgc_gen.so: undefined symbol: _Z23free_set_pool_put_entryP12Vector_BlockP11GC_Metadata
GC library cannot be loaded: libgc_gen.so
HMYEXEL062E Internal VM error: Failed to create Java VM
FAILED to invoke JVM.
Test: Server mode JITClass: classloader.StressLoader_srvExit code: 1 Err: Loading error /export/users/cc/cc-suites/build/checkouts/snapshot/hdk/jdk/jre/bin/default/libgc_gen.so: undefined symbol: _Z23free_set_pool_put_entryP12Vector_BlockP11GC_Metadata
GC library cannot be loaded: libgc_gen.so
HMYEXEL062E Internal VM error: Failed to create Java VM
FAILED to invoke JVM.
Test: interpreterClass: exception.ExceptionStackTest_intExit code: 1 Err: Loading error /export/users/cc/cc-suites/build/checkouts/snapshot/hdk/jdk/jre/bin/default/libgc_gen.so: undefined symbol: _Z23free_set_pool_put_entryP12Vector_BlockP11GC_Metadata
GC library cannot be loaded: libgc_gen.so
HMYEXEL062E Internal VM error: Failed to create Java VM
FAILED to invoke JVM.
Test: jitrino.JETClass: exception.ExceptionStackTest_jetExit code: 1 Err: Loading error /export/users/cc/cc-suites/build/checkouts/snapshot/hdk/jdk/jre/bin/default/libgc_gen.so: undefined symbol: _Z23free_set_pool_put_entryP12Vector_BlockP11GC_Metadata
GC library cannot be loaded: libgc_gen.so
HMYEXEL062E Internal VM error: Failed to create Java VM
FAILED to invoke JVM.
Test: Client mode JIT (default)Class: exception.ExceptionStackTest_jitExit code: 1 Err: Loading error /export/users/cc/cc-suites/build/checkouts/snapshot/hdk/jdk/jre/bin/default/libgc_gen.so: undefined symbol: _Z23free_set_pool_put_entryP12Vector_BlockP11GC_Metadata
GC library cannot be loaded: libgc_gen.so
HMYEXEL062E Internal VM error: Failed to create Java VM
FAILED to invoke JVM.
Test: jitrino.OPTClass: exception.ExceptionStackTest_optExit code: 1 Err: Loading error /export/users/cc/cc-suites/build/checkouts/snapshot/hdk/jdk/jre/bin/default/libgc_gen.so: undefined symbol: _Z23free_set_pool_put_entryP12Vector_BlockP11GC_Metadata
GC library cannot be loaded: libgc_gen.so
HMYEXEL062E Internal VM error: Failed to create Java VM
FAILED to invoke JVM.
Test: Server mode JITClass: exception.ExceptionStackTest_srvExit code: 1 Err: Loading error /export/users/cc/cc-suites/build/checkouts/snapshot/hdk/jdk/jre/bin/default/libgc_gen.so: undefined symbol: _Z23free_set_pool_put_entryP12Vector_BlockP11GC_Metadata
GC library cannot be loaded: libgc_gen.so
HMYEXEL062E Internal VM error: Failed to create Java VM
FAILED to invoke JVM.
Test: interpreterClass: exception.FinalizeStackTest_intExit code: 1 Err: Loading error /export/users/cc/cc-suites/build/checkouts/snapshot/hdk/jdk/jre/bin/default/libgc_gen.so: undefined symbol: _Z23free_set_pool_put_entryP12Vector_BlockP11GC_Metadata
GC library cannot be loaded: libgc_gen.so
HMYEXEL062E Internal VM error: Failed to create Java VM
FAILED to invoke JVM.
Test: jitrino.JETClass: exception.FinalizeStackTest_jetExit code: 1 Err: Loading error /export/users/cc/cc-suites/build/checkouts/snapshot/hdk/jdk/jre/bin/default/libgc_gen.so: undefined symbol: _Z23free_set_pool_put_entryP12Vector_BlockP11GC_Metadata
GC library cannot be loaded: libgc_gen.so
HMYEXEL062E Internal VM error: Failed to create Java VM
FAILED to invoke JVM.
Test: interpreterClass: exception.NPE_intExit code: 1 Err: Loading error /export/users/cc/cc-suites/build/checkouts/snapshot/hdk/jdk/jre/bin/default/libgc_gen.so: undefined symbol: _Z23free_set_pool_put_entryP12Vector_BlockP11GC_Metadata
GC library cannot be loaded: libgc_gen.so
HMYEXEL062E Internal VM error: Failed to create Java VM
FAILED to invoke JVM.
Test: jitrino.JETClass: exception.NPE_jetExit code: 1 Err: Loading error /export/users/cc/cc-suites/build/checkouts/snapshot/hdk/jdk/jre/bin/default/libgc_gen.so: undefined symbol: _Z23free_set_pool_put_entryP12Vector_BlockP11GC_Metadata
GC library cannot be loaded: libgc_gen.so
HMYEXEL062E Internal VM error: Failed to create Java VM
FAILED to invoke JVM.
Test: Client mode JIT (default)Class: exception.NPE_jitExit code: 1 Err: Loading error /export/users/cc/cc-suites/build/checkouts/snapshot/hdk/jdk/jre/bin/default/libgc_gen.so: undefined symbol: _Z23free_set_pool_put_entryP12Vector_BlockP11GC_Metadata
GC library cannot be loaded: libgc_gen.so
HMYEXEL062E Internal VM error: Failed to create Java VM
FAILED to invoke JVM.
Test: jitrino.OPTClass: exception.NPE_optExit code: 1 Err: Loading error /export/users/cc/cc-suites/build/checkouts/snapshot/hdk/jdk/jre/bin/default/libgc_gen.so: undefined symbol: _Z23free_set_pool_put_entryP12Vector_BlockP11GC_Metadata
GC library cannot be loaded: libgc_gen.so
HMYEXEL062E Internal VM error: Failed to create Java VM
FAILED to invoke JVM.
Test: Server mode JITClass: exception.NPE_srvExit code: 1 Err: Loading error /export/users/cc/cc-suites/build/checkouts/snapshot/hdk/jdk/jre/bin/default/libgc_gen.so: undefined symbol: _Z23free_set_pool_put_entryP12Vector_BlockP11GC_Metadata
GC library cannot be loaded: libgc_gen.so
HMYEXEL062E Internal VM error: Failed to create Java VM
FAILED to invoke JVM.
Test: interpreterClass: gc.FinAlloc_intExit code: 1 Err: Loading error /export/users/cc/cc-suites/build/checkouts/snapshot/hdk/jdk/jre/bin/default/libgc_gen.so: undefined symbol: _Z23free_set_pool_put_entryP12Vector_BlockP11GC_Metadata
GC library cannot be loaded: libgc_gen.so
HMYEXEL062E Internal VM error: Failed to create Java VM
FAILED to invoke JVM.
Test: jitrino.JETClass: gc.FinAlloc_jetExit code: 1 Err: Loading error /export/users/cc/cc-suites/build/checkouts/snapshot/hdk/jdk/jre/bin/default/libgc_gen.so: undefined symbol: _Z23free_set_pool_put_entryP12Vector_BlockP11GC_Metadata
GC library cannot be loaded: libgc_gen.so
HMYEXEL062E Internal VM error: Failed to create Java VM
FAILED to invoke JVM.
Test: Client mode JIT (default)Class: gc.FinAlloc_jitExit code: 1 Err: Loading error /export/users/cc/cc-suites/build/checkouts/snapshot/hdk/jdk/jre/bin/default/libgc_gen.so: undefined symbol: _Z23free_set_pool_put_entryP12Vector_BlockP11GC_Metadata
GC library cannot be loaded: libgc_gen.so
HMYEXEL062E Internal VM error: Failed to create Java VM
FAILED to invoke JVM.
Test: jitrino.OPTClass: gc.FinAlloc_optExit code: 1 Err: Loading error /export/users/cc/cc-suites/build/checkouts/snapshot/hdk/jdk/jre/bin/default/libgc_gen.so: undefined symbol: _Z23free_set_pool_put_entryP12Vector_BlockP11GC_Metadata
GC library cannot be loaded: libgc_gen.so
HMYEXEL062E Internal VM error: Failed to create Java VM
FAILED to invoke JVM.
Test: Server mode JITClass: gc.FinAlloc_srvExit code: 1 Err: Loading error /export/users/cc/cc-suites/build/checkouts/snapshot/hdk/jdk/jre/bin/default/libgc_gen.so: undefined symbol: _Z23free_set_pool_put_entryP12Vector_BlockP11GC_Metadata
GC library cannot be loaded: libgc_gen.so
HMYEXEL062E Internal VM error: Failed to create Java VM
FAILED to invoke JVM.
Test: interpreterClass: gc.Finalizer_intExit code: 1 Err: Loading error /export/users/cc/cc-suites/build/checkouts/snapshot/hdk/jdk/jre/bin/default/libgc_gen.so: undefined symbol: _Z23free_set_pool_put_entryP12Vector_BlockP11GC_Metadata
GC library cannot be loaded: libgc_gen.so
HMYEXEL062E Internal VM error: Failed to create Java VM
FAILED to invoke JVM.
Test: jitrino.JETClass: gc.Finalizer_jetExit code: 1 Err: Loading error /export/users/cc/cc-suites/build/checkouts/snapshot/hdk/jdk/jre/bin/default/libgc_gen.so: undefined symbol: _Z23free_set_pool_put_entryP12Vector_BlockP11GC_Metadata
GC library cannot be loaded: libgc_gen.so
HMYEXEL062E Internal VM error: Failed to create Java VM
FAILED to invoke JVM.
Test: Client mode JIT (default)Class: gc.Finalizer_jitExit code: 1 Err: Loading error /export/users/cc/cc-suites/build/checkouts/snapshot/hdk/jdk/jre/bin/default/libgc_gen.so: undefined symbol: _Z23free_set_pool_put_entryP12Vector_BlockP11GC_Metadata
GC library cannot be loaded: libgc_gen.so
HMYEXEL062E Internal VM error: Failed to create Java VM
FAILED to invoke JVM.
Test: jitrino.OPTClass: gc.Finalizer_optExit code: 1 Err: Loading error /export/users/cc/cc-suites/build/checkouts/snapshot/hdk/jdk/jre/bin/default/libgc_gen.so: undefined symbol: _Z23free_set_pool_put_entryP12Vector_BlockP11GC_Metadata
GC library cannot be loaded: libgc_gen.so
HMYEXEL062E Internal VM error: Failed to create Java VM
FAILED to invoke JVM.
Test: Server mode JITClass: gc.Finalizer_srvExit code: 1 Err: Loading error /export/users/cc/cc-suites/build/checkouts/snapshot/hdk/jdk/jre/bin/default/libgc_gen.so: undefined symbol: _Z23free_set_pool_put_entryP12Vector_BlockP11GC_Metadata
GC library cannot be loaded: libgc_gen.so
HMYEXEL062E Internal VM error: Failed to create Java VM
FAILED to invoke JVM.
Test: interpreterClass: gc.Force_intExit code: 1 Err: Loading error /export/users/cc/cc-suites/build/checkouts/snapshot/hdk/jdk/jre/bin/default/libgc_gen.so: undefined symbol: _Z23free_set_pool_put_entryP12Vector_BlockP11GC_Metadata
GC library cannot be loaded: libgc_gen.so
HMYEXEL062E Internal VM error: Failed to create Java VM
FAILED to invoke JVM.
Test: jitrino.JETClass: gc.Force_jetExit code: 1 Err: Loading error /export/users/cc/cc-suites/build/checkouts/snapshot/hdk/jdk/jre/bin/default/libgc_gen.so: undefined symbol: _Z23free_set_pool_put_entryP12Vector_BlockP11GC_Metadata
GC library cannot be loaded: libgc_gen.so
HMYEXEL062E Internal VM error: Failed to create Java VM
FAILED to invoke JVM.
Test: Client mode JIT (default)Class: gc.Force_jitExit code: 1 Err: Loading error /export/users/cc/cc-suites/build/checkouts/snapshot/hdk/jdk/jre/bin/default/libgc_gen.so: undefined symbol: _Z23free_set_pool_put_entryP12Vector_BlockP11GC_Metadata
GC library cannot be loaded: libgc_gen.so
HMYEXEL062E Internal VM error: Failed to create Java VM
FAILED to invoke JVM.
Test: jitrino.OPTClass: gc.Force_optExit code: 1 Err: Loading error /export/users/cc/cc-suites/build/checkouts/snapshot/hdk/jdk/jre/bin/default/libgc_gen.so: undefined symbol: _Z23free_set_pool_put_entryP12Vector_BlockP11GC_Metadata
GC library cannot be loaded: libgc_gen.so
HMYEXEL062E Internal VM error: Failed to create Java VM
FAILED to invoke JVM.
Test: Server mode JITClass: gc.Force_srvExit code: 1 Err: Loading error /export/users/cc/cc-suites/build/checkouts/snapshot/hdk/jdk/jre/bin/default/libgc_gen.so: undefined symbol: _Z23free_set_pool_put_entryP12Vector_BlockP11GC_Metadata
GC library cannot be loaded: libgc_gen.so
HMYEXEL062E Internal VM error: Failed to create Java VM
FAILED to invoke JVM.
Test: interpreterClass: gc.Fragment_intExit code: 1 Err: Loading error /export/users/cc/cc-suites/build/checkouts/snapshot/hdk/jdk/jre/bin/default/libgc_gen.so: undefined symbol: _Z23free_set_pool_put_entryP12Vector_BlockP11GC_Metadata
GC library cannot be loaded: libgc_gen.so
HMYEXEL062E Internal VM error: Failed to create Java VM
FAILED to invoke JVM.
Test: jitrino.JETClass: gc.Fragment_jetExit code: 1 Err: Loading error /export/users/cc/cc-suites/build/checkouts/snapshot/hdk/jdk/jre/bin/default/libgc_gen.so: undefined symbol: _Z23free_set_pool_put_entryP12Vector_BlockP11GC_Metadata
GC library cannot be loaded: libgc_gen.so
HMYEXEL062E Internal VM error: Failed to create Java VM
FAILED to invoke JVM.
Test: Client mode JIT (default)Class: gc.Fragment_jitExit code: 1 Err: Loading error /export/users/cc/cc-suites/build/checkouts/snapshot/hdk/jdk/jre/bin/default/libgc_gen.so: undefined symbol: _Z23free_set_pool_put_entryP12Vector_BlockP11GC_Metadata
GC library cannot be loaded: libgc_gen.so
HMYEXEL062E Internal VM error: Failed to create Java VM
FAILED to invoke JVM.
Test: jitrino.OPTClass: gc.Fragment_optExit code: 1 Err: Loading error /export/users/cc/cc-suites/build/checkouts/snapshot/hdk/jdk/jre/bin/default/libgc_gen.so: undefined symbol: _Z23free_set_pool_put_entryP12Vector_BlockP11GC_Metadata
GC library cannot be loaded: libgc_gen.so
HMYEXEL062E Internal VM error: Failed to create Java VM
FAILED to invoke JVM.
Test: Server mode JITClass: gc.Fragment_srvExit code: 1 Err: Loading error /export/users/cc/cc-suites/build/checkouts/snapshot/hdk/jdk/jre/bin/default/libgc_gen.so: undefined symbol: _Z23free_set_pool_put_entryP12Vector_BlockP11GC_Metadata
GC library cannot be loaded: libgc_gen.so
HMYEXEL062E Internal VM error: Failed to create Java VM
FAILED to invoke JVM.
Test: interpreterClass: gc.Free_intExit code: 1 Err: Loading error /export/users/cc/cc-suites/build/checkouts/snapshot/hdk/jdk/jre/bin/default/libgc_gen.so: undefined symbol: _Z23free_set_pool_put_entryP12Vector_BlockP11GC_Metadata
GC library cannot be loaded: libgc_gen.so
HMYEXEL062E Internal VM error: Failed to create Java VM
FAILED to invoke JVM.
Test: jitrino.JETClass: gc.Free_jetExit code: 1 Err: Loading error /export/users/cc/cc-suites/build/checkouts/snapshot/hdk/jdk/jre/bin/default/libgc_gen.so: undefined symbol: _Z23free_set_pool_put_entryP12Vector_BlockP11GC_Metadata
GC library cannot be loaded: libgc_gen.so
HMYEXEL062E Internal VM error: Failed to create Java VM
FAILED to invoke JVM.
Test: Client mode JIT (default)Class: gc.Free_jitExit code: 1 Err: Loading error /export/users/cc/cc-suites/build/checkouts/snapshot/hdk/jdk/jre/bin/default/libgc_gen.so: undefined symbol: _Z23free_set_pool_put_entryP12Vector_BlockP11GC_Metadata
GC library cannot be loaded: libgc_gen.so
HMYEXEL062E Internal VM error: Failed to create Java VM
FAILED to invoke JVM.
Test: jitrino.OPTClass: gc.Free_optExit code: 1 Err: Loading error /export/users/cc/cc-suites/build/checkouts/snapshot/hdk/jdk/jre/bin/default/libgc_gen.so: undefined symbol: _Z23free_set_pool_put_entryP12Vector_BlockP11GC_Metadata
GC library cannot be loaded: libgc_gen.so
HMYEXEL062E Internal VM error: Failed to create Java VM
FAILED to invoke JVM.
Test: Server mode JITClass: gc.Free_srvExit code: 1 Err: Loading error /export/users/cc/cc-suites/build/checkouts/snapshot/hdk/jdk/jre/bin/default/libgc_gen.so: undefined symbol: _Z23free_set_pool_put_entryP12Vector_BlockP11GC_Metadata
GC library cannot be loaded: libgc_gen.so
HMYEXEL062E Internal VM error: Failed to create Java VM
FAILED to invoke JVM.
Test: interpreterClass: gc.LOS_intExit code: 1 Err: Loading error /export/users/cc/cc-suites/build/checkouts/snapshot/hdk/jdk/jre/bin/default/libgc_gen.so: undefined symbol: _Z23free_set_pool_put_entryP12Vector_BlockP11GC_Metadata
GC library cannot be loaded: libgc_gen.so
HMYEXEL062E Internal VM error: Failed to create Java VM
FAILED to invoke JVM.
Test: jitrino.JETClass: gc.LOS_jetExit code: 1 Err: Loading error /export/users/cc/cc-suites/build/checkouts/snapshot/hdk/jdk/jre/bin/default/libgc_gen.so: undefined symbol: _Z23free_set_pool_put_entryP12Vector_BlockP11GC_Metadata
GC library cannot be loaded: libgc_gen.so
HMYEXEL062E Internal VM error: Failed to create Java VM
FAILED to invoke JVM.
Test: Client mode JIT (default)Class: gc.LOS_jitExit code: 1 Err: Loading error /export/users/cc/cc-suites/build/checkouts/snapshot/hdk/jdk/jre/bin/default/libgc_gen.so: undefined symbol: _Z23free_set_pool_put_entryP12Vector_BlockP11GC_Metadata
GC library cannot be loaded: libgc_gen.so
HMYEXEL062E Internal VM error: Failed to create Java VM
FAILED to invoke JVM.
Test: jitrino.OPTClass: gc.LOS_optExit code: 1 Err: Loading error /export/users/cc/cc-suites/build/checkouts/snapshot/hdk/jdk/jre/bin/default/libgc_gen.so: undefined symbol: _Z23free_set_pool_put_entryP12Vector_BlockP11GC_Metadata
GC library cannot be loaded: libgc_gen.so
HMYEXEL062E Internal VM error: Failed to create Java VM
FAILED to invoke JVM.
Test: Server mode JITClass: gc.LOS_srvExit code: 1 Err: Loading error /export/users/cc/cc-suites/build/checkouts/snapshot/hdk/jdk/jre/bin/default/libgc_gen.so: undefined symbol: _Z23free_set_pool_put_entryP12Vector_BlockP11GC_Metadata
GC library cannot be loaded: libgc_gen.so
HMYEXEL062E Internal VM error: Failed to create Java VM
FAILED to invoke JVM.
Test: interpreterClass: gc.List_intExit code: 1 Err: Loading error /export/users/cc/cc-suites/build/checkouts/snapshot/hdk/jdk/jre/bin/default/libgc_gen.so: undefined symbol: _Z23free_set_pool_put_entryP12Vector_BlockP11GC_Metadata
GC library cannot be loaded: libgc_gen.so
HMYEXEL062E Internal VM error: Failed to create Java VM
FAILED to invoke JVM.
Test: jitrino.JETClass: gc.List_jetExit code: 1 Err: Loading error /export/users/cc/cc-suites/build/checkouts/snapshot/hdk/jdk/jre/bin/default/libgc_gen.so: undefined symbol: _Z23free_set_pool_put_entryP12Vector_BlockP11GC_Metadata
GC library cannot be loaded: libgc_gen.so
HMYEXEL062E Internal VM error: Failed to create Java VM
FAILED to invoke JVM.
Test: Client mode JIT (default)Class: gc.List_jitExit code: 1 Err: Loading error /export/users/cc/cc-suites/build/checkouts/snapshot/hdk/jdk/jre/bin/default/libgc_gen.so: undefined symbol: _Z23free_set_pool_put_entryP12Vector_BlockP11GC_Metadata
GC library cannot be loaded: libgc_gen.so
HMYEXEL062E Internal VM error: Failed to create Java VM
FAILED to invoke JVM.
Test: jitrino.OPTClass: gc.List_optExit code: 1 Err: Loading error /export/users/cc/cc-suites/build/checkouts/snapshot/hdk/jdk/jre/bin/default/libgc_gen.so: undefined symbol: _Z23free_set_pool_put_entryP12Vector_BlockP11GC_Metadata
GC library cannot be loaded: libgc_gen.so
HMYEXEL062E Internal VM error: Failed to create Java VM
FAILED to invoke JVM.
Test: Server mode JITClass: gc.List_srvExit code: 1 Err: Loading error /export/users/cc/cc-suites/build/checkouts/snapshot/hdk/jdk/jre/bin/default/libgc_gen.so: undefined symbol: _Z23free_set_pool_put_entryP12Vector_BlockP11GC_Metadata
GC library cannot be loaded: libgc_gen.so
HMYEXEL062E Internal VM error: Failed to create Java VM
FAILED to invoke JVM.
Test: jitrino.JETClass: gc.Mark_jetExit code: 1 Err: Loading error /export/users/cc/cc-suites/build/checkouts/snapshot/hdk/jdk/jre/bin/default/libgc_gen.so: undefined symbol: _Z23free_set_pool_put_entryP12Vector_BlockP11GC_Metadata
GC library cannot be loaded: libgc_gen.so
HMYEXEL062E Internal VM error: Failed to create Java VM
FAILED to invoke JVM.
Test: Client mode JIT (default)Class: gc.Mark_jitExit code: 1 Err: Loading error /export/users/cc/cc-suites/build/checkouts/snapshot/hdk/jdk/jre/bin/default/libgc_gen.so: undefined symbol: _Z23free_set_pool_put_entryP12Vector_BlockP11GC_Metadata
GC library cannot be loaded: libgc_gen.so
HMYEXEL062E Internal VM error: Failed to create Java VM
FAILED to invoke JVM.
Test: jitrino.OPTClass: gc.Mark_optExit code: 1 Err: Loading error /export/users/cc/cc-suites/build/checkouts/snapshot/hdk/jdk/jre/bin/default/libgc_gen.so: undefined symbol: _Z23free_set_pool_put_entryP12Vector_BlockP11GC_Metadata
GC library cannot be loaded: libgc_gen.so
HMYEXEL062E Internal VM error: Failed to create Java VM
FAILED to invoke JVM.
Test: Server mode JITClass: gc.Mark_srvExit code: 1 Err: Loading error /export/users/cc/cc-suites/build/checkouts/snapshot/hdk/jdk/jre/bin/default/libgc_gen.so: undefined symbol: _Z23free_set_pool_put_entryP12Vector_BlockP11GC_Metadata
GC library cannot be loaded: libgc_gen.so
HMYEXEL062E Internal VM error: Failed to create Java VM
FAILED to invoke JVM.
Test: interpreterClass: gc.MultiThreads_intExit code: 1 Err: Loading error /export/users/cc/cc-suites/build/checkouts/snapshot/hdk/jdk/jre/bin/default/libgc_gen.so: undefined symbol: _Z23free_set_pool_put_entryP12Vector_BlockP11GC_Metadata
GC library cannot be loaded: libgc_gen.so
HMYEXEL062E Internal VM error: Failed to create Java VM
FAILED to invoke JVM.
Test: jitrino.JETClass: gc.MultiThreads_jetExit code: 1 Err: Loading error /export/users/cc/cc-suites/build/checkouts/snapshot/hdk/jdk/jre/bin/default/libgc_gen.so: undefined symbol: _Z23free_set_pool_put_entryP12Vector_BlockP11GC_Metadata
GC library cannot be loaded: libgc_gen.so
HMYEXEL062E Internal VM error: Failed to create Java VM
FAILED to invoke JVM.
Test: Client mode JIT (default)Class: gc.MultiThreads_jitExit code: 1 Err: Loading error /export/users/cc/cc-suites/build/checkouts/snapshot/hdk/jdk/jre/bin/default/libgc_gen.so: undefined symbol: _Z23free_set_pool_put_entryP12Vector_BlockP11GC_Metadata
GC library cannot be loaded: libgc_gen.so
HMYEXEL062E Internal VM error: Failed to create Java VM
FAILED to invoke JVM.
Test: jitrino.OPTClass: gc.MultiThreads_optExit code: 1 Err: Loading error /export/users/cc/cc-suites/build/checkouts/snapshot/hdk/jdk/jre/bin/default/libgc_gen.so: undefined symbol: _Z23free_set_pool_put_entryP12Vector_BlockP11GC_Metadata
GC library cannot be loaded: libgc_gen.so
HMYEXEL062E Internal VM error: Failed to create Java VM
FAILED to invoke JVM.
Test: Server mode JITClass: gc.MultiThreads_srvExit code: 1 Err: Loading error /export/users/cc/cc-suites/build/checkouts/snapshot/hdk/jdk/jre/bin/default/libgc_gen.so: undefined symbol: _Z23free_set_pool_put_entryP12Vector_BlockP11GC_Metadata
GC library cannot be loaded: libgc_gen.so
HMYEXEL062E Internal VM error: Failed to create Java VM
FAILED to invoke JVM.
Test: interpreterClass: gc.NPE_intExit code: 1 Err: Loading error /export/users/cc/cc-suites/build/checkouts/snapshot/hdk/jdk/jre/bin/default/libgc_gen.so: undefined symbol: _Z23free_set_pool_put_entryP12Vector_BlockP11GC_Metadata
GC library cannot be loaded: libgc_gen.so
HMYEXEL062E Internal VM error: Failed to create Java VM
FAILED to invoke JVM.
Test: interpreterClass: gc.PhantomReferenceQueueTest_intExit code: 1 Err: Loading error /export/users/cc/cc-suites/build/checkouts/snapshot/hdk/jdk/jre/bin/default/libgc_gen.so: undefined symbol: _Z23free_set_pool_put_entryP12Vector_BlockP11GC_Metadata
GC library cannot be loaded: libgc_gen.so
HMYEXEL062E Internal VM error: Failed to create Java VM
FAILED to invoke JVM.
Test: jitrino.JETClass: gc.PhantomReferenceQueueTest_jetExit code: 1 Err: Loading error /export/users/cc/cc-suites/build/checkouts/snapshot/hdk/jdk/jre/bin/default/libgc_gen.so: undefined symbol: _Z23free_set_pool_put_entryP12Vector_BlockP11GC_Metadata
GC library cannot be loaded: libgc_gen.so
HMYEXEL062E Internal VM error: Failed to create Java VM
FAILED to invoke JVM.
Test: Client mode JIT (default)Class: gc.PhantomReferenceQueueTest_jitExit code: 1 Err: Loading error /export/users/cc/cc-suites/build/checkouts/snapshot/hdk/jdk/jre/bin/default/libgc_gen.so: undefined symbol: _Z23free_set_pool_put_entryP12Vector_BlockP11GC_Metadata
GC library cannot be loaded: libgc_gen.so
HMYEXEL062E Internal VM error: Failed to create Java VM
FAILED to invoke JVM.
Test: jitrino.OPTClass: gc.PhantomReferenceQueueTest_optExit code: 1 Err: Loading error /export/users/cc/cc-suites/build/checkouts/snapshot/hdk/jdk/jre/bin/default/libgc_gen.so: undefined symbol: _Z23free_set_pool_put_entryP12Vector_BlockP11GC_Metadata
GC library cannot be loaded: libgc_gen.so
HMYEXEL062E Internal VM error: Failed to create Java VM
FAILED to invoke JVM.
Test: Server mode JITClass: gc.PhantomReferenceQueueTest_srvExit code: 1 Err: Loading error /export/users/cc/cc-suites/build/checkouts/snapshot/hdk/jdk/jre/bin/default/libgc_gen.so: undefined symbol: _Z23free_set_pool_put_entryP12Vector_BlockP11GC_Metadata
GC library cannot be loaded: libgc_gen.so
HMYEXEL062E Internal VM error: Failed to create Java VM
FAILED to invoke JVM.
Test: interpreterClass: gc.RefRemove_intExit code: 1 Err: Loading error /export/users/cc/cc-suites/build/checkouts/snapshot/hdk/jdk/jre/bin/default/libgc_gen.so: undefined symbol: _Z23free_set_pool_put_entryP12Vector_BlockP11GC_Metadata
GC library cannot be loaded: libgc_gen.so
HMYEXEL062E Internal VM error: Failed to create Java VM
FAILED to invoke JVM.
Test: jitrino.JETClass: gc.RefRemove_jetExit code: 1 Err: Loading error /export/users/cc/cc-suites/build/checkouts/snapshot/hdk/jdk/jre/bin/default/libgc_gen.so: undefined symbol: _Z23free_set_pool_put_entryP12Vector_BlockP11GC_Metadata
GC library cannot be loaded: libgc_gen.so
HMYEXEL062E Internal VM error: Failed to create Java VM
FAILED to invoke JVM.
Test: Client mode JIT (default)Class: gc.RefRemove_jitExit code: 1 Err: Loading error /export/users/cc/cc-suites/build/checkouts/snapshot/hdk/jdk/jre/bin/default/libgc_gen.so: undefined symbol: _Z23free_set_pool_put_entryP12Vector_BlockP11GC_Metadata
GC library cannot be loaded: libgc_gen.so
HMYEXEL062E Internal VM error: Failed to create Java VM
FAILED to invoke JVM.
Test: jitrino.OPTClass: gc.RefRemove_optExit code: 1 Err: Loading error /export/users/cc/cc-suites/build/checkouts/snapshot/hdk/jdk/jre/bin/default/libgc_gen.so: undefined symbol: _Z23free_set_pool_put_entryP12Vector_BlockP11GC_Metadata
GC library cannot be loaded: libgc_gen.so
HMYEXEL062E Internal VM error: Failed to create Java VM
FAILED to invoke JVM.
Test: Server mode JITClass: gc.RefRemove_srvExit code: 1 Err: Loading error /export/users/cc/cc-suites/build/checkouts/snapshot/hdk/jdk/jre/bin/default/libgc_gen.so: undefined symbol: _Z23free_set_pool_put_entryP12Vector_BlockP11GC_Metadata
GC library cannot be loaded: libgc_gen.so
HMYEXEL062E Internal VM error: Failed to create Java VM
FAILED to invoke JVM.
Test: interpreterClass: gc.RunFinalizersOnExitTest_intExit code: 1 Err: Loading error /export/users/cc/cc-suites/build/checkouts/snapshot/hdk/jdk/jre/bin/default/libgc_gen.so: undefined symbol: _Z23free_set_pool_put_entryP12Vector_BlockP11GC_Metadata
GC library cannot be loaded: libgc_gen.so
HMYEXEL062E Internal VM error: Failed to create Java VM
FAILED to invoke JVM.
Test: jitrino.JETClass: gc.RunFinalizersOnExitTest_jetExit code: 1 Err: Loading error /export/users/cc/cc-suites/build/checkouts/snapshot/hdk/jdk/jre/bin/default/libgc_gen.so: undefined symbol: _Z23free_set_pool_put_entryP12Vector_BlockP11GC_Metadata
GC library cannot be loaded: libgc_gen.so
HMYEXEL062E Internal VM error: Failed to create Java VM
FAILED to invoke JVM.
Test: Client mode JIT (default)Class: gc.RunFinalizersOnExitTest_jitExit code: 1 Err: Loading error /export/users/cc/cc-suites/build/checkouts/snapshot/hdk/jdk/jre/bin/default/libgc_gen.so: undefined symbol: _Z23free_set_pool_put_entryP12Vector_BlockP11GC_Metadata
GC library cannot be loaded: libgc_gen.so
HMYEXEL062E Internal VM error: Failed to create Java VM
FAILED to invoke JVM.
Test: jitrino.OPTClass: gc.RunFinalizersOnExitTest_optExit code: 1 Err: Loading error /export/users/cc/cc-suites/build/checkouts/snapshot/hdk/jdk/jre/bin/default/libgc_gen.so: undefined symbol: _Z23free_set_pool_put_entryP12Vector_BlockP11GC_Metadata
GC library cannot be loaded: libgc_gen.so
HMYEXEL062E Internal VM error: Failed to create Java VM
FAILED to invoke JVM.
Test: Server mode JITClass: gc.RunFinalizersOnExitTest_srvExit code: 1 Err: Loading error /export/users/cc/cc-suites/build/checkouts/snapshot/hdk/jdk/jre/bin/default/libgc_gen.so: undefined symbol: _Z23free_set_pool_put_entryP12Vector_BlockP11GC_Metadata
GC library cannot be loaded: libgc_gen.so
HMYEXEL062E Internal VM error: Failed to create Java VM
FAILED to invoke JVM.
Test: interpreterClass: gc.StressRef_intExit code: 1 Err: Loading error /export/users/cc/cc-suites/build/checkouts/snapshot/hdk/jdk/jre/bin/default/libgc_gen.so: undefined symbol: _Z23free_set_pool_put_entryP12Vector_BlockP11GC_Metadata
GC library cannot be loaded: libgc_gen.so
HMYEXEL062E Internal VM error: Failed to create Java VM
FAILED to invoke JVM.
Test: jitrino.JETClass: gc.StressRef_jetExit code: 1 Err: Loading error /export/users/cc/cc-suites/build/checkouts/snapshot/hdk/jdk/jre/bin/default/libgc_gen.so: undefined symbol: _Z23free_set_pool_put_entryP12Vector_BlockP11GC_Metadata
GC library cannot be loaded: libgc_gen.so
HMYEXEL062E Internal VM error: Failed to create Java VM
FAILED to invoke JVM.
Test: Client mode JIT (default)Class: gc.StressRef_jitExit code: 1 Err: Loading error /export/users/cc/cc-suites/build/checkouts/snapshot/hdk/jdk/jre/bin/default/libgc_gen.so: undefined symbol: _Z23free_set_pool_put_entryP12Vector_BlockP11GC_Metadata
GC library cannot be loaded: libgc_gen.so
HMYEXEL062E Internal VM error: Failed to create Java VM
FAILED to invoke JVM.
Test: jitrino.OPTClass: gc.StressRef_optExit code: 1 Err: Loading error /export/users/cc/cc-suites/build/checkouts/snapshot/hdk/jdk/jre/bin/default/libgc_gen.so: undefined symbol: _Z23free_set_pool_put_entryP12Vector_BlockP11GC_Metadata
GC library cannot be loaded: libgc_gen.so
HMYEXEL062E Internal VM error: Failed to create Java VM
FAILED to invoke JVM.
Test: Server mode JITClass: gc.StressRef_srvExit code: 1 Err: Loading error /export/users/cc/cc-suites/build/checkouts/snapshot/hdk/jdk/jre/bin/default/libgc_gen.so: undefined symbol: _Z23free_set_pool_put_entryP12Vector_BlockP11GC_Metadata
GC library cannot be loaded: libgc_gen.so
HMYEXEL062E Internal VM error: Failed to create Java VM
FAILED to invoke JVM.
Test: interpreterClass: gc.SynchronizedFinalizersTest_intExit code: 1 Err: Loading error /export/users/cc/cc-suites/build/checkouts/snapshot/hdk/jdk/jre/bin/default/libgc_gen.so: undefined symbol: _Z23free_set_pool_put_entryP12Vector_BlockP11GC_Metadata
GC library cannot be loaded: libgc_gen.so
HMYEXEL062E Internal VM error: Failed to create Java VM
FAILED to invoke JVM.
Test: jitrino.JETClass: gc.SynchronizedFinalizersTest_jetExit code: 1 Err: Loading error /export/users/cc/cc-suites/build/checkouts/snapshot/hdk/jdk/jre/bin/default/libgc_gen.so: undefined symbol: _Z23free_set_pool_put_entryP12Vector_BlockP11GC_Metadata
GC library cannot be loaded: libgc_gen.so
HMYEXEL062E Internal VM error: Failed to create Java VM
FAILED to invoke JVM.
Test: Client mode JIT (default)Class: gc.SynchronizedFinalizersTest_jitExit code: 1 Err: Loading error /export/users/cc/cc-suites/build/checkouts/snapshot/hdk/jdk/jre/bin/default/libgc_gen.so: undefined symbol: _Z23free_set_pool_put_entryP12Vector_BlockP11GC_Metadata
GC library cannot be loaded: libgc_gen.so
HMYEXEL062E Internal VM error: Failed to create Java VM
FAILED to invoke JVM.
Test: jitrino.OPTClass: gc.SynchronizedFinalizersTest_optExit code: 1 Err: Loading error /export/users/cc/cc-suites/build/checkouts/snapshot/hdk/jdk/jre/bin/default/libgc_gen.so: undefined symbol: _Z23free_set_pool_put_entryP12Vector_BlockP11GC_Metadata
GC library cannot be loaded: libgc_gen.so
HMYEXEL062E Internal VM error: Failed to create Java VM
FAILED to invoke JVM.
Test: Server mode JITClass: gc.SynchronizedFinalizersTest_srvExit code: 1 Err: Loading error /export/users/cc/cc-suites/build/checkouts/snapshot/hdk/jdk/jre/bin/default/libgc_gen.so: undefined symbol: _Z23free_set_pool_put_entryP12Vector_BlockP11GC_Metadata
GC library cannot be loaded: libgc_gen.so
HMYEXEL062E Internal VM error: Failed to create Java VM
FAILED to invoke JVM.
Test: interpreterClass: gc.ThreadSuspension_intExit code: 1 Err: Loading error /export/users/cc/cc-suites/build/checkouts/snapshot/hdk/jdk/jre/bin/default/libgc_gen.so: undefined symbol: _Z23free_set_pool_put_entryP12Vector_BlockP11GC_Metadata
GC library cannot be loaded: libgc_gen.so
HMYEXEL062E Internal VM error: Failed to create Java VM
FAILED to invoke JVM.
Test: jitrino.JETClass: gc.ThreadSuspension_jetExit code: 1 Err: Loading error /export/users/cc/cc-suites/build/checkouts/snapshot/hdk/jdk/jre/bin/default/libgc_gen.so: undefined symbol: _Z23free_set_pool_put_entryP12Vector_BlockP11GC_Metadata
GC library cannot be loaded: libgc_gen.so
HMYEXEL062E Internal VM error: Failed to create Java VM
FAILED to invoke JVM.
Test: Client mode JIT (default)Class: gc.ThreadSuspension_jitExit code: 1 Err: Loading error /export/users/cc/cc-suites/build/checkouts/snapshot/hdk/jdk/jre/bin/default/libgc_gen.so: undefined symbol: _Z23free_set_pool_put_entryP12Vector_BlockP11GC_Metadata
GC library cannot be loaded: libgc_gen.so
HMYEXEL062E Internal VM error: Failed to create Java VM
FAILED to invoke JVM.
Test: jitrino.OPTClass: gc.ThreadSuspension_optExit code: 1 Err: Loading error /export/users/cc/cc-suites/build/checkouts/snapshot/hdk/jdk/jre/bin/default/libgc_gen.so: undefined symbol: _Z23free_set_pool_put_entryP12Vector_BlockP11GC_Metadata
GC library cannot be loaded: libgc_gen.so
HMYEXEL062E Internal VM error: Failed to create Java VM
FAILED to invoke JVM.
Test: Server mode JITClass: gc.ThreadSuspension_srvExit code: 1 Err: Loading error /export/users/cc/cc-suites/build/checkouts/snapshot/hdk/jdk/jre/bin/default/libgc_gen.so: undefined symbol: _Z23free_set_pool_put_entryP12Vector_BlockP11GC_Metadata
GC library cannot be loaded: libgc_gen.so
HMYEXEL062E Internal VM error: Failed to create Java VM
FAILED to invoke JVM.
Test: interpreterClass: init.ErrorInInitializer_intExit code: 1 Err: Loading error /export/users/cc/cc-suites/build/checkouts/snapshot/hdk/jdk/jre/bin/default/libgc_gen.so: undefined symbol: _Z23free_set_pool_put_entryP12Vector_BlockP11GC_Metadata
GC library cannot be loaded: libgc_gen.so
HMYEXEL062E Internal VM error: Failed to create Java VM
FAILED to invoke JVM.
Test: jitrino.JETClass: init.ErrorInInitializer_jetExit code: 1 Err: Loading error /export/users/cc/cc-suites/build/checkouts/snapshot/hdk/jdk/jre/bin/default/libgc_gen.so: undefined symbol: _Z23free_set_pool_put_entryP12Vector_BlockP11GC_Metadata
GC library cannot be loaded: libgc_gen.so
HMYEXEL062E Internal VM error: Failed to create Java VM
FAILED to invoke JVM.
Test: Client mode JIT (default)Class: init.ErrorInInitializer_jitExit code: 1 Err: Loading error /export/users/cc/cc-suites/build/checkouts/snapshot/hdk/jdk/jre/bin/default/libgc_gen.so: undefined symbol: _Z23free_set_pool_put_entryP12Vector_BlockP11GC_Metadata
GC library cannot be loaded: libgc_gen.so
HMYEXEL062E Internal VM error: Failed to create Java VM
FAILED to invoke JVM.
Test: jitrino.OPTClass: init.ErrorInInitializer_optExit code: 1 Err: Loading error /export/users/cc/cc-suites/build/checkouts/snapshot/hdk/jdk/jre/bin/default/libgc_gen.so: undefined symbol: _Z23free_set_pool_put_entryP12Vector_BlockP11GC_Metadata
GC library cannot be loaded: libgc_gen.so
HMYEXEL062E Internal VM error: Failed to create Java VM
FAILED to invoke JVM.
Test: Server mode JITClass: init.ErrorInInitializer_srvExit code: 1 Err: Loading error /export/users/cc/cc-suites/build/checkouts/snapshot/hdk/jdk/jre/bin/default/libgc_gen.so: undefined symbol: _Z23free_set_pool_put_entryP12Vector_BlockP11GC_Metadata
GC library cannot be loaded: libgc_gen.so
HMYEXEL062E Internal VM error: Failed to create Java VM
FAILED to invoke JVM.
Test: interpreterClass: init.Other_intExit code: 1 Err: Loading error /export/users/cc/cc-suites/build/checkouts/snapshot/hdk/jdk/jre/bin/default/libgc_gen.so: undefined symbol: _Z23free_set_pool_put_entryP12Vector_BlockP11GC_Metadata
GC library cannot be loaded: libgc_gen.so
HMYEXEL062E Internal VM error: Failed to create Java VM
FAILED to invoke JVM.
Test: jitrino.JETClass: init.Other_jetExit code: 1 Err: Loading error /export/users/cc/cc-suites/build/checkouts/snapshot/hdk/jdk/jre/bin/default/libgc_gen.so: undefined symbol: _Z23free_set_pool_put_entryP12Vector_BlockP11GC_Metadata
GC library cannot be loaded: libgc_gen.so
HMYEXEL062E Internal VM error: Failed to create Java VM
FAILED to invoke JVM.
Test: Client mode JIT (default)Class: init.Other_jitExit code: 1 Err: Loading error /export/users/cc/cc-suites/build/checkouts/snapshot/hdk/jdk/jre/bin/default/libgc_gen.so: undefined symbol: _Z23free_set_pool_put_entryP12Vector_BlockP11GC_Metadata
GC library cannot be loaded: libgc_gen.so
HMYEXEL062E Internal VM error: Failed to create Java VM
FAILED to invoke JVM.
Test: jitrino.OPTClass: init.Other_optExit code: 1 Err: Loading error /export/users/cc/cc-suites/build/checkouts/snapshot/hdk/jdk/jre/bin/default/libgc_gen.so: undefined symbol: _Z23free_set_pool_put_entryP12Vector_BlockP11GC_Metadata
GC library cannot be loaded: libgc_gen.so
HMYEXEL062E Internal VM error: Failed to create Java VM
FAILED to invoke JVM.
Test: Server mode JITClass: init.Other_srvExit code: 1 Err: Loading error /export/users/cc/cc-suites/build/checkouts/snapshot/hdk/jdk/jre/bin/default/libgc_gen.so: undefined symbol: _Z23free_set_pool_put_entryP12Vector_BlockP11GC_Metadata
GC library cannot be loaded: libgc_gen.so
HMYEXEL062E Internal VM error: Failed to create Java VM
FAILED to invoke JVM.
Test: interpreterClass: io.ArrayList_intExit code: 1 Err: Loading error /export/users/cc/cc-suites/build/checkouts/snapshot/hdk/jdk/jre/bin/default/libgc_gen.so: undefined symbol: _Z23free_set_pool_put_entryP12Vector_BlockP11GC_Metadata
GC library cannot be loaded: libgc_gen.so
HMYEXEL062E Internal VM error: Failed to create Java VM
FAILED to invoke JVM.
Test: jitrino.JETClass: io.ArrayList_jetExit code: 1 Err: Loading error /export/users/cc/cc-suites/build/checkouts/snapshot/hdk/jdk/jre/bin/default/libgc_gen.so: undefined symbol: _Z23free_set_pool_put_entryP12Vector_BlockP11GC_Metadata
GC library cannot be loaded: libgc_gen.so
HMYEXEL062E Internal VM error: Failed to create Java VM
FAILED to invoke JVM.
Test: Client mode JIT (default)Class: io.ArrayList_jitExit code: 1 Err: Loading error /export/users/cc/cc-suites/build/checkouts/snapshot/hdk/jdk/jre/bin/default/libgc_gen.so: undefined symbol: _Z23free_set_pool_put_entryP12Vector_BlockP11GC_Metadata
GC library cannot be loaded: libgc_gen.so
HMYEXEL062E Internal VM error: Failed to create Java VM
FAILED to invoke JVM.
Test: jitrino.OPTClass: io.ArrayList_optExit code: 1 Err: Loading error /export/users/cc/cc-suites/build/checkouts/snapshot/hdk/jdk/jre/bin/default/libgc_gen.so: undefined symbol: _Z23free_set_pool_put_entryP12Vector_BlockP11GC_Metadata
GC library cannot be loaded: libgc_gen.so
HMYEXEL062E Internal VM error: Failed to create Java VM
FAILED to invoke JVM.
Test: Server mode JITClass: io.ArrayList_srvExit code: 1 Err: Loading error /export/users/cc/cc-suites/build/checkouts/snapshot/hdk/jdk/jre/bin/default/libgc_gen.so: undefined symbol: _Z23free_set_pool_put_entryP12Vector_BlockP11GC_Metadata
GC library cannot be loaded: libgc_gen.so
HMYEXEL062E Internal VM error: Failed to create Java VM
FAILED to invoke JVM.
Test: jitrino.JETClass: io.Integers_jetExit code: 1 Err: Loading error /export/users/cc/cc-suites/build/checkouts/snapshot/hdk/jdk/jre/bin/default/libgc_gen.so: undefined symbol: _Z23free_set_pool_put_entryP12Vector_BlockP11GC_Metadata
GC library cannot be loaded: libgc_gen.so
HMYEXEL062E Internal VM error: Failed to create Java VM
FAILED to invoke JVM.
Test: Client mode JIT (default)Class: io.Integers_jitExit code: 1 Err: Loading error /export/users/cc/cc-suites/build/checkouts/snapshot/hdk/jdk/jre/bin/default/libgc_gen.so: undefined symbol: _Z23free_set_pool_put_entryP12Vector_BlockP11GC_Metadata
GC library cannot be loaded: libgc_gen.so
HMYEXEL062E Internal VM error: Failed to create Java VM
FAILED to invoke JVM.
Test: jitrino.OPTClass: io.Integers_optExit code: 1 Err: Loading error /export/users/cc/cc-suites/build/checkouts/snapshot/hdk/jdk/jre/bin/default/libgc_gen.so: undefined symbol: _Z23free_set_pool_put_entryP12Vector_BlockP11GC_Metadata
GC library cannot be loaded: libgc_gen.so
HMYEXEL062E Internal VM error: Failed to create Java VM
FAILED to invoke JVM.
Test: Server mode JITClass: io.Integers_srvExit code: 1 Err: Loading error /export/users/cc/cc-suites/build/checkouts/snapshot/hdk/jdk/jre/bin/default/libgc_gen.so: undefined symbol: _Z23free_set_pool_put_entryP12Vector_BlockP11GC_Metadata
GC library cannot be loaded: libgc_gen.so
HMYEXEL062E Internal VM error: Failed to create Java VM
FAILED to invoke JVM.
Test: interpreterClass: jni.LoadLibrary_intExit code: 1 Err: Loading error /export/users/cc/cc-suites/build/checkouts/snapshot/hdk/jdk/jre/bin/default/libgc_gen.so: undefined symbol: _Z23free_set_pool_put_entryP12Vector_BlockP11GC_Metadata
GC library cannot be loaded: libgc_gen.so
HMYEXEL062E Internal VM error: Failed to create Java VM
FAILED to invoke JVM.
Test: jitrino.JETClass: jni.LoadLibrary_jetExit code: 1 Err: Loading error /export/users/cc/cc-suites/build/checkouts/snapshot/hdk/jdk/jre/bin/default/libgc_gen.so: undefined symbol: _Z23free_set_pool_put_entryP12Vector_BlockP11GC_Metadata
GC library cannot be loaded: libgc_gen.so
HMYEXEL062E Internal VM error: Failed to create Java VM
FAILED to invoke JVM.
Test: Client mode JIT (default)Class: jni.LoadLibrary_jitExit code: 1 Err: Loading error /export/users/cc/cc-suites/build/checkouts/snapshot/hdk/jdk/jre/bin/default/libgc_gen.so: undefined symbol: _Z23free_set_pool_put_entryP12Vector_BlockP11GC_Metadata
GC library cannot be loaded: libgc_gen.so
HMYEXEL062E Internal VM error: Failed to create Java VM
FAILED to invoke JVM.
Test: jitrino.OPTClass: jni.LoadLibrary_optExit code: 1 Err: Loading error /export/users/cc/cc-suites/build/checkouts/snapshot/hdk/jdk/jre/bin/default/libgc_gen.so: undefined symbol: _Z23free_set_pool_put_entryP12Vector_BlockP11GC_Metadata
GC library cannot be loaded: libgc_gen.so
HMYEXEL062E Internal VM error: Failed to create Java VM
FAILED to invoke JVM.
Test: Server mode JITClass: jni.LoadLibrary_srvExit code: 1 Err: Loading error /export/users/cc/cc-suites/build/checkouts/snapshot/hdk/jdk/jre/bin/default/libgc_gen.so: undefined symbol: _Z23free_set_pool_put_entryP12Vector_BlockP11GC_Metadata
GC library cannot be loaded: libgc_gen.so
HMYEXEL062E Internal VM error: Failed to create Java VM
FAILED to invoke JVM.
Test: interpreterClass: outofmemory.Double_intExit code: 1 Err: Loading error /export/users/cc/cc-suites/build/checkouts/snapshot/hdk/jdk/jre/bin/default/libgc_gen.so: undefined symbol: _Z23free_set_pool_put_entryP12Vector_BlockP11GC_Metadata
GC library cannot be loaded: libgc_gen.so
HMYEXEL062E Internal VM error: Failed to create Java VM
FAILED to invoke JVM.
Test: jitrino.JETClass: outofmemory.Double_jetExit code: 1 Err: Loading error /export/users/cc/cc-suites/build/checkouts/snapshot/hdk/jdk/jre/bin/default/libgc_gen.so: undefined symbol: _Z23free_set_pool_put_entryP12Vector_BlockP11GC_Metadata
GC library cannot be loaded: libgc_gen.so
HMYEXEL062E Internal VM error: Failed to create Java VM
FAILED to invoke JVM.
Test: Client mode JIT (default)Class: outofmemory.Double_jitExit code: 1 Err: Loading error /export/users/cc/cc-suites/build/checkouts/snapshot/hdk/jdk/jre/bin/default/libgc_gen.so: undefined symbol: _Z23free_set_pool_put_entryP12Vector_BlockP11GC_Metadata
GC library cannot be loaded: libgc_gen.so
HMYEXEL062E Internal VM error: Failed to create Java VM
FAILED to invoke JVM.
Test: jitrino.OPTClass: outofmemory.Double_optExit code: 1 Err: Loading error /export/users/cc/cc-suites/build/checkouts/snapshot/hdk/jdk/jre/bin/default/libgc_gen.so: undefined symbol: _Z23free_set_pool_put_entryP12Vector_BlockP11GC_Metadata
GC library cannot be loaded: libgc_gen.so
HMYEXEL062E Internal VM error: Failed to create Java VM
FAILED to invoke JVM.
Test: Server mode JITClass: outofmemory.Double_srvExit code: 1 Err: Loading error /export/users/cc/cc-suites/build/checkouts/snapshot/hdk/jdk/jre/bin/default/libgc_gen.so: undefined symbol: _Z23free_set_pool_put_entryP12Vector_BlockP11GC_Metadata
GC library cannot be loaded: libgc_gen.so
HMYEXEL062E Internal VM error: Failed to create Java VM
FAILED to invoke JVM.
Test: interpreterClass: outofmemory.Int_intExit code: 1 Err: Loading error /export/users/cc/cc-suites/build/checkouts/snapshot/hdk/jdk/jre/bin/default/libgc_gen.so: undefined symbol: _Z23free_set_pool_put_entryP12Vector_BlockP11GC_Metadata
GC library cannot be loaded: libgc_gen.so
HMYEXEL062E Internal VM error: Failed to create Java VM
FAILED to invoke JVM.
Test: jitrino.JETClass: outofmemory.Int_jetExit code: 1 Err: Loading error /export/users/cc/cc-suites/build/checkouts/snapshot/hdk/jdk/jre/bin/default/libgc_gen.so: undefined symbol: _Z23free_set_pool_put_entryP12Vector_BlockP11GC_Metadata
GC library cannot be loaded: libgc_gen.so
HMYEXEL062E Internal VM error: Failed to create Java VM
FAILED to invoke JVM.
Test: Client mode JIT (default)Class: outofmemory.Int_jitExit code: 1 Err: Loading error /export/users/cc/cc-suites/build/checkouts/snapshot/hdk/jdk/jre/bin/default/libgc_gen.so: undefined symbol: _Z23free_set_pool_put_entryP12Vector_BlockP11GC_Metadata
GC library cannot be loaded: libgc_gen.so
HMYEXEL062E Internal VM error: Failed to create Java VM
FAILED to invoke JVM.
Test: jitrino.OPTClass: outofmemory.Int_optExit code: 1 Err: Loading error /export/users/cc/cc-suites/build/checkouts/snapshot/hdk/jdk/jre/bin/default/libgc_gen.so: undefined symbol: _Z23free_set_pool_put_entryP12Vector_BlockP11GC_Metadata
GC library cannot be loaded: libgc_gen.so
HMYEXEL062E Internal VM error: Failed to create Java VM
FAILED to invoke JVM.
Test: Server mode JITClass: outofmemory.Int_srvExit code: 1 Err: Loading error /export/users/cc/cc-suites/build/checkouts/snapshot/hdk/jdk/jre/bin/default/libgc_gen.so: undefined symbol: _Z23free_set_pool_put_entryP12Vector_BlockP11GC_Metadata
GC library cannot be loaded: libgc_gen.so
HMYEXEL062E Internal VM error: Failed to create Java VM
FAILED to invoke JVM.
Test: interpreterClass: outofmemory.Plain_intExit code: 1 Err: Loading error /export/users/cc/cc-suites/build/checkouts/snapshot/hdk/jdk/jre/bin/default/libgc_gen.so: undefined symbol: _Z23free_set_pool_put_entryP12Vector_BlockP11GC_Metadata
GC library cannot be loaded: libgc_gen.so
HMYEXEL062E Internal VM error: Failed to create Java VM
FAILED to invoke JVM.
Test: jitrino.JETClass: outofmemory.Plain_jetExit code: 1 Err: Loading error /export/users/cc/cc-suites/build/checkouts/snapshot/hdk/jdk/jre/bin/default/libgc_gen.so: undefined symbol: _Z23free_set_pool_put_entryP12Vector_BlockP11GC_Metadata
GC library cannot be loaded: libgc_gen.so
HMYEXEL062E Internal VM error: Failed to create Java VM
FAILED to invoke JVM.
Test: Client mode JIT (default)Class: outofmemory.Plain_jitExit code: 1 Err: Loading error /export/users/cc/cc-suites/build/checkouts/snapshot/hdk/jdk/jre/bin/default/libgc_gen.so: undefined symbol: _Z23free_set_pool_put_entryP12Vector_BlockP11GC_Metadata
GC library cannot be loaded: libgc_gen.so
HMYEXEL062E Internal VM error: Failed to create Java VM
FAILED to invoke JVM.
Test: jitrino.OPTClass: outofmemory.Plain_optExit code: 1 Err: Loading error /export/users/cc/cc-suites/build/checkouts/snapshot/hdk/jdk/jre/bin/default/libgc_gen.so: undefined symbol: _Z23free_set_pool_put_entryP12Vector_BlockP11GC_Metadata
GC library cannot be loaded: libgc_gen.so
HMYEXEL062E Internal VM error: Failed to create Java VM
FAILED to invoke JVM.
Test: Server mode JITClass: outofmemory.Plain_srvExit code: 1 Err: Loading error /export/users/cc/cc-suites/build/checkouts/snapshot/hdk/jdk/jre/bin/default/libgc_gen.so: undefined symbol: _Z23free_set_pool_put_entryP12Vector_BlockP11GC_Metadata
GC library cannot be loaded: libgc_gen.so
HMYEXEL062E Internal VM error: Failed to create Java VM
FAILED to invoke JVM.
Test: interpreterClass: outofmemory.Ref_intExit code: 1 Err: Loading error /export/users/cc/cc-suites/build/checkouts/snapshot/hdk/jdk/jre/bin/default/libgc_gen.so: undefined symbol: _Z23free_set_pool_put_entryP12Vector_BlockP11GC_Metadata
GC library cannot be loaded: libgc_gen.so
HMYEXEL062E Internal VM error: Failed to create Java VM
FAILED to invoke JVM.
Test: jitrino.JETClass: outofmemory.Ref_jetExit code: 1 Err: Loading error /export/users/cc/cc-suites/build/checkouts/snapshot/hdk/jdk/jre/bin/default/libgc_gen.so: undefined symbol: _Z23free_set_pool_put_entryP12Vector_BlockP11GC_Metadata
GC library cannot be loaded: libgc_gen.so
HMYEXEL062E Internal VM error: Failed to create Java VM
FAILED to invoke JVM.
Test: Client mode JIT (default)Class: outofmemory.Ref_jitExit code: 1 Err: Loading error /export/users/cc/cc-suites/build/checkouts/snapshot/hdk/jdk/jre/bin/default/libgc_gen.so: undefined symbol: _Z23free_set_pool_put_entryP12Vector_BlockP11GC_Metadata
GC library cannot be loaded: libgc_gen.so
HMYEXEL062E Internal VM error: Failed to create Java VM
FAILED to invoke JVM.
Test: jitrino.OPTClass: outofmemory.Ref_optExit code: 1 Err: Loading error /export/users/cc/cc-suites/build/checkouts/snapshot/hdk/jdk/jre/bin/default/libgc_gen.so: undefined symbol: _Z23free_set_pool_put_entryP12Vector_BlockP11GC_Metadata
GC library cannot be loaded: libgc_gen.so
HMYEXEL062E Internal VM error: Failed to create Java VM
FAILED to invoke JVM.
Test: Server mode JITClass: outofmemory.Ref_srvExit code: 1 Err: Loading error /export/users/cc/cc-suites/build/checkouts/snapshot/hdk/jdk/jre/bin/default/libgc_gen.so: undefined symbol: _Z23free_set_pool_put_entryP12Vector_BlockP11GC_Metadata
GC library cannot be loaded: libgc_gen.so
HMYEXEL062E Internal VM error: Failed to create Java VM
FAILED to invoke JVM.
Test: interpreterClass: outofmemory.Throw_intExit code: 1 Err: Loading error /export/users/cc/cc-suites/build/checkouts/snapshot/hdk/jdk/jre/bin/default/libgc_gen.so: undefined symbol: _Z23free_set_pool_put_entryP12Vector_BlockP11GC_Metadata
GC library cannot be loaded: libgc_gen.so
HMYEXEL062E Internal VM error: Failed to create Java VM
FAILED to invoke JVM.
Test: jitrino.JETClass: outofmemory.Throw_jetExit code: 1 Err: Loading error /export/users/cc/cc-suites/build/checkouts/snapshot/hdk/jdk/jre/bin/default/libgc_gen.so: undefined symbol: _Z23free_set_pool_put_entryP12Vector_BlockP11GC_Metadata
GC library cannot be loaded: libgc_gen.so
HMYEXEL062E Internal VM error: Failed to create Java VM
FAILED to invoke JVM.
Test: Client mode JIT (default)Class: outofmemory.Throw_jitExit code: 1 Err: Loading error /export/users/cc/cc-suites/build/checkouts/snapshot/hdk/jdk/jre/bin/default/libgc_gen.so: undefined symbol: _Z23free_set_pool_put_entryP12Vector_BlockP11GC_Metadata
GC library cannot be loaded: libgc_gen.so
HMYEXEL062E Internal VM error: Failed to create Java VM
FAILED to invoke JVM.
Test: jitrino.OPTClass: outofmemory.Throw_optExit code: 1 Err: Loading error /export/users/cc/cc-suites/build/checkouts/snapshot/hdk/jdk/jre/bin/default/libgc_gen.so: undefined symbol: _Z23free_set_pool_put_entryP12Vector_BlockP11GC_Metadata
GC library cannot be loaded: libgc_gen.so
HMYEXEL062E Internal VM error: Failed to create Java VM
FAILED to invoke JVM.
Test: Server mode JITClass: outofmemory.Throw_srvExit code: 1 Err: Loading error /export/users/cc/cc-suites/build/checkouts/snapshot/hdk/jdk/jre/bin/default/libgc_gen.so: undefined symbol: _Z23free_set_pool_put_entryP12Vector_BlockP11GC_Metadata
GC library cannot be loaded: libgc_gen.so
HMYEXEL062E Internal VM error: Failed to create Java VM
FAILED to invoke JVM.
Test: interpreterClass: outofmemory.VectorDouble_intExit code: 1 Err: Loading error /export/users/cc/cc-suites/build/checkouts/snapshot/hdk/jdk/jre/bin/default/libgc_gen.so: undefined symbol: _Z23free_set_pool_put_entryP12Vector_BlockP11GC_Metadata
GC library cannot be loaded: libgc_gen.so
HMYEXEL062E Internal VM error: Failed to create Java VM
FAILED to invoke JVM.
Test: jitrino.JETClass: outofmemory.VectorDouble_jetExit code: 1 Err: Loading error /export/users/cc/cc-suites/build/checkouts/snapshot/hdk/jdk/jre/bin/default/libgc_gen.so: undefined symbol: _Z23free_set_pool_put_entryP12Vector_BlockP11GC_Metadata
GC library cannot be loaded: libgc_gen.so
HMYEXEL062E Internal VM error: Failed to create Java VM
FAILED to invoke JVM.
Test: Client mode JIT (default)Class: outofmemory.VectorDouble_jitExit code: 1 Err: Loading error /export/users/cc/cc-suites/build/checkouts/snapshot/hdk/jdk/jre/bin/default/libgc_gen.so: undefined symbol: _Z23free_set_pool_put_entryP12Vector_BlockP11GC_Metadata
GC library cannot be loaded: libgc_gen.so
HMYEXEL062E Internal VM error: Failed to create Java VM
FAILED to invoke JVM.
Test: jitrino.OPTClass: outofmemory.VectorDouble_optExit code: 1 Err: Loading error /export/users/cc/cc-suites/build/checkouts/snapshot/hdk/jdk/jre/bin/default/libgc_gen.so: undefined symbol: _Z23free_set_pool_put_entryP12Vector_BlockP11GC_Metadata
GC library cannot be loaded: libgc_gen.so
HMYEXEL062E Internal VM error: Failed to create Java VM
FAILED to invoke JVM.
Test: Server mode JITClass: outofmemory.VectorDouble_srvExit code: 1 Err: Loading error /export/users/cc/cc-suites/build/checkouts/snapshot/hdk/jdk/jre/bin/default/libgc_gen.so: undefined symbol: _Z23free_set_pool_put_entryP12Vector_BlockP11GC_Metadata
GC library cannot be loaded: libgc_gen.so
HMYEXEL062E Internal VM error: Failed to create Java VM
FAILED to invoke JVM.
Test: interpreterClass: outofmemory.VectorInt_intExit code: 1 Err: Loading error /export/users/cc/cc-suites/build/checkouts/snapshot/hdk/jdk/jre/bin/default/libgc_gen.so: undefined symbol: _Z23free_set_pool_put_entryP12Vector_BlockP11GC_Metadata
GC library cannot be loaded: libgc_gen.so
HMYEXEL062E Internal VM error: Failed to create Java VM
FAILED to invoke JVM.
Test: jitrino.JETClass: outofmemory.VectorInt_jetExit code: 1 Err: Loading error /export/users/cc/cc-suites/build/checkouts/snapshot/hdk/jdk/jre/bin/default/libgc_gen.so: undefined symbol: _Z23free_set_pool_put_entryP12Vector_BlockP11GC_Metadata
GC library cannot be loaded: libgc_gen.so
HMYEXEL062E Internal VM error: Failed to create Java VM
FAILED to invoke JVM.
Test: Client mode JIT (default)Class: outofmemory.VectorInt_jitExit code: 1 Err: Loading error /export/users/cc/cc-suites/build/checkouts/snapshot/hdk/jdk/jre/bin/default/libgc_gen.so: undefined symbol: _Z23free_set_pool_put_entryP12Vector_BlockP11GC_Metadata
GC library cannot be loaded: libgc_gen.so
HMYEXEL062E Internal VM error: Failed to create Java VM
FAILED to invoke JVM.
Test: jitrino.OPTClass: outofmemory.VectorInt_optExit code: 1 Err: Loading error /export/users/cc/cc-suites/build/checkouts/snapshot/hdk/jdk/jre/bin/default/libgc_gen.so: undefined symbol: _Z23free_set_pool_put_entryP12Vector_BlockP11GC_Metadata
GC library cannot be loaded: libgc_gen.so
HMYEXEL062E Internal VM error: Failed to create Java VM
FAILED to invoke JVM.
Test: Server mode JITClass: outofmemory.VectorInt_srvExit code: 1 Err: Loading error /export/users/cc/cc-suites/build/checkouts/snapshot/hdk/jdk/jre/bin/default/libgc_gen.so: undefined symbol: _Z23free_set_pool_put_entryP12Vector_BlockP11GC_Metadata
GC library cannot be loaded: libgc_gen.so
HMYEXEL062E Internal VM error: Failed to create Java VM
FAILED to invoke JVM.
Test: interpreterClass: outofmemory.VectorRef_intExit code: 1 Err: Loading error /export/users/cc/cc-suites/build/checkouts/snapshot/hdk/jdk/jre/bin/default/libgc_gen.so: undefined symbol: _Z23free_set_pool_put_entryP12Vector_BlockP11GC_Metadata
GC library cannot be loaded: libgc_gen.so
HMYEXEL062E Internal VM error: Failed to create Java VM
FAILED to invoke JVM.
Test: jitrino.JETClass: outofmemory.VectorRef_jetExit code: 1 Err: Loading error /export/users/cc/cc-suites/build/checkouts/snapshot/hdk/jdk/jre/bin/default/libgc_gen.so: undefined symbol: _Z23free_set_pool_put_entryP12Vector_BlockP11GC_Metadata
GC library cannot be loaded: libgc_gen.so
HMYEXEL062E Internal VM error: Failed to create Java VM
FAILED to invoke JVM.
Test: Client mode JIT (default)Class: outofmemory.VectorRef_jitExit code: 1 Err: Loading error /export/users/cc/cc-suites/build/checkouts/snapshot/hdk/jdk/jre/bin/default/libgc_gen.so: undefined symbol: _Z23free_set_pool_put_entryP12Vector_BlockP11GC_Metadata
GC library cannot be loaded: libgc_gen.so
HMYEXEL062E Internal VM error: Failed to create Java VM
FAILED to invoke JVM.
Test: jitrino.OPTClass: outofmemory.VectorRef_optExit code: 1 Err: Loading error /export/users/cc/cc-suites/build/checkouts/snapshot/hdk/jdk/jre/bin/default/libgc_gen.so: undefined symbol: _Z23free_set_pool_put_entryP12Vector_BlockP11GC_Metadata
GC library cannot be loaded: libgc_gen.so
HMYEXEL062E Internal VM error: Failed to create Java VM
FAILED to invoke JVM.
Test: Server mode JITClass: outofmemory.VectorRef_srvExit code: 1 Err: Loading error /export/users/cc/cc-suites/build/checkouts/snapshot/hdk/jdk/jre/bin/default/libgc_gen.so: undefined symbol: _Z23free_set_pool_put_entryP12Vector_BlockP11GC_Metadata
GC library cannot be loaded: libgc_gen.so
HMYEXEL062E Internal VM error: Failed to create Java VM
FAILED to invoke JVM.
Test: interpreterClass: outofmemory.Vector_intExit code: 1 Err: Loading error /export/users/cc/cc-suites/build/checkouts/snapshot/hdk/jdk/jre/bin/default/libgc_gen.so: undefined symbol: _Z23free_set_pool_put_entryP12Vector_BlockP11GC_Metadata
GC library cannot be loaded: libgc_gen.so
HMYEXEL062E Internal VM error: Failed to create Java VM
FAILED to invoke JVM.
Test: jitrino.JETClass: outofmemory.Vector_jetExit code: 1 Err: Loading error /export/users/cc/cc-suites/build/checkouts/snapshot/hdk/jdk/jre/bin/default/libgc_gen.so: undefined symbol: _Z23free_set_pool_put_entryP12Vector_BlockP11GC_Metadata
GC library cannot be loaded: libgc_gen.so
HMYEXEL062E Internal VM error: Failed to create Java VM
FAILED to invoke JVM.
Test: Client mode JIT (default)Class: outofmemory.Vector_jitExit code: 1 Err: Loading error /export/users/cc/cc-suites/build/checkouts/snapshot/hdk/jdk/jre/bin/default/libgc_gen.so: undefined symbol: _Z23free_set_pool_put_entryP12Vector_BlockP11GC_Metadata
GC library cannot be loaded: libgc_gen.so
HMYEXEL062E Internal VM error: Failed to create Java VM
FAILED to invoke JVM.
Test: jitrino.OPTClass: outofmemory.Vector_optExit code: 1 Err: Loading error /export/users/cc/cc-suites/build/checkouts/snapshot/hdk/jdk/jre/bin/default/libgc_gen.so: undefined symbol: _Z23free_set_pool_put_entryP12Vector_BlockP11GC_Metadata
GC library cannot be loaded: libgc_gen.so
HMYEXEL062E Internal VM error: Failed to create Java VM
FAILED to invoke JVM.
Test: Server mode JITClass: outofmemory.Vector_srvExit code: 1 Err: Loading error /export/users/cc/cc-suites/build/checkouts/snapshot/hdk/jdk/jre/bin/default/libgc_gen.so: undefined symbol: _Z23free_set_pool_put_entryP12Vector_BlockP11GC_Metadata
GC library cannot be loaded: libgc_gen.so
HMYEXEL062E Internal VM error: Failed to create Java VM
FAILED to invoke JVM.
Test: interpreterClass: perf.CreateManyExceptions_depth_intExit code: 1 Err: Loading error /export/users/cc/cc-suites/build/checkouts/snapshot/hdk/jdk/jre/bin/default/libgc_gen.so: undefined symbol: _Z23free_set_pool_put_entryP12Vector_BlockP11GC_Metadata
GC library cannot be loaded: libgc_gen.so
HMYEXEL062E Internal VM error: Failed to create Java VM
FAILED to invoke JVM.
Test: jitrino.JETClass: perf.CreateManyExceptions_depth_jetExit code: 1 Err: Loading error /export/users/cc/cc-suites/build/checkouts/snapshot/hdk/jdk/jre/bin/default/libgc_gen.so: undefined symbol: _Z23free_set_pool_put_entryP12Vector_BlockP11GC_Metadata
GC library cannot be loaded: libgc_gen.so
HMYEXEL062E Internal VM error: Failed to create Java VM
FAILED to invoke JVM.
Test: Client mode JIT (default)Class: perf.CreateManyExceptions_depth_jitExit code: 1 Err: Loading error /export/users/cc/cc-suites/build/checkouts/snapshot/hdk/jdk/jre/bin/default/libgc_gen.so: undefined symbol: _Z23free_set_pool_put_entryP12Vector_BlockP11GC_Metadata
GC library cannot be loaded: libgc_gen.so
HMYEXEL062E Internal VM error: Failed to create Java VM
FAILED to invoke JVM.
Test: jitrino.OPTClass: perf.CreateManyExceptions_depth_optExit code: 1 Err: Loading error /export/users/cc/cc-suites/build/checkouts/snapshot/hdk/jdk/jre/bin/default/libgc_gen.so: undefined symbol: _Z23free_set_pool_put_entryP12Vector_BlockP11GC_Metadata
GC library cannot be loaded: libgc_gen.so
HMYEXEL062E Internal VM error: Failed to create Java VM
FAILED to invoke JVM.
Test: Server mode JITClass: perf.CreateManyExceptions_depth_srvExit code: 1 Err: Loading error /export/users/cc/cc-suites/build/checkouts/snapshot/hdk/jdk/jre/bin/default/libgc_gen.so: undefined symbol: _Z23free_set_pool_put_entryP12Vector_BlockP11GC_Metadata
GC library cannot be loaded: libgc_gen.so
HMYEXEL062E Internal VM error: Failed to create Java VM
FAILED to invoke JVM.
Test: interpreterClass: perf.CreateManyExceptions_intExit code: 1 Err: Loading error /export/users/cc/cc-suites/build/checkouts/snapshot/hdk/jdk/jre/bin/default/libgc_gen.so: undefined symbol: _Z23free_set_pool_put_entryP12Vector_BlockP11GC_Metadata
GC library cannot be loaded: libgc_gen.so
HMYEXEL062E Internal VM error: Failed to create Java VM
FAILED to invoke JVM.
Test: jitrino.JETClass: perf.CreateManyExceptions_jetExit code: 1 Err: Loading error /export/users/cc/cc-suites/build/checkouts/snapshot/hdk/jdk/jre/bin/default/libgc_gen.so: undefined symbol: _Z23free_set_pool_put_entryP12Vector_BlockP11GC_Metadata
GC library cannot be loaded: libgc_gen.so
HMYEXEL062E Internal VM error: Failed to create Java VM
FAILED to invoke JVM.
Test: Client mode JIT (default)Class: perf.CreateManyExceptions_jitExit code: 1 Err: Loading error /export/users/cc/cc-suites/build/checkouts/snapshot/hdk/jdk/jre/bin/default/libgc_gen.so: undefined symbol: _Z23free_set_pool_put_entryP12Vector_BlockP11GC_Metadata
GC library cannot be loaded: libgc_gen.so
HMYEXEL062E Internal VM error: Failed to create Java VM
FAILED to invoke JVM.
Test: jitrino.OPTClass: perf.CreateManyExceptions_optExit code: 1 Err: Loading error /export/users/cc/cc-suites/build/checkouts/snapshot/hdk/jdk/jre/bin/default/libgc_gen.so: undefined symbol: _Z23free_set_pool_put_entryP12Vector_BlockP11GC_Metadata
GC library cannot be loaded: libgc_gen.so
HMYEXEL062E Internal VM error: Failed to create Java VM
FAILED to invoke JVM.
Test: Server mode JITClass: perf.CreateManyExceptions_srvExit code: 1 Err: Loading error /export/users/cc/cc-suites/build/checkouts/snapshot/hdk/jdk/jre/bin/default/libgc_gen.so: undefined symbol: _Z23free_set_pool_put_entryP12Vector_BlockP11GC_Metadata
GC library cannot be loaded: libgc_gen.so
HMYEXEL062E Internal VM error: Failed to create Java VM
FAILED to invoke JVM.
Test: interpreterClass: perf.MultiThreadsSimple_intExit code: 1 Err: Loading error /export/users/cc/cc-suites/build/checkouts/snapshot/hdk/jdk/jre/bin/default/libgc_gen.so: undefined symbol: _Z23free_set_pool_put_entryP12Vector_BlockP11GC_Metadata
GC library cannot be loaded: libgc_gen.so
HMYEXEL062E Internal VM error: Failed to create Java VM
FAILED to invoke JVM.
Test: jitrino.JETClass: perf.MultiThreadsSimple_jetExit code: 1 Err: Loading error /export/users/cc/cc-suites/build/checkouts/snapshot/hdk/jdk/jre/bin/default/libgc_gen.so: undefined symbol: _Z23free_set_pool_put_entryP12Vector_BlockP11GC_Metadata
GC library cannot be loaded: libgc_gen.so
HMYEXEL062E Internal VM error: Failed to create Java VM
FAILED to invoke JVM.
Test: Client mode JIT (default)Class: perf.MultiThreadsSimple_jitExit code: 1 Err: Loading error /export/users/cc/cc-suites/build/checkouts/snapshot/hdk/jdk/jre/bin/default/libgc_gen.so: undefined symbol: _Z23free_set_pool_put_entryP12Vector_BlockP11GC_Metadata
GC library cannot be loaded: libgc_gen.so
HMYEXEL062E Internal VM error: Failed to create Java VM
FAILED to invoke JVM.
Test: jitrino.OPTClass: perf.MultiThreadsSimple_optExit code: 1 Err: Loading error /export/users/cc/cc-suites/build/checkouts/snapshot/hdk/jdk/jre/bin/default/libgc_gen.so: undefined symbol: _Z23free_set_pool_put_entryP12Vector_BlockP11GC_Metadata
GC library cannot be loaded: libgc_gen.so
HMYEXEL062E Internal VM error: Failed to create Java VM
FAILED to invoke JVM.
Test: Server mode JITClass: perf.MultiThreadsSimple_srvExit code: 1 Err: Loading error /export/users/cc/cc-suites/build/checkouts/snapshot/hdk/jdk/jre/bin/default/libgc_gen.so: undefined symbol: _Z23free_set_pool_put_entryP12Vector_BlockP11GC_Metadata
GC library cannot be loaded: libgc_gen.so
HMYEXEL062E Internal VM error: Failed to create Java VM
FAILED to invoke JVM.
Test: interpreterClass: perf.SeveralThreads_intExit code: 1 Err: Loading error /export/users/cc/cc-suites/build/checkouts/snapshot/hdk/jdk/jre/bin/default/libgc_gen.so: undefined symbol: _Z23free_set_pool_put_entryP12Vector_BlockP11GC_Metadata
GC library cannot be loaded: libgc_gen.so
HMYEXEL062E Internal VM error: Failed to create Java VM
FAILED to invoke JVM.
Test: jitrino.JETClass: perf.SeveralThreads_jetExit code: 1 Err: Loading error /export/users/cc/cc-suites/build/checkouts/snapshot/hdk/jdk/jre/bin/default/libgc_gen.so: undefined symbol: _Z23free_set_pool_put_entryP12Vector_BlockP11GC_Metadata
GC library cannot be loaded: libgc_gen.so
HMYEXEL062E Internal VM error: Failed to create Java VM
FAILED to invoke JVM.
Test: Client mode JIT (default)Class: perf.SeveralThreads_jitExit code: 1 Err: Loading error /export/users/cc/cc-suites/build/checkouts/snapshot/hdk/jdk/jre/bin/default/libgc_gen.so: undefined symbol: _Z23free_set_pool_put_entryP12Vector_BlockP11GC_Metadata
GC library cannot be loaded: libgc_gen.so
HMYEXEL062E Internal VM error: Failed to create Java VM
FAILED to invoke JVM.
Test: jitrino.OPTClass: perf.SeveralThreads_optExit code: 1 Err: Loading error /export/users/cc/cc-suites/build/checkouts/snapshot/hdk/jdk/jre/bin/default/libgc_gen.so: undefined symbol: _Z23free_set_pool_put_entryP12Vector_BlockP11GC_Metadata
GC library cannot be loaded: libgc_gen.so
HMYEXEL062E Internal VM error: Failed to create Java VM
FAILED to invoke JVM.
Test: Server mode JITClass: perf.SeveralThreads_srvExit code: 1 Err: Loading error /export/users/cc/cc-suites/build/checkouts/snapshot/hdk/jdk/jre/bin/default/libgc_gen.so: undefined symbol: _Z23free_set_pool_put_entryP12Vector_BlockP11GC_Metadata
GC library cannot be loaded: libgc_gen.so
HMYEXEL062E Internal VM error: Failed to create Java VM
FAILED to invoke JVM.
Test: interpreterClass: perf.StressCornerSize_a_intExit code: 1 Err: Loading error /export/users/cc/cc-suites/build/checkouts/snapshot/hdk/jdk/jre/bin/default/libgc_gen.so: undefined symbol: _Z23free_set_pool_put_entryP12Vector_BlockP11GC_Metadata
GC library cannot be loaded: libgc_gen.so
HMYEXEL062E Internal VM error: Failed to create Java VM
FAILED to invoke JVM.
Test: jitrino.JETClass: perf.StressCornerSize_a_jetExit code: 1 Err: Loading error /export/users/cc/cc-suites/build/checkouts/snapshot/hdk/jdk/jre/bin/default/libgc_gen.so: undefined symbol: _Z23free_set_pool_put_entryP12Vector_BlockP11GC_Metadata
GC library cannot be loaded: libgc_gen.so
HMYEXEL062E Internal VM error: Failed to create Java VM
FAILED to invoke JVM.
Test: Client mode JIT (default)Class: perf.StressCornerSize_a_jitExit code: 1 Err: Loading error /export/users/cc/cc-suites/build/checkouts/snapshot/hdk/jdk/jre/bin/default/libgc_gen.so: undefined symbol: _Z23free_set_pool_put_entryP12Vector_BlockP11GC_Metadata
GC library cannot be loaded: libgc_gen.so
HMYEXEL062E Internal VM error: Failed to create Java VM
FAILED to invoke JVM.
Test: jitrino.OPTClass: perf.StressCornerSize_a_optExit code: 1 Err: Loading error /export/users/cc/cc-suites/build/checkouts/snapshot/hdk/jdk/jre/bin/default/libgc_gen.so: undefined symbol: _Z23free_set_pool_put_entryP12Vector_BlockP11GC_Metadata
GC library cannot be loaded: libgc_gen.so
HMYEXEL062E Internal VM error: Failed to create Java VM
FAILED to invoke JVM.
Test: Server mode JITClass: perf.StressCornerSize_a_srvExit code: 1 Err: Loading error /export/users/cc/cc-suites/build/checkouts/snapshot/hdk/jdk/jre/bin/default/libgc_gen.so: undefined symbol: _Z23free_set_pool_put_entryP12Vector_BlockP11GC_Metadata
GC library cannot be loaded: libgc_gen.so
HMYEXEL062E Internal VM error: Failed to create Java VM
FAILED to invoke JVM.
Test: interpreterClass: perf.StressCornerSize_intExit code: 1 Err: Loading error /export/users/cc/cc-suites/build/checkouts/snapshot/hdk/jdk/jre/bin/default/libgc_gen.so: undefined symbol: _Z23free_set_pool_put_entryP12Vector_BlockP11GC_Metadata
GC library cannot be loaded: libgc_gen.so
HMYEXEL062E Internal VM error: Failed to create Java VM
FAILED to invoke JVM.
Test: jitrino.JETClass: perf.StressCornerSize_jetExit code: 1 Err: Loading error /export/users/cc/cc-suites/build/checkouts/snapshot/hdk/jdk/jre/bin/default/libgc_gen.so: undefined symbol: _Z23free_set_pool_put_entryP12Vector_BlockP11GC_Metadata
GC library cannot be loaded: libgc_gen.so
HMYEXEL062E Internal VM error: Failed to create Java VM
FAILED to invoke JVM.
Test: Client mode JIT (default)Class: perf.StressCornerSize_jitExit code: 1 Err: Loading error /export/users/cc/cc-suites/build/checkouts/snapshot/hdk/jdk/jre/bin/default/libgc_gen.so: undefined symbol: _Z23free_set_pool_put_entryP12Vector_BlockP11GC_Metadata
GC library cannot be loaded: libgc_gen.so
HMYEXEL062E Internal VM error: Failed to create Java VM
FAILED to invoke JVM.
Test: jitrino.OPTClass: perf.StressCornerSize_optExit code: 1 Err: Loading error /export/users/cc/cc-suites/build/checkouts/snapshot/hdk/jdk/jre/bin/default/libgc_gen.so: undefined symbol: _Z23free_set_pool_put_entryP12Vector_BlockP11GC_Metadata
GC library cannot be loaded: libgc_gen.so
HMYEXEL062E Internal VM error: Failed to create Java VM
FAILED to invoke JVM.
Test: Server mode JITClass: perf.StressCornerSize_srvExit code: 1 Err: Loading error /export/users/cc/cc-suites/build/checkouts/snapshot/hdk/jdk/jre/bin/default/libgc_gen.so: undefined symbol: _Z23free_set_pool_put_entryP12Vector_BlockP11GC_Metadata
GC library cannot be loaded: libgc_gen.so
HMYEXEL062E Internal VM error: Failed to create Java VM
FAILED to invoke JVM.
Test: interpreterClass: perf.ThrowManyExceptions_depth_intExit code: 1 Err: Loading error /export/users/cc/cc-suites/build/checkouts/snapshot/hdk/jdk/jre/bin/default/libgc_gen.so: undefined symbol: _Z23free_set_pool_put_entryP12Vector_BlockP11GC_Metadata
GC library cannot be loaded: libgc_gen.so
HMYEXEL062E Internal VM error: Failed to create Java VM
FAILED to invoke JVM.
Test: jitrino.JETClass: perf.ThrowManyExceptions_depth_jetExit code: 1 Err: Loading error /export/users/cc/cc-suites/build/checkouts/snapshot/hdk/jdk/jre/bin/default/libgc_gen.so: undefined symbol: _Z23free_set_pool_put_entryP12Vector_BlockP11GC_Metadata
GC library cannot be loaded: libgc_gen.so
HMYEXEL062E Internal VM error: Failed to create Java VM
FAILED to invoke JVM.
Test: Client mode JIT (default)Class: perf.ThrowManyExceptions_depth_jitExit code: 1 Err: Loading error /export/users/cc/cc-suites/build/checkouts/snapshot/hdk/jdk/jre/bin/default/libgc_gen.so: undefined symbol: _Z23free_set_pool_put_entryP12Vector_BlockP11GC_Metadata
GC library cannot be loaded: libgc_gen.so
HMYEXEL062E Internal VM error: Failed to create Java VM
FAILED to invoke JVM.
Test: jitrino.OPTClass: perf.ThrowManyExceptions_depth_optExit code: 1 Err: Loading error /export/users/cc/cc-suites/build/checkouts/snapshot/hdk/jdk/jre/bin/default/libgc_gen.so: undefined symbol: _Z23free_set_pool_put_entryP12Vector_BlockP11GC_Metadata
GC library cannot be loaded: libgc_gen.so
HMYEXEL062E Internal VM error: Failed to create Java VM
FAILED to invoke JVM.
Test: Server mode JITClass: perf.ThrowManyExceptions_depth_srvExit code: 1 Err: Loading error /export/users/cc/cc-suites/build/checkouts/snapshot/hdk/jdk/jre/bin/default/libgc_gen.so: undefined symbol: _Z23free_set_pool_put_entryP12Vector_BlockP11GC_Metadata
GC library cannot be loaded: libgc_gen.so
HMYEXEL062E Internal VM error: Failed to create Java VM
FAILED to invoke JVM.
Test: interpreterClass: perf.ThrowManyExceptions_intExit code: 1 Err: Loading error /export/users/cc/cc-suites/build/checkouts/snapshot/hdk/jdk/jre/bin/default/libgc_gen.so: undefined symbol: _Z23free_set_pool_put_entryP12Vector_BlockP11GC_Metadata
GC library cannot be loaded: libgc_gen.so
HMYEXEL062E Internal VM error: Failed to create Java VM
FAILED to invoke JVM.
Test: jitrino.JETClass: perf.ThrowManyExceptions_jetExit code: 1 Err: Loading error /export/users/cc/cc-suites/build/checkouts/snapshot/hdk/jdk/jre/bin/default/libgc_gen.so: undefined symbol: _Z23free_set_pool_put_entryP12Vector_BlockP11GC_Metadata
GC library cannot be loaded: libgc_gen.so
HMYEXEL062E Internal VM error: Failed to create Java VM
FAILED to invoke JVM.
Test: Client mode JIT (default)Class: perf.ThrowManyExceptions_jitExit code: 1 Err: Loading error /export/users/cc/cc-suites/build/checkouts/snapshot/hdk/jdk/jre/bin/default/libgc_gen.so: undefined symbol: _Z23free_set_pool_put_entryP12Vector_BlockP11GC_Metadata
GC library cannot be loaded: libgc_gen.so
HMYEXEL062E Internal VM error: Failed to create Java VM
FAILED to invoke JVM.
Test: jitrino.OPTClass: perf.ThrowManyExceptions_optExit code: 1 Err: Loading error /export/users/cc/cc-suites/build/checkouts/snapshot/hdk/jdk/jre/bin/default/libgc_gen.so: undefined symbol: _Z23free_set_pool_put_entryP12Vector_BlockP11GC_Metadata
GC library cannot be loaded: libgc_gen.so
HMYEXEL062E Internal VM error: Failed to create Java VM
FAILED to invoke JVM.
Test: Server mode JITClass: perf.ThrowManyExceptions_srvExit code: 1 Err: Loading error /export/users/cc/cc-suites/build/checkouts/snapshot/hdk/jdk/jre/bin/default/libgc_gen.so: undefined symbol: _Z23free_set_pool_put_entryP12Vector_BlockP11GC_Metadata
GC library cannot be loaded: libgc_gen.so
HMYEXEL062E Internal VM error: Failed to create Java VM
FAILED to invoke JVM.
Test: interpreterClass: perf.ThrowMany_depth_intExit code: 1 Err: Loading error /export/users/cc/cc-suites/build/checkouts/snapshot/hdk/jdk/jre/bin/default/libgc_gen.so: undefined symbol: _Z23free_set_pool_put_entryP12Vector_BlockP11GC_Metadata
GC library cannot be loaded: libgc_gen.so
HMYEXEL062E Internal VM error: Failed to create Java VM
FAILED to invoke JVM.
Test: jitrino.JETClass: perf.ThrowMany_depth_jetExit code: 1 Err: Loading error /export/users/cc/cc-suites/build/checkouts/snapshot/hdk/jdk/jre/bin/default/libgc_gen.so: undefined symbol: _Z23free_set_pool_put_entryP12Vector_BlockP11GC_Metadata
GC library cannot be loaded: libgc_gen.so
HMYEXEL062E Internal VM error: Failed to create Java VM
FAILED to invoke JVM.
Test: Client mode JIT (default)Class: perf.ThrowMany_depth_jitExit code: 1 Err: Loading error /export/users/cc/cc-suites/build/checkouts/snapshot/hdk/jdk/jre/bin/default/libgc_gen.so: undefined symbol: _Z23free_set_pool_put_entryP12Vector_BlockP11GC_Metadata
GC library cannot be loaded: libgc_gen.so
HMYEXEL062E Internal VM error: Failed to create Java VM
FAILED to invoke JVM.
Test: jitrino.OPTClass: perf.ThrowMany_depth_optExit code: 1 Err: Loading error /export/users/cc/cc-suites/build/checkouts/snapshot/hdk/jdk/jre/bin/default/libgc_gen.so: undefined symbol: _Z23free_set_pool_put_entryP12Vector_BlockP11GC_Metadata
GC library cannot be loaded: libgc_gen.so
HMYEXEL062E Internal VM error: Failed to create Java VM
FAILED to invoke JVM.
Test: Server mode JITClass: perf.ThrowMany_depth_srvExit code: 1 Err: Loading error /export/users/cc/cc-suites/build/checkouts/snapshot/hdk/jdk/jre/bin/default/libgc_gen.so: undefined symbol: _Z23free_set_pool_put_entryP12Vector_BlockP11GC_Metadata
GC library cannot be loaded: libgc_gen.so
HMYEXEL062E Internal VM error: Failed to create Java VM
FAILED to invoke JVM.
Test: interpreterClass: perf.ThrowMany_intExit code: 1 Err: Loading error /export/users/cc/cc-suites/build/checkouts/snapshot/hdk/jdk/jre/bin/default/libgc_gen.so: undefined symbol: _Z23free_set_pool_put_entryP12Vector_BlockP11GC_Metadata
GC library cannot be loaded: libgc_gen.so
HMYEXEL062E Internal VM error: Failed to create Java VM
FAILED to invoke JVM.
Test: jitrino.JETClass: perf.ThrowMany_jetExit code: 1 Err: Loading error /export/users/cc/cc-suites/build/checkouts/snapshot/hdk/jdk/jre/bin/default/libgc_gen.so: undefined symbol: _Z23free_set_pool_put_entryP12Vector_BlockP11GC_Metadata
GC library cannot be loaded: libgc_gen.so
HMYEXEL062E Internal VM error: Failed to create Java VM
FAILED to invoke JVM.
Test: Client mode JIT (default)Class: perf.ThrowMany_jitExit code: 1 Err: Loading error /export/users/cc/cc-suites/build/checkouts/snapshot/hdk/jdk/jre/bin/default/libgc_gen.so: undefined symbol: _Z23free_set_pool_put_entryP12Vector_BlockP11GC_Metadata
GC library cannot be loaded: libgc_gen.so
HMYEXEL062E Internal VM error: Failed to create Java VM
FAILED to invoke JVM.
Test: jitrino.OPTClass: perf.ThrowMany_optExit code: 1 Err: Loading error /export/users/cc/cc-suites/build/checkouts/snapshot/hdk/jdk/jre/bin/default/libgc_gen.so: undefined symbol: _Z23free_set_pool_put_entryP12Vector_BlockP11GC_Metadata
GC library cannot be loaded: libgc_gen.so
HMYEXEL062E Internal VM error: Failed to create Java VM
FAILED to invoke JVM.
Test: Server mode JITClass: perf.ThrowMany_srvExit code: 1 Err: Loading error /export/users/cc/cc-suites/build/checkouts/snapshot/hdk/jdk/jre/bin/default/libgc_gen.so: undefined symbol: _Z23free_set_pool_put_entryP12Vector_BlockP11GC_Metadata
GC library cannot be loaded: libgc_gen.so
HMYEXEL062E Internal VM error: Failed to create Java VM
FAILED to invoke JVM.
Test: interpreterClass: reflect.GetMethod_intExit code: 1 Err: Loading error /export/users/cc/cc-suites/build/checkouts/snapshot/hdk/jdk/jre/bin/default/libgc_gen.so: undefined symbol: _Z23free_set_pool_put_entryP12Vector_BlockP11GC_Metadata
GC library cannot be loaded: libgc_gen.so
HMYEXEL062E Internal VM error: Failed to create Java VM
FAILED to invoke JVM.
Test: jitrino.JETClass: reflect.GetMethod_jetExit code: 1 Err: Loading error /export/users/cc/cc-suites/build/checkouts/snapshot/hdk/jdk/jre/bin/default/libgc_gen.so: undefined symbol: _Z23free_set_pool_put_entryP12Vector_BlockP11GC_Metadata
GC library cannot be loaded: libgc_gen.so
HMYEXEL062E Internal VM error: Failed to create Java VM
FAILED to invoke JVM.
Test: Client mode JIT (default)Class: reflect.GetMethod_jitExit code: 1 Err: Loading error /export/users/cc/cc-suites/build/checkouts/snapshot/hdk/jdk/jre/bin/default/libgc_gen.so: undefined symbol: _Z23free_set_pool_put_entryP12Vector_BlockP11GC_Metadata
GC library cannot be loaded: libgc_gen.so
HMYEXEL062E Internal VM error: Failed to create Java VM
FAILED to invoke JVM.
Test: jitrino.OPTClass: reflect.GetMethod_optExit code: 1 Err: Loading error /export/users/cc/cc-suites/build/checkouts/snapshot/hdk/jdk/jre/bin/default/libgc_gen.so: undefined symbol: _Z23free_set_pool_put_entryP12Vector_BlockP11GC_Metadata
GC library cannot be loaded: libgc_gen.so
HMYEXEL062E Internal VM error: Failed to create Java VM
FAILED to invoke JVM.
Test: Server mode JITClass: reflect.GetMethod_srvExit code: 1 Err: Loading error /export/users/cc/cc-suites/build/checkouts/snapshot/hdk/jdk/jre/bin/default/libgc_gen.so: undefined symbol: _Z23free_set_pool_put_entryP12Vector_BlockP11GC_Metadata
GC library cannot be loaded: libgc_gen.so
HMYEXEL062E Internal VM error: Failed to create Java VM
FAILED to invoke JVM.
Test: interpreterClass: shutdown.TestDaemonOnWait_intExit code: 1 Err: Loading error /export/users/cc/cc-suites/build/checkouts/snapshot/hdk/jdk/jre/bin/default/libgc_gen.so: undefined symbol: _Z23free_set_pool_put_entryP12Vector_BlockP11GC_Metadata
GC library cannot be loaded: libgc_gen.so
HMYEXEL062E Internal VM error: Failed to create Java VM
FAILED to invoke JVM.
Test: jitrino.JETClass: shutdown.TestDaemonOnWait_jetExit code: 1 Err: Loading error /export/users/cc/cc-suites/build/checkouts/snapshot/hdk/jdk/jre/bin/default/libgc_gen.so: undefined symbol: _Z23free_set_pool_put_entryP12Vector_BlockP11GC_Metadata
GC library cannot be loaded: libgc_gen.so
HMYEXEL062E Internal VM error: Failed to create Java VM
FAILED to invoke JVM.
Test: Client mode JIT (default)Class: shutdown.TestDaemonOnWait_jitExit code: 1 Err: Loading error /export/users/cc/cc-suites/build/checkouts/snapshot/hdk/jdk/jre/bin/default/libgc_gen.so: undefined symbol: _Z23free_set_pool_put_entryP12Vector_BlockP11GC_Metadata
GC library cannot be loaded: libgc_gen.so
HMYEXEL062E Internal VM error: Failed to create Java VM
FAILED to invoke JVM.
Test: jitrino.OPTClass: shutdown.TestDaemonOnWait_optExit code: 1 Err: Loading error /export/users/cc/cc-suites/build/checkouts/snapshot/hdk/jdk/jre/bin/default/libgc_gen.so: undefined symbol: _Z23free_set_pool_put_entryP12Vector_BlockP11GC_Metadata
GC library cannot be loaded: libgc_gen.so
HMYEXEL062E Internal VM error: Failed to create Java VM
FAILED to invoke JVM.
Test: Server mode JITClass: shutdown.TestDaemonOnWait_srvExit code: 1 Err: Loading error /export/users/cc/cc-suites/build/checkouts/snapshot/hdk/jdk/jre/bin/default/libgc_gen.so: undefined symbol: _Z23free_set_pool_put_entryP12Vector_BlockP11GC_Metadata
GC library cannot be loaded: libgc_gen.so
HMYEXEL062E Internal VM error: Failed to create Java VM
FAILED to invoke JVM.
Test: interpreterClass: shutdown.TestFatalError_intExit code: 1 Err: Loading error /export/users/cc/cc-suites/build/checkouts/snapshot/hdk/jdk/jre/bin/default/libgc_gen.so: undefined symbol: _Z23free_set_pool_put_entryP12Vector_BlockP11GC_Metadata
GC library cannot be loaded: libgc_gen.so
HMYEXEL062E Internal VM error: Failed to create Java VM
FAILED to invoke JVM.
Test: jitrino.JETClass: shutdown.TestFatalError_jetExit code: 1 Err: Loading error /export/users/cc/cc-suites/build/checkouts/snapshot/hdk/jdk/jre/bin/default/libgc_gen.so: undefined symbol: _Z23free_set_pool_put_entryP12Vector_BlockP11GC_Metadata
GC library cannot be loaded: libgc_gen.so
HMYEXEL062E Internal VM error: Failed to create Java VM
FAILED to invoke JVM.
Test: Client mode JIT (default)Class: shutdown.TestFatalError_jitExit code: 1 Err: Loading error /export/users/cc/cc-suites/build/checkouts/snapshot/hdk/jdk/jre/bin/default/libgc_gen.so: undefined symbol: _Z23free_set_pool_put_entryP12Vector_BlockP11GC_Metadata
GC library cannot be loaded: libgc_gen.so
HMYEXEL062E Internal VM error: Failed to create Java VM
FAILED to invoke JVM.
Test: jitrino.OPTClass: shutdown.TestFatalError_optExit code: 1 Err: Loading error /export/users/cc/cc-suites/build/checkouts/snapshot/hdk/jdk/jre/bin/default/libgc_gen.so: undefined symbol: _Z23free_set_pool_put_entryP12Vector_BlockP11GC_Metadata
GC library cannot be loaded: libgc_gen.so
HMYEXEL062E Internal VM error: Failed to create Java VM
FAILED to invoke JVM.
Test: Server mode JITClass: shutdown.TestFatalError_srvExit code: 1 Err: Loading error /export/users/cc/cc-suites/build/checkouts/snapshot/hdk/jdk/jre/bin/default/libgc_gen.so: undefined symbol: _Z23free_set_pool_put_entryP12Vector_BlockP11GC_Metadata
GC library cannot be loaded: libgc_gen.so
HMYEXEL062E Internal VM error: Failed to create Java VM
FAILED to invoke JVM.
Test: interpreterClass: shutdown.TestInterrupt_intExit code: 1 Err: Loading error /export/users/cc/cc-suites/build/checkouts/snapshot/hdk/jdk/jre/bin/default/libgc_gen.so: undefined symbol: _Z23free_set_pool_put_entryP12Vector_BlockP11GC_Metadata
GC library cannot be loaded: libgc_gen.so
HMYEXEL062E Internal VM error: Failed to create Java VM
FAILED to invoke JVM.
Test: jitrino.JETClass: shutdown.TestInterrupt_jetExit code: 1 Err: Loading error /export/users/cc/cc-suites/build/checkouts/snapshot/hdk/jdk/jre/bin/default/libgc_gen.so: undefined symbol: _Z23free_set_pool_put_entryP12Vector_BlockP11GC_Metadata
GC library cannot be loaded: libgc_gen.so
HMYEXEL062E Internal VM error: Failed to create Java VM
FAILED to invoke JVM.
Test: Client mode JIT (default)Class: shutdown.TestInterrupt_jitExit code: 1 Err: Loading error /export/users/cc/cc-suites/build/checkouts/snapshot/hdk/jdk/jre/bin/default/libgc_gen.so: undefined symbol: _Z23free_set_pool_put_entryP12Vector_BlockP11GC_Metadata
GC library cannot be loaded: libgc_gen.so
HMYEXEL062E Internal VM error: Failed to create Java VM
FAILED to invoke JVM.
Test: jitrino.OPTClass: shutdown.TestInterrupt_optExit code: 1 Err: Loading error /export/users/cc/cc-suites/build/checkouts/snapshot/hdk/jdk/jre/bin/default/libgc_gen.so: undefined symbol: _Z23free_set_pool_put_entryP12Vector_BlockP11GC_Metadata
GC library cannot be loaded: libgc_gen.so
HMYEXEL062E Internal VM error: Failed to create Java VM
FAILED to invoke JVM.
Test: Server mode JITClass: shutdown.TestInterrupt_srvExit code: 1 Err: Loading error /export/users/cc/cc-suites/build/checkouts/snapshot/hdk/jdk/jre/bin/default/libgc_gen.so: undefined symbol: _Z23free_set_pool_put_entryP12Vector_BlockP11GC_Metadata
GC library cannot be loaded: libgc_gen.so
HMYEXEL062E Internal VM error: Failed to create Java VM
FAILED to invoke JVM.
Test: interpreterClass: shutdown.TestLock_intExit code: 1 Err: Loading error /export/users/cc/cc-suites/build/checkouts/snapshot/hdk/jdk/jre/bin/default/libgc_gen.so: undefined symbol: _Z23free_set_pool_put_entryP12Vector_BlockP11GC_Metadata
GC library cannot be loaded: libgc_gen.so
HMYEXEL062E Internal VM error: Failed to create Java VM
FAILED to invoke JVM.
Test: jitrino.JETClass: shutdown.TestLock_jetExit code: 1 Err: Loading error /export/users/cc/cc-suites/build/checkouts/snapshot/hdk/jdk/jre/bin/default/libgc_gen.so: undefined symbol: _Z23free_set_pool_put_entryP12Vector_BlockP11GC_Metadata
GC library cannot be loaded: libgc_gen.so
HMYEXEL062E Internal VM error: Failed to create Java VM
FAILED to invoke JVM.
Test: Client mode JIT (default)Class: shutdown.TestLock_jitExit code: 1 Err: Loading error /export/users/cc/cc-suites/build/checkouts/snapshot/hdk/jdk/jre/bin/default/libgc_gen.so: undefined symbol: _Z23free_set_pool_put_entryP12Vector_BlockP11GC_Metadata
GC library cannot be loaded: libgc_gen.so
HMYEXEL062E Internal VM error: Failed to create Java VM
FAILED to invoke JVM.
Test: jitrino.OPTClass: shutdown.TestLock_optExit code: 1 Err: Loading error /export/users/cc/cc-suites/build/checkouts/snapshot/hdk/jdk/jre/bin/default/libgc_gen.so: undefined symbol: _Z23free_set_pool_put_entryP12Vector_BlockP11GC_Metadata
GC library cannot be loaded: libgc_gen.so
HMYEXEL062E Internal VM error: Failed to create Java VM
FAILED to invoke JVM.
Test: Server mode JITClass: shutdown.TestLock_srvExit code: 1 Err: Loading error /export/users/cc/cc-suites/build/checkouts/snapshot/hdk/jdk/jre/bin/default/libgc_gen.so: undefined symbol: _Z23free_set_pool_put_entryP12Vector_BlockP11GC_Metadata
GC library cannot be loaded: libgc_gen.so
HMYEXEL062E Internal VM error: Failed to create Java VM
FAILED to invoke JVM.
Test: interpreterClass: stress.BigStringBuffer_intExit code: 1 Err: Loading error /export/users/cc/cc-suites/build/checkouts/snapshot/hdk/jdk/jre/bin/default/libgc_gen.so: undefined symbol: _Z23free_set_pool_put_entryP12Vector_BlockP11GC_Metadata
GC library cannot be loaded: libgc_gen.so
HMYEXEL062E Internal VM error: Failed to create Java VM
FAILED to invoke JVM.
Test: jitrino.JETClass: stress.BigStringBuffer_jetExit code: 1 Err: Loading error /export/users/cc/cc-suites/build/checkouts/snapshot/hdk/jdk/jre/bin/default/libgc_gen.so: undefined symbol: _Z23free_set_pool_put_entryP12Vector_BlockP11GC_Metadata
GC library cannot be loaded: libgc_gen.so
HMYEXEL062E Internal VM error: Failed to create Java VM
FAILED to invoke JVM.
Test: Client mode JIT (default)Class: stress.BigStringBuffer_jitExit code: 1 Err: Loading error /export/users/cc/cc-suites/build/checkouts/snapshot/hdk/jdk/jre/bin/default/libgc_gen.so: undefined symbol: _Z23free_set_pool_put_entryP12Vector_BlockP11GC_Metadata
GC library cannot be loaded: libgc_gen.so
HMYEXEL062E Internal VM error: Failed to create Java VM
FAILED to invoke JVM.
Test: jitrino.OPTClass: stress.BigStringBuffer_optExit code: 1 Err: Loading error /export/users/cc/cc-suites/build/checkouts/snapshot/hdk/jdk/jre/bin/default/libgc_gen.so: undefined symbol: _Z23free_set_pool_put_entryP12Vector_BlockP11GC_Metadata
GC library cannot be loaded: libgc_gen.so
HMYEXEL062E Internal VM error: Failed to create Java VM
FAILED to invoke JVM.
Test: Server mode JITClass: stress.BigStringBuffer_srvExit code: 1 Err: Loading error /export/users/cc/cc-suites/build/checkouts/snapshot/hdk/jdk/jre/bin/default/libgc_gen.so: undefined symbol: _Z23free_set_pool_put_entryP12Vector_BlockP11GC_Metadata
GC library cannot be loaded: libgc_gen.so
HMYEXEL062E Internal VM error: Failed to create Java VM
FAILED to invoke JVM.
Test: interpreterClass: stress.Finalizer_intExit code: 1 Err: Loading error /export/users/cc/cc-suites/build/checkouts/snapshot/hdk/jdk/jre/bin/default/libgc_gen.so: undefined symbol: _Z23free_set_pool_put_entryP12Vector_BlockP11GC_Metadata
GC library cannot be loaded: libgc_gen.so
HMYEXEL062E Internal VM error: Failed to create Java VM
FAILED to invoke JVM.
Test: jitrino.JETClass: stress.Finalizer_jetExit code: 1 Err: Loading error /export/users/cc/cc-suites/build/checkouts/snapshot/hdk/jdk/jre/bin/default/libgc_gen.so: undefined symbol: _Z23free_set_pool_put_entryP12Vector_BlockP11GC_Metadata
GC library cannot be loaded: libgc_gen.so
HMYEXEL062E Internal VM error: Failed to create Java VM
FAILED to invoke JVM.
Test: Client mode JIT (default)Class: stress.Finalizer_jitExit code: 1 Err: Loading error /export/users/cc/cc-suites/build/checkouts/snapshot/hdk/jdk/jre/bin/default/libgc_gen.so: undefined symbol: _Z23free_set_pool_put_entryP12Vector_BlockP11GC_Metadata
GC library cannot be loaded: libgc_gen.so
HMYEXEL062E Internal VM error: Failed to create Java VM
FAILED to invoke JVM.
Test: jitrino.OPTClass: stress.Finalizer_optExit code: 1 Err: Loading error /export/users/cc/cc-suites/build/checkouts/snapshot/hdk/jdk/jre/bin/default/libgc_gen.so: undefined symbol: _Z23free_set_pool_put_entryP12Vector_BlockP11GC_Metadata
GC library cannot be loaded: libgc_gen.so
HMYEXEL062E Internal VM error: Failed to create Java VM
FAILED to invoke JVM.
Test: Server mode JITClass: stress.Finalizer_srvExit code: 1 Err: Loading error /export/users/cc/cc-suites/build/checkouts/snapshot/hdk/jdk/jre/bin/default/libgc_gen.so: undefined symbol: _Z23free_set_pool_put_entryP12Vector_BlockP11GC_Metadata
GC library cannot be loaded: libgc_gen.so
HMYEXEL062E Internal VM error: Failed to create Java VM
FAILED to invoke JVM.
Test: jitrino.JETClass: stress.Intern_jetExit code: 1 Err: Loading error /export/users/cc/cc-suites/build/checkouts/snapshot/hdk/jdk/jre/bin/default/libgc_gen.so: undefined symbol: _Z23free_set_pool_put_entryP12Vector_BlockP11GC_Metadata
GC library cannot be loaded: libgc_gen.so
HMYEXEL062E Internal VM error: Failed to create Java VM
FAILED to invoke JVM.
Test: Client mode JIT (default)Class: stress.Intern_jitExit code: 1 Err: Loading error /export/users/cc/cc-suites/build/checkouts/snapshot/hdk/jdk/jre/bin/default/libgc_gen.so: undefined symbol: _Z23free_set_pool_put_entryP12Vector_BlockP11GC_Metadata
GC library cannot be loaded: libgc_gen.so
HMYEXEL062E Internal VM error: Failed to create Java VM
FAILED to invoke JVM.
Test: jitrino.OPTClass: stress.Intern_optExit code: 1 Err: Loading error /export/users/cc/cc-suites/build/checkouts/snapshot/hdk/jdk/jre/bin/default/libgc_gen.so: undefined symbol: _Z23free_set_pool_put_entryP12Vector_BlockP11GC_Metadata
GC library cannot be loaded: libgc_gen.so
HMYEXEL062E Internal VM error: Failed to create Java VM
FAILED to invoke JVM.
Test: Server mode JITClass: stress.Intern_srvExit code: 1 Err: Loading error /export/users/cc/cc-suites/build/checkouts/snapshot/hdk/jdk/jre/bin/default/libgc_gen.so: undefined symbol: _Z23free_set_pool_put_entryP12Vector_BlockP11GC_Metadata
GC library cannot be loaded: libgc_gen.so
HMYEXEL062E Internal VM error: Failed to create Java VM
FAILED to invoke JVM.
Test: interpreterClass: stress.Mix_intExit code: 1 Err: Loading error /export/users/cc/cc-suites/build/checkouts/snapshot/hdk/jdk/jre/bin/default/libgc_gen.so: undefined symbol: _Z23free_set_pool_put_entryP12Vector_BlockP11GC_Metadata
GC library cannot be loaded: libgc_gen.so
HMYEXEL062E Internal VM error: Failed to create Java VM
FAILED to invoke JVM.
Test: jitrino.JETClass: stress.Mix_jetExit code: 1 Err: Loading error /export/users/cc/cc-suites/build/checkouts/snapshot/hdk/jdk/jre/bin/default/libgc_gen.so: undefined symbol: _Z23free_set_pool_put_entryP12Vector_BlockP11GC_Metadata
GC library cannot be loaded: libgc_gen.so
HMYEXEL062E Internal VM error: Failed to create Java VM
FAILED to invoke JVM.
Test: Client mode JIT (default)Class: stress.Mix_jitExit code: 1 Err: Loading error /export/users/cc/cc-suites/build/checkouts/snapshot/hdk/jdk/jre/bin/default/libgc_gen.so: undefined symbol: _Z23free_set_pool_put_entryP12Vector_BlockP11GC_Metadata
GC library cannot be loaded: libgc_gen.so
HMYEXEL062E Internal VM error: Failed to create Java VM
FAILED to invoke JVM.
Test: jitrino.OPTClass: stress.Mix_optExit code: 1 Err: Loading error /export/users/cc/cc-suites/build/checkouts/snapshot/hdk/jdk/jre/bin/default/libgc_gen.so: undefined symbol: _Z23free_set_pool_put_entryP12Vector_BlockP11GC_Metadata
GC library cannot be loaded: libgc_gen.so
HMYEXEL062E Internal VM error: Failed to create Java VM
FAILED to invoke JVM.
Test: Server mode JITClass: stress.Mix_srvExit code: 1 Err: Loading error /export/users/cc/cc-suites/build/checkouts/snapshot/hdk/jdk/jre/bin/default/libgc_gen.so: undefined symbol: _Z23free_set_pool_put_entryP12Vector_BlockP11GC_Metadata
GC library cannot be loaded: libgc_gen.so
HMYEXEL062E Internal VM error: Failed to create Java VM
FAILED to invoke JVM.
Test: interpreterClass: stress.Stack_intExit code: 1 Err: Loading error /export/users/cc/cc-suites/build/checkouts/snapshot/hdk/jdk/jre/bin/default/libgc_gen.so: undefined symbol: _Z23free_set_pool_put_entryP12Vector_BlockP11GC_Metadata
GC library cannot be loaded: libgc_gen.so
HMYEXEL062E Internal VM error: Failed to create Java VM
FAILED to invoke JVM.
Test: interpreterClass: stress.Sync_intExit code: 1 Err: Loading error /export/users/cc/cc-suites/build/checkouts/snapshot/hdk/jdk/jre/bin/default/libgc_gen.so: undefined symbol: _Z23free_set_pool_put_entryP12Vector_BlockP11GC_Metadata
GC library cannot be loaded: libgc_gen.so
HMYEXEL062E Internal VM error: Failed to create Java VM
FAILED to invoke JVM.
Test: jitrino.JETClass: stress.Sync_jetExit code: 1 Err: Loading error /export/users/cc/cc-suites/build/checkouts/snapshot/hdk/jdk/jre/bin/default/libgc_gen.so: undefined symbol: _Z23free_set_pool_put_entryP12Vector_BlockP11GC_Metadata
GC library cannot be loaded: libgc_gen.so
HMYEXEL062E Internal VM error: Failed to create Java VM
FAILED to invoke JVM.
Test: Client mode JIT (default)Class: stress.Sync_jitExit code: 1 Err: Loading error /export/users/cc/cc-suites/build/checkouts/snapshot/hdk/jdk/jre/bin/default/libgc_gen.so: undefined symbol: _Z23free_set_pool_put_entryP12Vector_BlockP11GC_Metadata
GC library cannot be loaded: libgc_gen.so
HMYEXEL062E Internal VM error: Failed to create Java VM
FAILED to invoke JVM.
Test: jitrino.OPTClass: stress.Sync_optExit code: 1 Err: Loading error /export/users/cc/cc-suites/build/checkouts/snapshot/hdk/jdk/jre/bin/default/libgc_gen.so: undefined symbol: _Z23free_set_pool_put_entryP12Vector_BlockP11GC_Metadata
GC library cannot be loaded: libgc_gen.so
HMYEXEL062E Internal VM error: Failed to create Java VM
FAILED to invoke JVM.
Test: Server mode JITClass: stress.Sync_srvExit code: 1 Err: Loading error /export/users/cc/cc-suites/build/checkouts/snapshot/hdk/jdk/jre/bin/default/libgc_gen.so: undefined symbol: _Z23free_set_pool_put_entryP12Vector_BlockP11GC_Metadata
GC library cannot be loaded: libgc_gen.so
HMYEXEL062E Internal VM error: Failed to create Java VM
FAILED to invoke JVM.
Test: interpreterClass: stress.Threads_intExit code: 1 Err: Loading error /export/users/cc/cc-suites/build/checkouts/snapshot/hdk/jdk/jre/bin/default/libgc_gen.so: undefined symbol: _Z23free_set_pool_put_entryP12Vector_BlockP11GC_Metadata
GC library cannot be loaded: libgc_gen.so
HMYEXEL062E Internal VM error: Failed to create Java VM
FAILED to invoke JVM.
Test: jitrino.JETClass: stress.Threads_jetExit code: 1 Err: Loading error /export/users/cc/cc-suites/build/checkouts/snapshot/hdk/jdk/jre/bin/default/libgc_gen.so: undefined symbol: _Z23free_set_pool_put_entryP12Vector_BlockP11GC_Metadata
GC library cannot be loaded: libgc_gen.so
HMYEXEL062E Internal VM error: Failed to create Java VM
FAILED to invoke JVM.
Test: Client mode JIT (default)Class: stress.Threads_jitExit code: 1 Err: Loading error /export/users/cc/cc-suites/build/checkouts/snapshot/hdk/jdk/jre/bin/default/libgc_gen.so: undefined symbol: _Z23free_set_pool_put_entryP12Vector_BlockP11GC_Metadata
GC library cannot be loaded: libgc_gen.so
HMYEXEL062E Internal VM error: Failed to create Java VM
FAILED to invoke JVM.
Test: jitrino.OPTClass: stress.Threads_optExit code: 1 Err: Loading error /export/users/cc/cc-suites/build/checkouts/snapshot/hdk/jdk/jre/bin/default/libgc_gen.so: undefined symbol: _Z23free_set_pool_put_entryP12Vector_BlockP11GC_Metadata
GC library cannot be loaded: libgc_gen.so
HMYEXEL062E Internal VM error: Failed to create Java VM
FAILED to invoke JVM.
Test: Server mode JITClass: stress.Threads_srvExit code: 1 Err: Loading error /export/users/cc/cc-suites/build/checkouts/snapshot/hdk/jdk/jre/bin/default/libgc_gen.so: undefined symbol: _Z23free_set_pool_put_entryP12Vector_BlockP11GC_Metadata
GC library cannot be loaded: libgc_gen.so
HMYEXEL062E Internal VM error: Failed to create Java VM
FAILED to invoke JVM.
Test: interpreterClass: stress.Vector_intExit code: 1 Err: Loading error /export/users/cc/cc-suites/build/checkouts/snapshot/hdk/jdk/jre/bin/default/libgc_gen.so: undefined symbol: _Z23free_set_pool_put_entryP12Vector_BlockP11GC_Metadata
GC library cannot be loaded: libgc_gen.so
HMYEXEL062E Internal VM error: Failed to create Java VM
FAILED to invoke JVM.
Test: jitrino.JETClass: stress.Vector_jetExit code: 1 Err: Loading error /export/users/cc/cc-suites/build/checkouts/snapshot/hdk/jdk/jre/bin/default/libgc_gen.so: undefined symbol: _Z23free_set_pool_put_entryP12Vector_BlockP11GC_Metadata
GC library cannot be loaded: libgc_gen.so
HMYEXEL062E Internal VM error: Failed to create Java VM
FAILED to invoke JVM.
Test: Client mode JIT (default)Class: stress.Vector_jitExit code: 1 Err: Loading error /export/users/cc/cc-suites/build/checkouts/snapshot/hdk/jdk/jre/bin/default/libgc_gen.so: undefined symbol: _Z23free_set_pool_put_entryP12Vector_BlockP11GC_Metadata
GC library cannot be loaded: libgc_gen.so
HMYEXEL062E Internal VM error: Failed to create Java VM
FAILED to invoke JVM.
Test: jitrino.OPTClass: stress.Vector_optExit code: 1 Err: Loading error /export/users/cc/cc-suites/build/checkouts/snapshot/hdk/jdk/jre/bin/default/libgc_gen.so: undefined symbol: _Z23free_set_pool_put_entryP12Vector_BlockP11GC_Metadata
GC library cannot be loaded: libgc_gen.so
HMYEXEL062E Internal VM error: Failed to create Java VM
FAILED to invoke JVM.
Test: Server mode JITClass: stress.Vector_srvExit code: 1 Err: Loading error /export/users/cc/cc-suites/build/checkouts/snapshot/hdk/jdk/jre/bin/default/libgc_gen.so: undefined symbol: _Z23free_set_pool_put_entryP12Vector_BlockP11GC_Metadata
GC library cannot be loaded: libgc_gen.so
HMYEXEL062E Internal VM error: Failed to create Java VM
FAILED to invoke JVM.
Test: interpreterClass: stress.WeakHashmapTest_intExit code: 1 Err: Loading error /export/users/cc/cc-suites/build/checkouts/snapshot/hdk/jdk/jre/bin/default/libgc_gen.so: undefined symbol: _Z23free_set_pool_put_entryP12Vector_BlockP11GC_Metadata
GC library cannot be loaded: libgc_gen.so
HMYEXEL062E Internal VM error: Failed to create Java VM
FAILED to invoke JVM.
Test: jitrino.JETClass: stress.WeakHashmapTest_jetExit code: 1 Err: Loading error /export/users/cc/cc-suites/build/checkouts/snapshot/hdk/jdk/jre/bin/default/libgc_gen.so: undefined symbol: _Z23free_set_pool_put_entryP12Vector_BlockP11GC_Metadata
GC library cannot be loaded: libgc_gen.so
HMYEXEL062E Internal VM error: Failed to create Java VM
FAILED to invoke JVM.
Test: Client mode JIT (default)Class: stress.WeakHashmapTest_jitExit code: 1 Err: Loading error /export/users/cc/cc-suites/build/checkouts/snapshot/hdk/jdk/jre/bin/default/libgc_gen.so: undefined symbol: _Z23free_set_pool_put_entryP12Vector_BlockP11GC_Metadata
GC library cannot be loaded: libgc_gen.so
HMYEXEL062E Internal VM error: Failed to create Java VM
FAILED to invoke JVM.
Test: jitrino.OPTClass: stress.WeakHashmapTest_optExit code: 1 Err: Loading error /export/users/cc/cc-suites/build/checkouts/snapshot/hdk/jdk/jre/bin/default/libgc_gen.so: undefined symbol: _Z23free_set_pool_put_entryP12Vector_BlockP11GC_Metadata
GC library cannot be loaded: libgc_gen.so
HMYEXEL062E Internal VM error: Failed to create Java VM
FAILED to invoke JVM.
Test: Server mode JITClass: stress.WeakHashmapTest_srvExit code: 1 Err: Loading error /export/users/cc/cc-suites/build/checkouts/snapshot/hdk/jdk/jre/bin/default/libgc_gen.so: undefined symbol: _Z23free_set_pool_put_entryP12Vector_BlockP11GC_Metadata
GC library cannot be loaded: libgc_gen.so
HMYEXEL062E Internal VM error: Failed to create Java VM
FAILED to invoke JVM.
Test: interpreterClass: thread.ExitShutdownHook_intExit code: 1 Err: Loading error /export/users/cc/cc-suites/build/checkouts/snapshot/hdk/jdk/jre/bin/default/libgc_gen.so: undefined symbol: _Z23free_set_pool_put_entryP12Vector_BlockP11GC_Metadata
GC library cannot be loaded: libgc_gen.so
HMYEXEL062E Internal VM error: Failed to create Java VM
FAILED to invoke JVM.
Test: jitrino.JETClass: thread.ExitShutdownHook_jetExit code: 1 Err: Loading error /export/users/cc/cc-suites/build/checkouts/snapshot/hdk/jdk/jre/bin/default/libgc_gen.so: undefined symbol: _Z23free_set_pool_put_entryP12Vector_BlockP11GC_Metadata
GC library cannot be loaded: libgc_gen.so
HMYEXEL062E Internal VM error: Failed to create Java VM
FAILED to invoke JVM.
Test: Client mode JIT (default)Class: thread.ExitShutdownHook_jitExit code: 1 Err: Loading error /export/users/cc/cc-suites/build/checkouts/snapshot/hdk/jdk/jre/bin/default/libgc_gen.so: undefined symbol: _Z23free_set_pool_put_entryP12Vector_BlockP11GC_Metadata
GC library cannot be loaded: libgc_gen.so
HMYEXEL062E Internal VM error: Failed to create Java VM
FAILED to invoke JVM.
Test: jitrino.OPTClass: thread.ExitShutdownHook_optExit code: 1 Err: Loading error /export/users/cc/cc-suites/build/checkouts/snapshot/hdk/jdk/jre/bin/default/libgc_gen.so: undefined symbol: _Z23free_set_pool_put_entryP12Vector_BlockP11GC_Metadata
GC library cannot be loaded: libgc_gen.so
HMYEXEL062E Internal VM error: Failed to create Java VM
FAILED to invoke JVM.
Test: Server mode JITClass: thread.ExitShutdownHook_srvExit code: 1 Err: Loading error /export/users/cc/cc-suites/build/checkouts/snapshot/hdk/jdk/jre/bin/default/libgc_gen.so: undefined symbol: _Z23free_set_pool_put_entryP12Vector_BlockP11GC_Metadata
GC library cannot be loaded: libgc_gen.so
HMYEXEL062E Internal VM error: Failed to create Java VM
FAILED to invoke JVM.
Test: interpreterClass: thread.InfiniteFinalizer_intExit code: 1 Err: Loading error /export/users/cc/cc-suites/build/checkouts/snapshot/hdk/jdk/jre/bin/default/libgc_gen.so: undefined symbol: _Z23free_set_pool_put_entryP12Vector_BlockP11GC_Metadata
GC library cannot be loaded: libgc_gen.so
HMYEXEL062E Internal VM error: Failed to create Java VM
FAILED to invoke JVM.
Test: jitrino.JETClass: thread.InfiniteFinalizer_jetExit code: 1 Err: Loading error /export/users/cc/cc-suites/build/checkouts/snapshot/hdk/jdk/jre/bin/default/libgc_gen.so: undefined symbol: _Z23free_set_pool_put_entryP12Vector_BlockP11GC_Metadata
GC library cannot be loaded: libgc_gen.so
HMYEXEL062E Internal VM error: Failed to create Java VM
FAILED to invoke JVM.
Test: Client mode JIT (default)Class: thread.InfiniteFinalizer_jitExit code: 1 Err: Loading error /export/users/cc/cc-suites/build/checkouts/snapshot/hdk/jdk/jre/bin/default/libgc_gen.so: undefined symbol: _Z23free_set_pool_put_entryP12Vector_BlockP11GC_Metadata
GC library cannot be loaded: libgc_gen.so
HMYEXEL062E Internal VM error: Failed to create Java VM
FAILED to invoke JVM.
Test: jitrino.OPTClass: thread.InfiniteFinalizer_optExit code: 1 Err: Loading error /export/users/cc/cc-suites/build/checkouts/snapshot/hdk/jdk/jre/bin/default/libgc_gen.so: undefined symbol: _Z23free_set_pool_put_entryP12Vector_BlockP11GC_Metadata
GC library cannot be loaded: libgc_gen.so
HMYEXEL062E Internal VM error: Failed to create Java VM
FAILED to invoke JVM.
Test: Server mode JITClass: thread.InfiniteFinalizer_srvExit code: 1 Err: Loading error /export/users/cc/cc-suites/build/checkouts/snapshot/hdk/jdk/jre/bin/default/libgc_gen.so: undefined symbol: _Z23free_set_pool_put_entryP12Vector_BlockP11GC_Metadata
GC library cannot be loaded: libgc_gen.so
HMYEXEL062E Internal VM error: Failed to create Java VM
FAILED to invoke JVM.
Test: interpreterClass: thread.InterruptWait_intExit code: 1 Err: Loading error /export/users/cc/cc-suites/build/checkouts/snapshot/hdk/jdk/jre/bin/default/libgc_gen.so: undefined symbol: _Z23free_set_pool_put_entryP12Vector_BlockP11GC_Metadata
GC library cannot be loaded: libgc_gen.so
HMYEXEL062E Internal VM error: Failed to create Java VM
FAILED to invoke JVM.
Test: jitrino.JETClass: thread.InterruptWait_jetExit code: 1 Err: Loading error /export/users/cc/cc-suites/build/checkouts/snapshot/hdk/jdk/jre/bin/default/libgc_gen.so: undefined symbol: _Z23free_set_pool_put_entryP12Vector_BlockP11GC_Metadata
GC library cannot be loaded: libgc_gen.so
HMYEXEL062E Internal VM error: Failed to create Java VM
FAILED to invoke JVM.
Test: Client mode JIT (default)Class: thread.InterruptWait_jitExit code: 1 Err: Loading error /export/users/cc/cc-suites/build/checkouts/snapshot/hdk/jdk/jre/bin/default/libgc_gen.so: undefined symbol: _Z23free_set_pool_put_entryP12Vector_BlockP11GC_Metadata
GC library cannot be loaded: libgc_gen.so
HMYEXEL062E Internal VM error: Failed to create Java VM
FAILED to invoke JVM.
Test: jitrino.OPTClass: thread.InterruptWait_optExit code: 1 Err: Loading error /export/users/cc/cc-suites/build/checkouts/snapshot/hdk/jdk/jre/bin/default/libgc_gen.so: undefined symbol: _Z23free_set_pool_put_entryP12Vector_BlockP11GC_Metadata
GC library cannot be loaded: libgc_gen.so
HMYEXEL062E Internal VM error: Failed to create Java VM
FAILED to invoke JVM.
Test: Server mode JITClass: thread.InterruptWait_srvExit code: 1 Err: Loading error /export/users/cc/cc-suites/build/checkouts/snapshot/hdk/jdk/jre/bin/default/libgc_gen.so: undefined symbol: _Z23free_set_pool_put_entryP12Vector_BlockP11GC_Metadata
GC library cannot be loaded: libgc_gen.so
HMYEXEL062E Internal VM error: Failed to create Java VM
FAILED to invoke JVM.
Test: interpreterClass: thread.Sleep_intExit code: 1 Err: Loading error /export/users/cc/cc-suites/build/checkouts/snapshot/hdk/jdk/jre/bin/default/libgc_gen.so: undefined symbol: _Z23free_set_pool_put_entryP12Vector_BlockP11GC_Metadata
GC library cannot be loaded: libgc_gen.so
HMYEXEL062E Internal VM error: Failed to create Java VM
FAILED to invoke JVM.
Test: jitrino.JETClass: thread.Sleep_jetExit code: 1 Err: Loading error /export/users/cc/cc-suites/build/checkouts/snapshot/hdk/jdk/jre/bin/default/libgc_gen.so: undefined symbol: _Z23free_set_pool_put_entryP12Vector_BlockP11GC_Metadata
GC library cannot be loaded: libgc_gen.so
HMYEXEL062E Internal VM error: Failed to create Java VM
FAILED to invoke JVM.
Test: Client mode JIT (default)Class: thread.Sleep_jitExit code: 1 Err: Loading error /export/users/cc/cc-suites/build/checkouts/snapshot/hdk/jdk/jre/bin/default/libgc_gen.so: undefined symbol: _Z23free_set_pool_put_entryP12Vector_BlockP11GC_Metadata
GC library cannot be loaded: libgc_gen.so
HMYEXEL062E Internal VM error: Failed to create Java VM
FAILED to invoke JVM.
Test: jitrino.OPTClass: thread.Sleep_optExit code: 1 Err: Loading error /export/users/cc/cc-suites/build/checkouts/snapshot/hdk/jdk/jre/bin/default/libgc_gen.so: undefined symbol: _Z23free_set_pool_put_entryP12Vector_BlockP11GC_Metadata
GC library cannot be loaded: libgc_gen.so
HMYEXEL062E Internal VM error: Failed to create Java VM
FAILED to invoke JVM.
Test: Server mode JITClass: thread.Sleep_srvExit code: 1 Err: Loading error /export/users/cc/cc-suites/build/checkouts/snapshot/hdk/jdk/jre/bin/default/libgc_gen.so: undefined symbol: _Z23free_set_pool_put_entryP12Vector_BlockP11GC_Metadata
GC library cannot be loaded: libgc_gen.so
HMYEXEL062E Internal VM error: Failed to create Java VM
FAILED to invoke JVM.
Test: interpreterClass: thread.SmallStackThreadTest_intExit code: 1 Err: Loading error /export/users/cc/cc-suites/build/checkouts/snapshot/hdk/jdk/jre/bin/default/libgc_gen.so: undefined symbol: _Z23free_set_pool_put_entryP12Vector_BlockP11GC_Metadata
GC library cannot be loaded: libgc_gen.so
HMYEXEL062E Internal VM error: Failed to create Java VM
FAILED to invoke JVM.
Test: jitrino.JETClass: thread.SmallStackThreadTest_jetExit code: 1 Err: Loading error /export/users/cc/cc-suites/build/checkouts/snapshot/hdk/jdk/jre/bin/default/libgc_gen.so: undefined symbol: _Z23free_set_pool_put_entryP12Vector_BlockP11GC_Metadata
GC library cannot be loaded: libgc_gen.so
HMYEXEL062E Internal VM error: Failed to create Java VM
FAILED to invoke JVM.
Test: Client mode JIT (default)Class: thread.SmallStackThreadTest_jitExit code: 1 Err: Loading error /export/users/cc/cc-suites/build/checkouts/snapshot/hdk/jdk/jre/bin/default/libgc_gen.so: undefined symbol: _Z23free_set_pool_put_entryP12Vector_BlockP11GC_Metadata
GC library cannot be loaded: libgc_gen.so
HMYEXEL062E Internal VM error: Failed to create Java VM
FAILED to invoke JVM.
Test: jitrino.OPTClass: thread.SmallStackThreadTest_optExit code: 1 Err: Loading error /export/users/cc/cc-suites/build/checkouts/snapshot/hdk/jdk/jre/bin/default/libgc_gen.so: undefined symbol: _Z23free_set_pool_put_entryP12Vector_BlockP11GC_Metadata
GC library cannot be loaded: libgc_gen.so
HMYEXEL062E Internal VM error: Failed to create Java VM
FAILED to invoke JVM.
Test: Server mode JITClass: thread.SmallStackThreadTest_srvExit code: 1 Err: Loading error /export/users/cc/cc-suites/build/checkouts/snapshot/hdk/jdk/jre/bin/default/libgc_gen.so: undefined symbol: _Z23free_set_pool_put_entryP12Vector_BlockP11GC_Metadata
GC library cannot be loaded: libgc_gen.so
HMYEXEL062E Internal VM error: Failed to create Java VM
FAILED to invoke JVM.
Test: interpreterClass: thread.ThreadInterrupt_intExit code: 1 Err: Loading error /export/users/cc/cc-suites/build/checkouts/snapshot/hdk/jdk/jre/bin/default/libgc_gen.so: undefined symbol: _Z23free_set_pool_put_entryP12Vector_BlockP11GC_Metadata
GC library cannot be loaded: libgc_gen.so
HMYEXEL062E Internal VM error: Failed to create Java VM
FAILED to invoke JVM.
Test: jitrino.JETClass: thread.ThreadInterrupt_jetExit code: 1 Err: Loading error /export/users/cc/cc-suites/build/checkouts/snapshot/hdk/jdk/jre/bin/default/libgc_gen.so: undefined symbol: _Z23free_set_pool_put_entryP12Vector_BlockP11GC_Metadata
GC library cannot be loaded: libgc_gen.so
HMYEXEL062E Internal VM error: Failed to create Java VM
FAILED to invoke JVM.
Test: Client mode JIT (default)Class: thread.ThreadInterrupt_jitExit code: 1 Err: Loading error /export/users/cc/cc-suites/build/checkouts/snapshot/hdk/jdk/jre/bin/default/libgc_gen.so: undefined symbol: _Z23free_set_pool_put_entryP12Vector_BlockP11GC_Metadata
GC library cannot be loaded: libgc_gen.so
HMYEXEL062E Internal VM error: Failed to create Java VM
FAILED to invoke JVM.
Test: jitrino.OPTClass: thread.ThreadInterrupt_optExit code: 1 Err: Loading error /export/users/cc/cc-suites/build/checkouts/snapshot/hdk/jdk/jre/bin/default/libgc_gen.so: undefined symbol: _Z23free_set_pool_put_entryP12Vector_BlockP11GC_Metadata
GC library cannot be loaded: libgc_gen.so
HMYEXEL062E Internal VM error: Failed to create Java VM
FAILED to invoke JVM.
Test: Server mode JITClass: thread.ThreadInterrupt_srvExit code: 1 Err: Loading error /export/users/cc/cc-suites/build/checkouts/snapshot/hdk/jdk/jre/bin/default/libgc_gen.so: undefined symbol: _Z23free_set_pool_put_entryP12Vector_BlockP11GC_Metadata
GC library cannot be loaded: libgc_gen.so
HMYEXEL062E Internal VM error: Failed to create Java VM
FAILED to invoke JVM.
Test: interpreterClass: thread.ThreadOOM_intExit code: 1 Err: Loading error /export/users/cc/cc-suites/build/checkouts/snapshot/hdk/jdk/jre/bin/default/libgc_gen.so: undefined symbol: _Z23free_set_pool_put_entryP12Vector_BlockP11GC_Metadata
GC library cannot be loaded: libgc_gen.so
HMYEXEL062E Internal VM error: Failed to create Java VM
FAILED to invoke JVM.
Test: jitrino.JETClass: thread.ThreadOOM_jetExit code: 1 Err: Loading error /export/users/cc/cc-suites/build/checkouts/snapshot/hdk/jdk/jre/bin/default/libgc_gen.so: undefined symbol: _Z23free_set_pool_put_entryP12Vector_BlockP11GC_Metadata
GC library cannot be loaded: libgc_gen.so
HMYEXEL062E Internal VM error: Failed to create Java VM
FAILED to invoke JVM.
Test: Client mode JIT (default)Class: thread.ThreadOOM_jitExit code: 1 Err: Loading error /export/users/cc/cc-suites/build/checkouts/snapshot/hdk/jdk/jre/bin/default/libgc_gen.so: undefined symbol: _Z23free_set_pool_put_entryP12Vector_BlockP11GC_Metadata
GC library cannot be loaded: libgc_gen.so
HMYEXEL062E Internal VM error: Failed to create Java VM
FAILED to invoke JVM.
Test: jitrino.OPTClass: thread.ThreadOOM_optExit code: 1 Err: Loading error /export/users/cc/cc-suites/build/checkouts/snapshot/hdk/jdk/jre/bin/default/libgc_gen.so: undefined symbol: _Z23free_set_pool_put_entryP12Vector_BlockP11GC_Metadata
GC library cannot be loaded: libgc_gen.so
HMYEXEL062E Internal VM error: Failed to create Java VM
FAILED to invoke JVM.
Test: Server mode JITClass: thread.ThreadOOM_srvExit code: 1 Err: Loading error /export/users/cc/cc-suites/build/checkouts/snapshot/hdk/jdk/jre/bin/default/libgc_gen.so: undefined symbol: _Z23free_set_pool_put_entryP12Vector_BlockP11GC_Metadata
GC library cannot be loaded: libgc_gen.so
HMYEXEL062E Internal VM error: Failed to create Java VM
FAILED to invoke JVM.
Test: interpreterClass: util.Date_intExit code: 1 Err: Loading error /export/users/cc/cc-suites/build/checkouts/snapshot/hdk/jdk/jre/bin/default/libgc_gen.so: undefined symbol: _Z23free_set_pool_put_entryP12Vector_BlockP11GC_Metadata
GC library cannot be loaded: libgc_gen.so
HMYEXEL062E Internal VM error: Failed to create Java VM
FAILED to invoke JVM.
Test: jitrino.JETClass: util.Date_jetExit code: 1 Err: Loading error /export/users/cc/cc-suites/build/checkouts/snapshot/hdk/jdk/jre/bin/default/libgc_gen.so: undefined symbol: _Z23free_set_pool_put_entryP12Vector_BlockP11GC_Metadata
GC library cannot be loaded: libgc_gen.so
HMYEXEL062E Internal VM error: Failed to create Java VM
FAILED to invoke JVM.
Test: Client mode JIT (default)Class: util.Date_jitExit code: 1 Err: Loading error /export/users/cc/cc-suites/build/checkouts/snapshot/hdk/jdk/jre/bin/default/libgc_gen.so: undefined symbol: _Z23free_set_pool_put_entryP12Vector_BlockP11GC_Metadata
GC library cannot be loaded: libgc_gen.so
HMYEXEL062E Internal VM error: Failed to create Java VM
FAILED to invoke JVM.
Test: jitrino.OPTClass: util.Date_optExit code: 1 Err: Loading error /export/users/cc/cc-suites/build/checkouts/snapshot/hdk/jdk/jre/bin/default/libgc_gen.so: undefined symbol: _Z23free_set_pool_put_entryP12Vector_BlockP11GC_Metadata
GC library cannot be loaded: libgc_gen.so
HMYEXEL062E Internal VM error: Failed to create Java VM
FAILED to invoke JVM.
Test: Server mode JITClass: util.Date_srvExit code: 1 Err: Loading error /export/users/cc/cc-suites/build/checkouts/snapshot/hdk/jdk/jre/bin/default/libgc_gen.so: undefined symbol: _Z23free_set_pool_put_entryP12Vector_BlockP11GC_Metadata
GC library cannot be loaded: libgc_gen.so
HMYEXEL062E Internal VM error: Failed to create Java VM
FAILED to invoke JVM.
Test: interpreterClass: util.DoPriveleged_intExit code: 1 Err: Loading error /export/users/cc/cc-suites/build/checkouts/snapshot/hdk/jdk/jre/bin/default/libgc_gen.so: undefined symbol: _Z23free_set_pool_put_entryP12Vector_BlockP11GC_Metadata
GC library cannot be loaded: libgc_gen.so
HMYEXEL062E Internal VM error: Failed to create Java VM
FAILED to invoke JVM.
Test: jitrino.JETClass: util.DoPriveleged_jetExit code: 1 Err: Loading error /export/users/cc/cc-suites/build/checkouts/snapshot/hdk/jdk/jre/bin/default/libgc_gen.so: undefined symbol: _Z23free_set_pool_put_entryP12Vector_BlockP11GC_Metadata
GC library cannot be loaded: libgc_gen.so
HMYEXEL062E Internal VM error: Failed to create Java VM
FAILED to invoke JVM.
Test: Client mode JIT (default)Class: util.DoPriveleged_jitExit code: 1 Err: Loading error /export/users/cc/cc-suites/build/checkouts/snapshot/hdk/jdk/jre/bin/default/libgc_gen.so: undefined symbol: _Z23free_set_pool_put_entryP12Vector_BlockP11GC_Metadata
GC library cannot be loaded: libgc_gen.so
HMYEXEL062E Internal VM error: Failed to create Java VM
FAILED to invoke JVM.
Test: jitrino.OPTClass: util.DoPriveleged_optExit code: 1 Err: Loading error /export/users/cc/cc-suites/build/checkouts/snapshot/hdk/jdk/jre/bin/default/libgc_gen.so: undefined symbol: _Z23free_set_pool_put_entryP12Vector_BlockP11GC_Metadata
GC library cannot be loaded: libgc_gen.so
HMYEXEL062E Internal VM error: Failed to create Java VM
FAILED to invoke JVM.
Test: Server mode JITClass: util.DoPriveleged_srvExit code: 1 Err: Loading error /export/users/cc/cc-suites/build/checkouts/snapshot/hdk/jdk/jre/bin/default/libgc_gen.so: undefined symbol: _Z23free_set_pool_put_entryP12Vector_BlockP11GC_Metadata
GC library cannot be loaded: libgc_gen.so
HMYEXEL062E Internal VM error: Failed to create Java VM
FAILED to invoke JVM.
Test: interpreterClass: util.Prop_intExit code: 1 Err: Loading error /export/users/cc/cc-suites/build/checkouts/snapshot/hdk/jdk/jre/bin/default/libgc_gen.so: undefined symbol: _Z23free_set_pool_put_entryP12Vector_BlockP11GC_Metadata
GC library cannot be loaded: libgc_gen.so
HMYEXEL062E Internal VM error: Failed to create Java VM
FAILED to invoke JVM.
Test: jitrino.JETClass: util.Prop_jetExit code: 1 Err: Loading error /export/users/cc/cc-suites/build/checkouts/snapshot/hdk/jdk/jre/bin/default/libgc_gen.so: undefined symbol: _Z23free_set_pool_put_entryP12Vector_BlockP11GC_Metadata
GC library cannot be loaded: libgc_gen.so
HMYEXEL062E Internal VM error: Failed to create Java VM
FAILED to invoke JVM.
Test: Client mode JIT (default)Class: util.Prop_jitExit code: 1 Err: Loading error /export/users/cc/cc-suites/build/checkouts/snapshot/hdk/jdk/jre/bin/default/libgc_gen.so: undefined symbol: _Z23free_set_pool_put_entryP12Vector_BlockP11GC_Metadata
GC library cannot be loaded: libgc_gen.so
HMYEXEL062E Internal VM error: Failed to create Java VM
FAILED to invoke JVM.
Test: jitrino.OPTClass: util.Prop_optExit code: 1 Err: Loading error /export/users/cc/cc-suites/build/checkouts/snapshot/hdk/jdk/jre/bin/default/libgc_gen.so: undefined symbol: _Z23free_set_pool_put_entryP12Vector_BlockP11GC_Metadata
GC library cannot be loaded: libgc_gen.so
HMYEXEL062E Internal VM error: Failed to create Java VM
FAILED to invoke JVM.
Test: Server mode JITClass: util.Prop_srvExit code: 1 Err: Loading error /export/users/cc/cc-suites/build/checkouts/snapshot/hdk/jdk/jre/bin/default/libgc_gen.so: undefined symbol: _Z23free_set_pool_put_entryP12Vector_BlockP11GC_Metadata
GC library cannot be loaded: libgc_gen.so
HMYEXEL062E Internal VM error: Failed to create Java VM
FAILED to invoke JVM.
Test: interpreterClass: util.StringIntern_intExit code: 1 Err: Loading error /export/users/cc/cc-suites/build/checkouts/snapshot/hdk/jdk/jre/bin/default/libgc_gen.so: undefined symbol: _Z23free_set_pool_put_entryP12Vector_BlockP11GC_Metadata
GC library cannot be loaded: libgc_gen.so
HMYEXEL062E Internal VM error: Failed to create Java VM
FAILED to invoke JVM.
Test: jitrino.JETClass: util.StringIntern_jetExit code: 1 Err: Loading error /export/users/cc/cc-suites/build/checkouts/snapshot/hdk/jdk/jre/bin/default/libgc_gen.so: undefined symbol: _Z23free_set_pool_put_entryP12Vector_BlockP11GC_Metadata
GC library cannot be loaded: libgc_gen.so
HMYEXEL062E Internal VM error: Failed to create Java VM
FAILED to invoke JVM.
Test: Client mode JIT (default)Class: util.StringIntern_jitExit code: 1 Err: Loading error /export/users/cc/cc-suites/build/checkouts/snapshot/hdk/jdk/jre/bin/default/libgc_gen.so: undefined symbol: _Z23free_set_pool_put_entryP12Vector_BlockP11GC_Metadata
GC library cannot be loaded: libgc_gen.so
HMYEXEL062E Internal VM error: Failed to create Java VM
FAILED to invoke JVM.
Test: jitrino.OPTClass: util.StringIntern_optExit code: 1 Err: Loading error /export/users/cc/cc-suites/build/checkouts/snapshot/hdk/jdk/jre/bin/default/libgc_gen.so: undefined symbol: _Z23free_set_pool_put_entryP12Vector_BlockP11GC_Metadata
GC library cannot be loaded: libgc_gen.so
HMYEXEL062E Internal VM error: Failed to create Java VM
FAILED to invoke JVM.
Test: Server mode JITClass: util.StringIntern_srvExit code: 1 Err: Loading error /export/users/cc/cc-suites/build/checkouts/snapshot/hdk/jdk/jre/bin/default/libgc_gen.so: undefined symbol: _Z23free_set_pool_put_entryP12Vector_BlockP11GC_Metadata
GC library cannot be loaded: libgc_gen.so
HMYEXEL062E Internal VM error: Failed to create Java VM
FAILED to invoke JVM.

***********************************************************
Modifications since last successful build:	(1)
            
add cc-snapshot log20071227185222Lbuild.62 12/27/2007 18:52:22snapshot

begin 644 execution_log.zip
M4$L#! H    ( *&VFS?'7(H*DAP  %L* @ 2    97AE8W5T:6]N7VQO9RYH
M=&UL[5W[<]NVLOX]?P7O]-PY;:>F+/F16*?M3&([B7/LVC=R<]K3R6@H"I(8
MDX2&#\7J7W\7(/4F2( D++I=3>OH >Q^6 "+!;D?^.,D\MR??QS0X?SG'Z<!
M^?E'RPBCN4M^^N>(^M%!Z/Q)NL:KP__]US]_?A%/AU9$#L*9WWWQXB#YU'UA
ML-<?Y)'8GXWS";$?R-"@<60$9.:$#O6-T\/3L\ZIF1;\8LVLS\:;V'&'(\<%
MX9[U0%H#]ME\]-R-4AL?AB0B=F32T+0">V+:CX^F/1IWQ14<WXG,V'<>B\I\
M=?R<(K9+K*W?V;LA<0'09^."_>OX8V/H!("/!G.C11ZG-(A:<4B"L&7;\-]!
M&#L1"9-VMFQF)K!1V)H,'UI?:?   OHS+_W9]1_[Q#L]COICV^X'H, *B1C@
MFU^OKB^,WJ_GYY>]WMM?KS=^O*>1Y1J1XX&EVT9(;.H/J_8$>8Q(X/>'9+IC
M%C82[ F%][^&S"CGUZ][O>NK-\9/9:UBNU88NLZ@[H&1W^DR8R<DD1D2SPE-
MZ/IPUQ1_> _P TR*@,!$&;(!TM4S-EH<AACIYE05-%?<EU\L:)X1!7'.(!R#
M,2P_@N$5!<X@1]74C<>.+U>6VX(5-6=@+? E^;T13\V A#0.;!(6EDQDLX%?
M7'8:T"D)(F>[Z+J18C[>H>3CG-5B+@&,QC^;CA>:CA\1U[2I9[#^[YZUVSDC
MFG[U76H-H3D>C4@ARMC_TY%K>])J7GY*AF8RDRTWMPJ=SDV?A"'\9P5SDX^&
MO('@DP!&&V\PDVW.K,"Q!ODML*93=VY.K0@ 9AJ9H8"I!'^9F=L&,XD1T<KS
M"=:\ Y#M$#ZU6J_O/K:L:7#0-COF:=&$6II/RO32;KJ3NNGPQ8L@3H;\[FIS
MUCGF-@B-40!CJM ,@#!VP0C#P)UY!_!]5'45@##@('&]>?,'"K'9DU/D+[&:
M5 \S>!%P#S @8:H-38\.\SQVWN*S4U!FFJOXY;2L/9U&5OB0)U6TL#R&;O39
MN LHS!G>M57G,1^U,(9<.F?#M@[7D+/4KFD2-NX:'#AK&0^GPPDA43V-# $(
MBS--4".<,.?4'SGC&!SQSJJY,:_8ZST-N4OY #_#S&J;)^9A__#,^+87^\:-
M8P<TG(<1\4+CRK?-[W*%+>:7$5 :U3Q-=X"O7C0$7=>.'S_*U6!3&VKPWI74
M 8X :L!(D"T_&D/YK.!]IPXXR=5NZ:=TOU2DAKD*ZA,_8DU/AF,AL@DLY-0,
M'89L!.X@'Q>4=JD-J]N?K$.S:FQ\^#+S(L=D*TMN,.%-894YX(7Y,A0>L%_V
M&CUS&*T5?I#,QA_9C*B-/R8L^)E9;)_+F\$FS;&1K/SI8JS-[<AA++2U#PYA
M1AIF[024<"Q^\\V:O3]\NKF_,I(:H=$UW@#@ARF%8+/=Q$:U\O"Q3S:,I@X,
M&Q;^+8?0@"PZ;V@*:_4B*^!^&^SR(!X%!\0;D.&!9_G.:&=N2IOYCD[?!I9'
MFFED,;IG9.(>?.F27D2FS31R'KYG9.9/-U<0DS;3Q")L"T.U]V;>S? _6%]4
M&K:8!(2IR5D6I>(4V'BOKYO-;&/KBR..7@N#P9\*7X4B/L(&(9E?'%=Z#>S<
M=2 L-=@&UOAP=6]\.R0C*W:C_)U#39"$!0"KS]#E!@Q?8!^_MG4C04 #E5X-
M?6L:3FC$N_<+^S\@K8'CMU(3M""2'MO],?'-D':-V(?O'1^&3SCW!M3M&OW_
M=HY& 2%]V+;WIY2Z_6D<]<&<P?RNW?G$-W[]-Q"6/]RUV^_.^S<DLH969 F;
M\NX<IOT@L(*Y85N^#YLR\!GLVB(9=HUU-$()[V]^O_SM\OKPM',)&\#D0@)X
MT<0X7>.MQ;P/<T8VGPK)-O+3C5#>V]=7UY<7K(+CS^@#82-HUWDM2M_#P%KO
M,W/M?2JJL,MS@A?L\$9V^++'S.4[V<[.#:.PNQO9W6M]9JZ]E^UR84B'W=W(
M[D[[RTS_S>KFYQB,D28&8Q B!HY/S0^7]QA^X7S%\ L[',,O[&X,O_Z^W?W7
M#+_HM,GAU^W=?L.OW)I)<@UYM-UXF-S(+'_G?C-7(949+MZ8//VHG_2?R^[7
MFX^O3ONGQR9TGU&0IU#4QK709/VV&[]G*ZRTYN_6[W#D5TIGSN)Z?7[AY1*Z
MNDV57T$VZ2'?&C(!MWRDIK+,RZP/S]#!@ 4;Z&!XEN4T(/ 7]W<8$,@&!.I[
MM#([0>SPQG0X[N_^OMV-^[N_57?_-?=W83!K8/C5(\&,!,M<!]SCY>WQH MQ
MCX=[O 8[&?#O.0G^^W,SL"[-CDUQ-]0(H)8=WL7EFU_?=8UW"0\R;1#Q9TY 
M/5B>3=/<U;-5=TA]\C]%A7JI MN:6@/'=1A%LW;A9,98%K6)A2!D0H>7+$@!
MW*X[L.P'PPGY>QCW(XBA!-LL/EB_W4VCVU)PX836@.>^KJOBK9!MA&S'@A9B
M^+$W@#4P8AQ/4%"'_(7I!\O&2]E_MYI!_03DR:$V:"L=)WJ;+U/U@L PHK8E
M[)Y:^O_-6N-M.V;T68A/C5'LVXQP5G$ ZQY=_)2*7?NJ-'HYJ@IUP9(3,%W1
MA(5= <3G*ZTUM0?[_$G[_$3> :]5K]7_+AQ$&-N,0 OK/C^>H2[QF@:4^D7'
M&N*(LB&"^NK/-M]L;S^!3A^R%3UDQ LR+(P(>,C+=+T>@ZY[7E]B;"ZLP@J8
MKN6/S:2J4:4N)W_'G%\L+\6'3H36,C\G46O97(LU-[672KVQ2P>6:P1D1 +B
M,^XEQ$S,S<C+6B#/N!+ZC[:* 3,%F-'$"89]& [3;[\S/!Z%*<@LXP,W0P:Y
MM87M-13[@!>O-O0*1)ASA[A#%;.E I<>?FTD@(,,I\0?LJD8R9B1TX(*E[J,
M3M_H<CDMR]! *2!(ZBZZ>[5'7RXPD@(2PVS92][:]VM&9JXN$2?A[-+Z!^QE
MM)>FY-N?Y%M)"8 U7?YD=7XD80R:UMJ[UZ&UOOF3VCG6)6%MT&0-[VYZ_DPZ
MF#_]D)SJT#6N,RYS_:/]K^<TX#HXX*H,%UT#+HC]O]A .ZHPT)8UDT.;& H>
M^?8O/WZ\_=C_Y;9_<_OQLO_VX^N;RY[\6/3HK.22L5AMN#W3.2!OT-*S8-4)
M^W*/Q1+*W!_'JZ.5KHX*;F<WY^KHI:]Y^__\+K\>'^F__'K\$B^_)ON3:C/D
M^5R*.SZ2GHH9JUZ3+Y5MC\CL)2EQBHWISS64B4FH+Q-<[-9B;9/O8^P"W5UP
M++^H/N]YAHYUL93B/8YZ[G$4)L;83*;$L8D>]?LS+Z\,$W20'@?5@/R:5</"
M%AU\:1:@@>,+NVYU=EB2@F/YL.]@^W&F+6L^L4_\]+,CM?.Y4GW7CO^0;CW9
MWSXKT;>B* B%F@YK/@BL$,[ "IV,Q*A]P7&&X&B<4<:)IWM#Q')]@SB+A+@O
M2. QG(@V:11-K2"CQM[01$'?IGY&6O&^$*77&AL!*#F2L$$3/P4TLJ+%R&X2
MK 9V731Q_$:9*G+ 3880Q'E-@<//M^Z'8"!KG!'+[0=4VF5@J]$NSV1/F*80
MXX.SC+,XL/M!%%A?F[7" 29^9ZXI8"+'@VI/AB9C+[)X>DESPOZLPV'7S;C8
MM?'2F:'^9D&)B#U],MI'?BNO:[2/SH1"O__^^P7?ZWOV7DJZ"(Y@X:X)CE"Z
M"(XX8J\)49X"(2AQT%X7JCP-(EABMU83JCP%(E#9L7M-@$3"A6"$H7M=@'(4
MB$ )0\":,.7(SX"4'[^GD.X=CX!7[1H/#K^]RI+4PWC 'MG$KKD5-R7CZGQ!
M4XIPB9N2&_DO6$QWKWL]T*A>,U-E49?NSWZE!D/^CF#O;2J"E]&PO"U%]6F7
M+ST;3L&6HA90A3JRH>5O+&I!5J0B&UC>[B)[8LM5VE&4OVG8WP20@);=(,&.
MHY:^%,K.AB+:;P@[,*-"UB:"A^R;^XCD1DSR"_178/GAB 9>^OS$LY-33VS"
M.[XW@&V//UR[OI\^'M&PJC^D37(O4M#NHCM"H4<?2.%MH]U'%V_^GNSWS)4P
MLS$/B%IA6CP>9;=/FP"J%4[BB#VP53CB5O>3]@6MQ7):+RP"_N76_X^5]=00
M8]]/F&F@Q=Y:8(I+=G +VDO&7E>%]\ :\@"C7;_7,(<G__S!5X=/^@#"(I ;
M'_BNE:_VO%K#;%QT+5 <R:2O&@[;8+,&VOWATXU2NX4'9S%-3X%;NL_[7YUH
MTO_B1'V^*5B>52GV94\!O\>@I=$?]1OZP*K<FD]^G%,R<S:.<X)>K7J<$\]8
M*SA:B00CB6+"'[XQWK_^>'/[R^\'QYW37>K^HABTEDQ9CE_KK>-;KO,G@57'
M?F 3M++BH\/VX0:*M0]G':& ,&*/ F]Q'-4Q')^=&!/+'X?)D;&>$T4PZ%WQ
M]?*QW?KE[K*ZXK/V;C+AFHX[ !51[^."S%UL<:CT']C[*]20@7F:LT=.B$BM
M&\N?)R3EL(+.K%?1+CLA3W6-]TY&R>3]!_B[VO K;/??.\:W;;8!AK!H2,0^
M;PO*<GK4CV@INA2PY-GA[,S&P#QG[YFD=R2Z(/ +XUOS+^M'+:>W<I,N%X[J
MRF>9I0[W58&>CI#36[E)UW1\S=_I;<%2367 O]#H+8TSK[[7B'>AI3+<'E](
MGL+$ZYI*P5XNPZOQIM'1Y&FK"!^63IUX07PI@&/;A/CF-<M\KQ_>FO *X!+'
MH@M=(KTT/ H[;3W0F.32L )KS)C#>I"EPLN#(YI,!H++@KJ^[6G!!')+0W)T
MN+A4<%E0-]F)&=5!,<&E08%")PW$]8!;4U 6Y/:^YO]B$A,]RUB>MK+P01(_
M,4+/U%U*+PTO]I?./+SU+Q^=2)MM!;K*0D]B)+" %K!+Z:7AS7U[$E ?6CM<
M-5N;<<7JRC8@F;?)*3 AQ$I:8&\K*0768?=Y^?VEC3U5_8 %BLJ#OHTFVG!R
MV>6@4?-U$%AS/2OINO2R\-@=LC')3/"HCFXAO!2X+[YCLGW;=?+XB_H!;BDH
M!9+&$1UYL' $<_."Q@-7P^JTJZ,RU"L=D?F6@LH@[UPKDQ-;(TRNHC)0+2OG
MEH+*(&%]H%_UPN0J*@--'I*C%VFBHR:H3S'OUS75!%N[#UBJJ0FP]FFV5%,*
M\)0$(S/)&V"W99;7[S0LK4)5]0+O#^'-Y GA)PK+-V)]E]QSO*F.62E05!YT
MC\Q(8+G:KAYD**D EF_FSFG@DZ '$;LNN%MJZ@/<S[H_J@-RWRH/FB^D;&IH
MPKJ47P-$[7XN0U.ML+5Z.:&^&IKP-, KP W(R(4EU7Q'HN1DR_JQ[J@H!721
M,VH69R57!2Q451UX7G)PK;!7BJJ#SLG0K17S4D]UR-?4UG '8D=%.:!\%3+?
M..,>?_C%FW@TTG%=+%M/%<@:[[-N:Z@",WF"JC:,B?@J &^<1VWH0'85:.S*
MNC9L3'@5<-KB[TWY52#JNC*R(;X*0)8$^=X*)YXUU7-[)EM/*<CI(?SLWEDO
M=;WO*=7@V 6*JH"^\D?LQ@31Z#-%FJK!3M=@/:%5EI8J<'LN(5-M,+GT2O \
MRW63Y##^A9X9EZ.L"OA$BL;@+UM/=<BWM[M/1J\7+&@H!3..'->\R"9(5\2W
M%%T!&+T+G!EQR3CC;.J: *ZI* _T+J :)OU2='E@2:"M*_[<42$'=)N[;J04
MO*>DL!=1Z#8^L+_/C0T&\*!?J/GA\OXIM)=K>B/X7^1Y\;^V:%C(O$+F%3*O
MD'DEW21D7B'S2A$N,J\$T#4RKW;XVSK1[RA#VAC2QI VAK0Q-4Q(&Y,$A;2Q
M6A$C;0QI8T@;0]I8-F"DC=4!#FEC50 B;4P?3J2-U0D3:6,U(T7:&-+&1("1
M-H:TL2+P2!M#VAC2QI V5@8\TL9JQ(JT,:2-26%&VEB]:)$VI@4CTL:0-B:$
MB+0QI(TA;:P8,M+&ZD>+M#&DC2%MK!I I(TA;:P*;>SV#FECN;0Q.GU>M#%\
M;!B2U\0PD;R&Y+5*J)&\AN2U6O$B>>T9D]>0_X7\+R5HR/]"_A?RO^1 (?\+
M^5_(_\H$B_POY'_M $;^5QW@D/]5!2#RO_3A1/Y7G3"1_U4S4N1_(?]+!!CY
M7\C_*@*/_"_D?R'_"_E?9< C_ZM&K,C_0OZ7%&;D?]6+%OE?6C B_POY7T*(
MR/]"_A?ROXHA(_^K?K3(_T+^%_*_J@%$_A?RO\KPO]9P/87V<DUO O\+#/4L
M^%^AFWDK-OEY;+=8*F)E_E#G[*68YN30UB(Y _E4M&8^U3?&_<0)T\U*XA;A
MXXP$<][SLE,Z9=LE[ABI74CM0FH74KMTX45JUS.F=N%SR9"75CLZY*4A+PUY
M:=*@G@4%3(NO3>0B*TT#7&2E(2NM2!VRTFH#C*RT.L!59:4A\2O%B<0O;3"1
M^%4G3"1^:0:,Q*\G (S$+R1^%8%'XA<2OY#XA<2O,N"1^%4C5B1^(?%+"C,2
MO^I%^W<E?C695\7NQ&L#QZ4C[0MI7T* 2/O*P(RT+Z1](>T+:5^R8)'VA;0O
MI'TA[6M%^^J18 8KKP<]87RXPD=_Y5*_PF#V+*A?^.@O?/17,4Q\]!?RPRJA
M1GX8\L-JQ8O\L&?,#T.*%5*LE* AQ0HI5@VD6.&COY!D53]<)%DAR:I('9*L
M:@.,)*LZP.&COZH 1 :8/IS( *L3)C+ :D:*##!D@(D (P,,&6!%X)$!A@PP
M9( A ZP,>&2 U8@5&6#( )/"C RP>M'^71E@^.@OY( A!PPY8/*8D0.&'##D
M@"$'3!8L<L"0 X8<,.2 K3A@[\Z-V;$I[LT:-9=K=A.X7V.[;]M5V5_?&'8 
M<:7P][6[1:WO2[)MI! 6(N63C;/0V&.EP@=G.@6O-XQAV%#CM]]^DW4MF?R=
M%,_=ZUX//$1N(2YFR8BKAB4OKWX;4G'9ND@XVYHK"JJ+2),'JX2@DF28/!3%
M]<H16O)T%E8K3TK)4RM5M1JQ9%M]J>I""#(/#Q(CD*^MR$X1J\PKK\0PV58A
M4UJ-)9*MH:"X/-,C2WQN426V1I;THM+2C(M,X3DE95D3&7+S"DHS'[+DYI64
M9B]D",XMJ<Q R%(@4V-7D=Q$+2A8C9R0H4R]>C&$\MH5%><Q&S*T%1>OPD[(
M4JA868UAD*&PN'A%ED"63O7ZI3+],U1+U]I5N'/L@)Q&^6I/0Q!8@9-7(,8G
MX@)DZLHOK);/OZ- IKA23GZ&AL+2RGGUVTID:U1(B-Q6J5ZW<E*C-(0"":43
M$S,!*-0LE5R8J52R5LD$P6R5LO5*)_E)J<VIJ9JHEZFON$+Y9+M\A26GD$K"
MG"R $A.H..DM7[F:2IG$M6U]\G4J))]M*U6O^S0)9 *$N0J*\:G>+CPZ5 68
MIZ$8GR Q+%=C;IVRR5T[&M4JJB=H"10J7^8H2K(2Z"DHKY(H)="05UB0["0X
MCUN@(+^X4CZ52$->:=6<*($.Q8BA**])H*6@?-G<)($VV8JE\XNV]:K6+)\C
M)- L7[5<GH]0K4RU;)5;!^')*Y6MJ)8B)%"67[Q2FH](HTKMLJDZ MVR%=73
M;7(5YE512)G9UE%<MD3:2[82F3H*J2N92G++ED@_R50B5>?9I9!P<?VDV&:^
MP1]?8O";R2^?C?O \L,1#3PC<CP"\6C[Y:N7GGAQO)\D.1]&(H#=2W?\YC1[
M5;@K+O0 /4W<HE(V]::.2PZ2T@>[I?E;[V'H!)^-Y!+,T( /7:W66,,.HI-!
MN(GJC\F<)WW8@(HW@4V2]NF)$=*8'9;&,E]"EO2P7YA[-Q[,6FX0&?,=[\]X
M ICP;@B5(O+9N&#_,I1@/QYTSI^\:UL^C48[*0T;'X+8;_)4RO(LZWY/O)JD
MKQKRVEC< PW_\.E&J>&A;TW#"8VX!;ZP_P/2&CA^BVEZ"MSB3C_8ZO6#@179
MDX;V?>N+$YGL#/N]#@((:](%*LVMC'G>XKGKL,,D%T?L&]\.R<B"J..[)P%5
MSB)/GG&9]NI&RB5T:N6$RV]8V!,NDEVM@.4,4B-T,\^J2>JP;UJNY8];T*$L
MM'H]'#KLPK+ELFE>-B^30=E$$OMA9+$#5U@DRDZJ-^@H(N)(M@!8NYV/K*#Z
MT7&UZF>5JA\?5JM>K>W'G=+'Z5\FPWAH#(AMP<R /EP][.#D[)4\) 9$MA6]
M.:PWWN5CE-S1+ZZ:TX+5<PM.CB14+W-2+T@(4<OP-40109H>&,6ASF<$)/N?
MU?Z1!F/3FEK@=LR)%7C4GYL,HCDF/@D<.TSR9Y.TR<PK$PN!]WQ.)HP%82$F
MAWM%SDRO8Y5/%X*6ZPS&=A]0FR&%K:T/WSL^#*EP[@VHVS7Z_^T<C0)"^B&)
M^E-*W?XTCOJPJ 3SNW8GN5S9?^-2^^&NW7YWWK\AD36THMUN6#3EW;GAIJ?2
MV98/$2",7H/GF@Z[QCH:H83W-[]?_G9Y?7C:N322#;CE&I]N$N-TC;<6+!E#
M%FW;/"Y([IQ\VKURLI"7LD6@@N//&#L!0BGS+Q.=D.9&)[#(!HY/S0^7]QB/
M%,0C!.,1!6 8CV \@O%(J7@$0XTU"4\?:JR7%H:&SS@>H=/FQR.W=QB/%,0C
MT(T8C\@#PW@$XQ&,1S >P7BD:?&(XS<W'ED[M /CD?QX!$R%\8@\,(Q',![!
M> 3C$8Q'FA:/A,&LL?%(CP0S"$66V208D^3&)-"5&)/( \.8!&,2C$DP)L&8
MI&DQ"3]_LK%127J$*$8C^=%(/8>(KKG;DXZ8)*\K!L'EZJ^P7"4^$EQ@U^BT
M?^ >.0Y(V#4.?S#X$0K)VWOH)8.XL$(QWW]H'IT<&R'9)7IGB3V5%WMXU)85
MVSZ1%]LYED;[2E9JVSR4M\&1/-9V^TA6JI(%3G1@/3N5[BZ%07#R2EKJF8+8
M5])@CX[EQ9Z<=G38X%!Z;*F8X%!+?\EC[>Q?JO0\4!@#"E*E_8M2;ZFX6'FI
M2A;0@_7E?BWP4D%J6\=JH# +E"R@8S70-;?DW;86K'K\JY[QJN2U]5A@SS-6
MSRS0(U7/NJ4BM2T=;JM80-X3*DF5CHOUQ"YZQH#*"B,OM7VH97(I.0(]2XQT
M=^D)WY2Z2]H5*F&5MH#*-.C(3RZ%'7+G4-J_=%1&;%M^RZ40;[?;\O-+VK8=
M\[0M/0Y4>DQAZZWD#Z7%2E]]:)OMCORT51A>)\<Z0L-V6_KRPYFT9=L=\^61
MG@V"_#A06FWU1-W24E4N1BJ 55G!Y+V,GBUM1^5:P;&T ^\H7#94&08J<>>1
M/-J]+XV:KD/I&0;RCE9I53B2=HEZKIBHK.*GTC&'$E8]>_#=4;#Q(;GK*SYU
M*_\DP+/CK6, \XOOG!I84%Q1^JE:\1.EXNVC]NEVC8T/_ YN_O%EJQMRWXM?
M^;6,?Z_?$P_Y;4&CL):4KH+[A^+3I03'F6Q67S_^0:D"XV=*55@G4$A5V,YP
ME*JT2$!(#@B5,^#ZR:!#$B4Y*8L305F:C5(:3RUI'JN# ',./XEH;$\.1JFO
M.6"Y#%F#VJ;3.3L)<3KGQT@F.0]ZSS\48Y8[N+/@YS>_7EU?9(V'6O(X^%OS
MT7.[)X>G7:-'O46BY8@/#3&N>QI9[L(A=4X-S_%CJ&DD&T#J;YU8_L'*>,C!
M9F^==,X4#JQ,QVR+)YYP)_<B'0-_.E,P&RO$I,(GB<RE76G]#BQ8[4[G);PY
M/C5!S(L7[#19\DCLF.5!+/*SV-..C0A^&5'7I5_3C)ODL1Q=7F7M!YXG1VT[
M#@*8=U\G;'BF$MG9P!,G-%S'AZ&=@]@:6E.8+>M@%]_QGGP)'0EJ V)\97]6
MI8S%]'GQ8\OZ^<<6."CX.Z##.?PSB3SWY_\'4$L! A0#"@    @ H;:;-\=<
MB@J2'   6PH" !(              *2!     &5X96-U=&EO;E]L;V<N:'1M
7;%!+!08      0 ! $    #"'      ! 
end


Mime
View raw message