harmony-alerts mailing list archives

Site index · List index
Message view « Date » · « Thread »
Top « Date » · « Thread »
From nom...@intel.com
Subject [build-test alert] FAILED Linux x86_64: drlvm-reg-test
Date Thu, 27 Dec 2007 14:46:15 GMT
svn.revision=606926
BUILD FAILED:
	Ant Error Message:
/export/users/cc/cc-suites/scripts/cc-exec-adaptor.xml:104: The following error occurred while
executing this line: /export/users/cc/cc-suites/adaptors/drlvm-reg-test/adaptor.xml:74: There
were drlvm-reg-test failures

Date of build:	2007-12-27 20:44:48 +0600
Time to build:	1 minute 21 seconds
Last changed:	12/27/2007 18:52:22
Last log entry:	snapshot

***********************************************************
Errors/Warnings:	(129)
            
[junit] Test org.apache.harmony.drlvm.tests.regression.h0000.DirectByteBufferTest FAILED
[junit] Test org.apache.harmony.drlvm.tests.regression.h1578.NaNTest FAILED
[junit] Test org.apache.harmony.drlvm.tests.regression.h1654.H1654Test FAILED
[junit] Test org.apache.harmony.drlvm.tests.regression.h1748.IntfAccessTest FAILED
[junit] Test org.apache.harmony.drlvm.tests.regression.h1788.abcdTest FAILED
[junit] Test org.apache.harmony.drlvm.tests.regression.h1800.ExecTest FAILED
[junit] Test org.apache.harmony.drlvm.tests.regression.h1802.UnresolvedParamTest FAILED
[junit] Test org.apache.harmony.drlvm.tests.regression.h1802.UnresolvedHandlerTest FAILED
[junit] Test org.apache.harmony.drlvm.tests.regression.h1840.SimplestTest FAILED
[junit] Test org.apache.harmony.drlvm.tests.regression.h1840.SimplestTest FAILED
[junit] Test org.apache.harmony.drlvm.tests.regression.h1852.DivIntTest FAILED
[junit] Test org.apache.harmony.drlvm.tests.regression.h1857.Test FAILED
[junit] Test org.apache.harmony.drlvm.tests.regression.h1861.Test FAILED
[junit] Test org.apache.harmony.drlvm.tests.regression.h1863.H1863Test FAILED
[junit] Test org.apache.harmony.drlvm.tests.regression.h2057.SyncTest FAILED
[junit] Test org.apache.harmony.drlvm.tests.regression.h2083.Test FAILED
[junit] Test org.apache.harmony.drlvm.tests.regression.h2083.Test FAILED
[junit] Test org.apache.harmony.drlvm.tests.regression.h2083.Test FAILED
[junit] Test org.apache.harmony.drlvm.tests.regression.h2084.Test FAILED
[junit] Test org.apache.harmony.drlvm.tests.regression.h2086.Test FAILED
[junit] Test org.apache.harmony.drlvm.tests.regression.h2092.Test FAILED
[junit] Test org.apache.harmony.drlvm.tests.regression.h2092.Test FAILED
[junit] Test org.apache.harmony.drlvm.tests.regression.h2103.Test FAILED
[junit] Test org.apache.harmony.drlvm.tests.regression.h2113.Test FAILED
[junit] Test org.apache.harmony.drlvm.tests.regression.h2151.VMInit1Test FAILED
[java] Java Result: 1
[junit] Test org.apache.harmony.drlvm.tests.regression.h2259.H2259 FAILED
[junit] Test org.apache.harmony.drlvm.tests.regression.h2261.RCETest FAILED
[junit] Test org.apache.harmony.drlvm.tests.regression.h2335.SimplestLibraryPathTest FAILED
[junit] Test org.apache.harmony.drlvm.tests.regression.h2644.BootDelegationTest FAILED
[junit] Test org.apache.harmony.drlvm.tests.regression.h2679.DupTest FAILED
[junit] Test org.apache.harmony.drlvm.tests.regression.h2748.Test FAILED
[junit] Test org.apache.harmony.drlvm.tests.regression.h2773.InfinityTest FAILED
[junit] Test org.apache.harmony.drlvm.tests.regression.h2808.finTest FAILED
[junit] Test org.apache.harmony.drlvm.tests.regression.h2846.NoVerifyTest FAILED
[junit] Test org.apache.harmony.drlvm.tests.regression.h2873.RemTest FAILED
[junit] Test org.apache.harmony.drlvm.tests.regression.h2874.Test FAILED
[junit] Test org.apache.harmony.drlvm.tests.regression.h2899.ManyArgsTest FAILED
[junit] Test org.apache.harmony.drlvm.tests.regression.h2926.Test FAILED
[junit] Test org.apache.harmony.drlvm.tests.regression.h2926.Test FAILED
[junit] Test org.apache.harmony.drlvm.tests.regression.h3027.AgentLibTest FAILED
[junit] Test org.apache.harmony.drlvm.tests.regression.h3048.H3048 FAILED
[junit] Test org.apache.harmony.drlvm.tests.regression.h3067.Test FAILED
[junit] Test org.apache.harmony.drlvm.tests.regression.h3074.Test FAILED
[junit] Test org.apache.harmony.drlvm.tests.regression.h3098.JsrNoRetTest FAILED
[junit] Test org.apache.harmony.drlvm.tests.regression.h3098.JsrNoRetTest FAILED
[junit] Test org.apache.harmony.drlvm.tests.regression.h3110.FieldTest FAILED
[junit] Test org.apache.harmony.drlvm.tests.regression.h3121.H3121 FAILED
[junit] Test org.apache.harmony.drlvm.tests.regression.h3130.CallNativeTest FAILED
[junit] Test org.apache.harmony.drlvm.tests.regression.h3150.Test FAILED
[junit] Test org.apache.harmony.drlvm.tests.regression.h3175.Test FAILED
[junit] Test org.apache.harmony.drlvm.tests.regression.h3216.ASETest FAILED
[junit] Test org.apache.harmony.drlvm.tests.regression.h3225.PositiveJsrTest FAILED
[junit] Test org.apache.harmony.drlvm.tests.regression.h3225.NegativeJsrTest FAILED
[junit] Test org.apache.harmony.drlvm.tests.regression.h3225.J9CompatibleJsrTest FAILED
[junit] Test org.apache.harmony.drlvm.tests.regression.h3228.H3228 FAILED
[java] Java Result: 1
[junit] Test org.apache.harmony.drlvm.tests.regression.h3283.JavaLibraryPathTest FAILED
[junit] Test org.apache.harmony.drlvm.tests.regression.h3285.Test FAILED
[junit] Test org.apache.harmony.drlvm.tests.regression.h3317.GetFieldDeclaringClassTest FAILED
[junit] Test org.apache.harmony.drlvm.tests.regression.h3341.StopThreadInWait FAILED
[junit] Test org.apache.harmony.drlvm.tests.regression.h3380.LongToBitsTest FAILED
[junit] Test org.apache.harmony.drlvm.tests.regression.h3382.Test FAILED
[java] Java Result: 1
[junit] Test org.apache.harmony.drlvm.tests.regression.h3404.H3404 FAILED
[junit] Test org.apache.harmony.drlvm.tests.regression.h3446.SubSubTest FAILED
[junit] Test org.apache.harmony.drlvm.tests.regression.h3505.GetFieldModifiersTest FAILED
[junit] Test org.apache.harmony.drlvm.tests.regression.h3582.Test FAILED
[junit] Test org.apache.harmony.drlvm.tests.regression.h3619.ObjectLongWaitTest FAILED
[junit] Test org.apache.harmony.drlvm.tests.regression.h3652.Test FAILED
[junit] Test org.apache.harmony.drlvm.tests.regression.h3658.Test FAILED
[junit] Test org.apache.harmony.drlvm.tests.regression.h3658.Test FAILED
[junit] Test org.apache.harmony.drlvm.tests.regression.h3691.Test FAILED
[junit] Test org.apache.harmony.drlvm.tests.regression.h3698.ExceptionLocation FAILED
[junit] Test org.apache.harmony.drlvm.tests.regression.h3716.Test FAILED
[junit] Test org.apache.harmony.drlvm.tests.regression.h3730.StepM2N FAILED
[junit] Test org.apache.harmony.drlvm.tests.regression.h3738.Test FAILED
[junit] Test org.apache.harmony.drlvm.tests.regression.h3751.Test FAILED
[junit] Test org.apache.harmony.drlvm.tests.regression.h3784.Test FAILED
[junit] Test org.apache.harmony.drlvm.tests.regression.h3816.Test FAILED
[junit] Test org.apache.harmony.drlvm.tests.regression.h3822.Test FAILED
[junit] Test org.apache.harmony.drlvm.tests.regression.h3862.SubrBounds FAILED
[junit] Test org.apache.harmony.drlvm.tests.regression.h3894.ThreadGroupChildren FAILED
[junit] Test org.apache.harmony.drlvm.tests.regression.h3908.InvokeTest FAILED
[junit] Test org.apache.harmony.drlvm.tests.regression.h3909.FinalizerThreadGroup FAILED
[junit] Test org.apache.harmony.drlvm.tests.regression.h3954.Test FAILED
[junit] Test org.apache.harmony.drlvm.tests.regression.h3982.EmptyStackTrace FAILED
[junit] Test org.apache.harmony.drlvm.tests.regression.h4073.Test FAILED
[junit] Test org.apache.harmony.drlvm.tests.regression.h4073.Test FAILED
[junit] Test org.apache.harmony.drlvm.tests.regression.h4267.UnresolvedArrayElem FAILED
[junit] Test org.apache.harmony.drlvm.tests.regression.h4511.GCTagged FAILED
[junit] Test org.apache.harmony.drlvm.tests.regression.h4512.GetCurrentThreadCpuTime FAILED
[junit] Test org.apache.harmony.drlvm.tests.regression.h4514.Test FAILED
[junit] Test org.apache.harmony.drlvm.tests.regression.h4514.Test FAILED
[junit] Test org.apache.harmony.drlvm.tests.regression.h4579.test FAILED
[junit] Test org.apache.harmony.drlvm.tests.regression.h4595.Test FAILED
[junit] Test org.apache.harmony.drlvm.tests.regression.h4596.Test FAILED
[junit] Test org.apache.harmony.drlvm.tests.regression.h4654.Test FAILED
[junit] Test org.apache.harmony.drlvm.tests.regression.h4675.DivLongTest FAILED
[junit] Test org.apache.harmony.drlvm.tests.regression.h4706.Test FAILED
[junit] Test org.apache.harmony.drlvm.tests.regression.h4751.Test FAILED
[junit] Test org.apache.harmony.drlvm.tests.regression.h4866.Test FAILED
[junit] Test org.apache.harmony.drlvm.tests.regression.h4874.Test FAILED
[junit] Test org.apache.harmony.drlvm.tests.regression.h4874.Test FAILED
[junit] Test org.apache.harmony.drlvm.tests.regression.h4979.AttachCurrentThread FAILED
[junit] Test org.apache.harmony.drlvm.tests.regression.h5021.Test FAILED
[junit] Test org.apache.harmony.drlvm.tests.regression.h5067.Test FAILED
[junit] Test org.apache.harmony.drlvm.tests.regression.h5078.Test FAILED
[junit] Test org.apache.harmony.drlvm.tests.regression.h5094.InlinedStackTest FAILED
[junit] Test org.apache.harmony.drlvm.tests.regression.h5094.InlinedStackTest FAILED
[junit] Test org.apache.harmony.drlvm.tests.regression.h5094.InlinedStackTest FAILED
[junit] Test org.apache.harmony.drlvm.tests.regression.h5094.InlinedStackTest FAILED
[java] Java Result: 1
[java] Java Result: 1
[java] Java Result: 1
[java] Java Result: 1
[java] Java Result: 1
[java] Java Result: 1
[java] Java Result: 1
[junit] Test org.apache.harmony.drlvm.tests.regression.h5206.VolatileLongTest FAILED
[junit] Test org.apache.harmony.drlvm.tests.regression.h5206.VolatileLongTest FAILED
[junit] Test org.apache.harmony.drlvm.tests.regression.h5257.ProtectedInnerAccessTest FAILED
[junit] Test org.apache.harmony.drlvm.tests.regression.h788.Test FAILED
BUILD FAILED
/export/users/cc/cc-suites/build/checkouts/hdk/working_vm/build/make/build.xml:578: The following
error occurred while executing this line:
/export/users/cc/cc-suites/build/checkouts/hdk/working_vm/build/make/targets/reg.test.run.xml:108:
There were test failures
Total time: 52 seconds
The execution FAILED with the following exception:
The following error occurred while executing this line:
/export/users/cc/cc-suites/adaptors/drlvm-reg-test/adaptor.xml:74: There were drlvm-reg-test
failures

***********************************************************
Unit Tests: (10)
        
failure: test org.apache.harmony.drlvm.tests.regression.h2196.LoopExcTest
failure: test org.apache.harmony.drlvm.tests.regression.h3256.InterruptTimedWaitingTest
failure: test org.apache.harmony.drlvm.tests.regression.h3382.TestX
failure: test org.apache.harmony.drlvm.tests.regression.h5201-0
failure: test org.apache.harmony.drlvm.tests.regression.h5201-1
failure: test org.apache.harmony.drlvm.tests.regression.h5201-2
failure: test org.apache.harmony.drlvm.tests.regression.h5201-6
Unit Test Error Details:	(7)
                
Test: testClass: org.apache.harmony.drlvm.tests.regression.h2196.LoopExcTestExit code: 1 Err:
Loading error /export/users/cc/cc-suites/build/checkouts/snapshot/hdk/jdk/jre/bin/default/libgc_gen.so:
undefined symbol: _Z23free_set_pool_put_entryP12Vector_BlockP11GC_Metadata
GC library cannot be loaded: libgc_gen.so
HMYEXEL062E Internal VM error: Failed to create Java VM
FAILED to invoke JVM.
Test: testClass: org.apache.harmony.drlvm.tests.regression.h3256.InterruptTimedWaitingTestExit
code: 1 Err: Loading error /export/users/cc/cc-suites/build/checkouts/snapshot/hdk/jdk/jre/bin/default/libgc_gen.so:
undefined symbol: _Z23free_set_pool_put_entryP12Vector_BlockP11GC_Metadata
GC library cannot be loaded: libgc_gen.so
HMYEXEL062E Internal VM error: Failed to create Java VM
FAILED to invoke JVM.
Test: testClass: org.apache.harmony.drlvm.tests.regression.h3382.TestXExit code: 1 Err: Loading
error /export/users/cc/cc-suites/build/checkouts/snapshot/hdk/jdk/jre/bin/default/libgc_gen.so:
undefined symbol: _Z23free_set_pool_put_entryP12Vector_BlockP11GC_Metadata
GC library cannot be loaded: libgc_gen.so
HMYEXEL062E Internal VM error: Failed to create Java VM
FAILED to invoke JVM.
Test: testClass: org.apache.harmony.drlvm.tests.regression.h5201-0Exit code: 1 Err: Loading
error /export/users/cc/cc-suites/build/checkouts/snapshot/hdk/jdk/jre/bin/default/libgc_gen.so:
undefined symbol: _Z23free_set_pool_put_entryP12Vector_BlockP11GC_Metadata
GC library cannot be loaded: libgc_gen.so
HMYEXEL062E Internal VM error: Failed to create Java VM
FAILED to invoke JVM.
Test: testClass: org.apache.harmony.drlvm.tests.regression.h5201-1Exit code: 1 Err: Loading
error /export/users/cc/cc-suites/build/checkouts/snapshot/hdk/jdk/jre/bin/default/libgc_gen.so:
undefined symbol: _Z23free_set_pool_put_entryP12Vector_BlockP11GC_Metadata
GC library cannot be loaded: libgc_gen.so
HMYEXEL062E Internal VM error: Failed to create Java VM
FAILED to invoke JVM.
Test: testClass: org.apache.harmony.drlvm.tests.regression.h5201-2Exit code: 1 Err: Loading
error /export/users/cc/cc-suites/build/checkouts/snapshot/hdk/jdk/jre/bin/default/libgc_gen.so:
undefined symbol: _Z23free_set_pool_put_entryP12Vector_BlockP11GC_Metadata
GC library cannot be loaded: libgc_gen.so
HMYEXEL062E Internal VM error: Failed to create Java VM
FAILED to invoke JVM.
Test: testClass: org.apache.harmony.drlvm.tests.regression.h5201-6Exit code: 1 Err: Loading
error /export/users/cc/cc-suites/build/checkouts/snapshot/hdk/jdk/jre/bin/default/libgc_gen.so:
undefined symbol: _Z23free_set_pool_put_entryP12Vector_BlockP11GC_Metadata
GC library cannot be loaded: libgc_gen.so
HMYEXEL062E Internal VM error: Failed to create Java VM
FAILED to invoke JVM.

***********************************************************
Modifications since last successful build:	(1)
            
add cc-snapshot log20071227185222Lbuild.62 12/27/2007 18:52:22snapshot

begin 644 execution_log.zip
M4$L#! H    ( ,6EFS>'$0('%Q   '14 0 2    97AE8W5T:6]N7VQO9RYH
M=&UL[9W];YM*UL=_SU^!M'JTNU?*&+!YL;>ME+<VJ9+>*$[[[.Y596$8VS28
M00,D=O_Z/0-V$L<&NXDQZ>18O;XFP+R<[^><F8%A>#=*QL&'=WWF33^\BSC]
M\,Y1XF0:T/=_'[ PV8_]G[2CV.K__>OO'_;2R',2NA_?AIV]O?U\J[.GB,]?
M=$+=[\K1B+HWU%-8FBB<WOJQST+%5,VV;I+9@3^<6^>[<ICZ@3?P TA\[-S0
M1E]LD\DX6#AJ8<.C"743PF+B<'=$W,F$N(-AI_@$/_03DH;^9-TQ=WY8<H@;
M4.?)?O'+HP$4Z+MR+/[OAT/%\SF4C_&ITJ"3B/&DD<:4QPW7A7_[<>HG-,[K
MV7"%F<!&<6/DW33N&+^!!'JWX]GN()STZ-AL);VAZ_8X9.#$=)<%\&@4L&FQ
M20Z_GIT?*]VO1T<GW>['K^<+.Z]9X@1*XH]!6UV)J<M"+WZI^'224![VH&!+
M2@CXW!&#WU]C88:C\X-N]_SL4'G_7#NX@1/'@=_?-HOEG&V":TP3$M.Q'Q,0
M.UXVQ5_C&]@!?L@I^*8GD.A4@V,C*T9Q21>C0T%UB[7\X4#UE(2GM#B%(1C#
M"1/@*^%^OR2K*$B'?KC9L9DMQ*'D%JP%X:M<C30BG,8LY2Z-UQZ9IRW 7W]L
MQ%E$>>(_/?2QD=*,=SAR,A5GB2  1LNVB3^.B1\F-" N&RM"_TY;TTJ(9G=A
MP!P/JC-F"5U;RC3\Z6]6][S6V?$1]4CNR4Y0>@J+IB2D<0S_'#XE&0UE((24
M VU9A47:Y-;AOM,OKX$31<&41$X"!5QI9%$*<"7X%F;6%&$2)6$O]B=H9O<A
M;9]FKM4XN+QJ.!'?UXA.S'4.=6^^C4S_C#B]Q],<^>7V1=/TS :Q,N# U%HS
M0 G3 (S@\>!VO,_I<!_V)2]M":#WL9^'WS(?@H.$!Y4<(D6+\O+>378(A B 
M$MS-(V/FE47ML@9HZ<!-7/U78O/L6#>*$B>^*4NUJ'&9Q$'R7;GD#/PFD_:E
MOIQ1FW>7!+;;" \ES>VCG HK=PY!7-0LZ\7'(TJ3[50RAH*(WB6!; H=YHB%
M W^80C!>:CD7_$I\3EF<A97/L!L\2R,&47MJ6_E'-PV5"]_E+)[&"1W'REGH
MDG^6)C;W+X4SEFS939<*_O!A,>1U[H?I9+,SA&O#&9FZ&^8!@0#. !(V/7XP
MA.,+Q@R+YT"0?!BDO9\-T]9E(T(%"VF8B*JO&">L*MD(&G-&8E^4; #AH+Q<
M<'3 7&CA?@I!5YVQL 'M"A'M2FEW8AQ!&W/?!,70-M#(X;36#G16DL:\^)"N
M@(_&KZE((?CQ;8GMEPW[HT2&=:?"WY\(\M=(]/UN'7%E(3L^ZX:HEI)W?6:]
MD<IB[B8*K:E4;L%7Q5E>I,:I"I]&C_5_+'NCZ/R"S34PK>@CWINY3^=5]$CA
M6=W$X5E@![5NBFVU3\=]ZNV/G= ?++GO*S&1KAD:FJC<1':[C28J-Q$TJVBB
M4A,U5=U"$ZTQD=5"$Y6;2&MBB[;&1$T-'6V=B5K8Z*\Q44O%6+3&1(9JH(G*
M362V;311N8DL;-'6FLC&6+3&1'8;3;3&1&T5A['K3&3K:*)2$[4,#;N.:TV$
M%*TQ4=O"6%1N(D/5T='6F<AZM;WKA8W 24-WE-\O>566Y%1DLGQ#;GZSLG#'
M_/-^D\_:5*ZA,%#QS]\N?JGB<>A$\8@EF05^B/\X;?3]L"%RVE'1GV>Z?-(-
MG;A!ZN7W^)Y_1Q\DC[F;22N4%9-<?!8V9HG'\Q\D$#?QR<0V>V9+63-Q85WE
M_J:<Y*EZX%&N R56V$ Y/;BZ^//+?_9;NFD4GGJJV49[?<)*,O+!8Z%2]SET
M_SQ11D[H9;=(86?(Q QLQYLJ \:56<7\4/E\=MWX=J%,:?$$A-/2(OXM U)Q
MN1./(&RP4&1=EE9;+TDKFS .48>#,A$+LYDKG\^N#K)2>S1Q_*#8 4];EEU<
MT(U$7"GFP@9/P_WE^07YSS3TD^_*51J&HMR,#XD3.0 B&3E\S,(IR::^Y>&$
M/.!'1N+>*SG.YFL?3A-ZF X&E%\_G1WW.)/YM![*.5AF&W' HP,G#9)&X/>'
M;F](0Q*SCI*&\'<_!';CZ;C/@H[2^Z_>''!*>S%->A%C02]*DQX-$SZ]U/1O
MV:2@WF' W)M+3?MTU+L U3PG68XQ\ZI\.H*VH\\=/E5<)Q2@0L,CYIY2KZ,\
M+DUA"J<7_SGY]\FY:NHGRMELSJ<"5&?&Z2@?'=&$B1;-S5J-?(K1MXO"]#X>
MG)V?'(L3_/"6W5 1;)=;P/G1&?_;$'N6[X[9TPS+)E^<+XB;G+@]UG<582_%
MQS1:Y%1\(T"2 K2@<$U!RFK9!$PU.'#%5%U$35+4EF6NBS?;)D[?]=X*:;^N
MU",#K6M6?G>,GP.0#9V\DPEUWPI O[O&O^P CP5^?I!:>JQJQ]/+&U#E1E[E
MQJS*^0-:#R?,+Y*(*NN-"S][+B@[?<L.HY.OH7B,+;BEWJ7#G3'ZSJOVG=^4
MW>L19W?B:= U$#\C(JPDN(I!UV)6I^)"'UXP>N7NLBVP'JE=4^?8;JFDZX^C
M '8A=+)"]T3D2L(8@H0@[2IH&3HY]F_!8$B:K*0M2/Q6!F6&]8L=V^=YCT70
M;Z3UFUS<NB*SJ2%;TK(U$[>2[J/9)*?B&^F1EIY'"M<3GG05HF-W&N*5?$DA
M6Q#X;70:==5NEE_)GT^.NW>84/E\<KU=O[*;V.Q+ZU,S<8N:_15\_7F)?"%?
MU?&5K08:<8C1'#E#SE[.V2[ZGG8+V9*7K5950V-(VT1PY 7'K#4HM75D2UJV
M9N)6$I00' 3G.>!H*G:Q-P?GEZ6;FW>==+LG<@>MF:8A6](&I;FX-?64-$,C
MWR[.X'P-$9,5L46-7T#:TC6K7RE%VR3GC$4GD]7WJ>:_,V-=96]BZ2A:81'^
M^../N=W^$+\[+RF,\@]-H1,_45SFT7_NV@=UHTU.Q3=ZGX3>=Z]N31%>-S5R
M=72"T5U6OA[TK8FP9M.XGSY[GMO^TDE&2)RDQ)7H_48F)YBM5J.;1I0?B9.W
M/YE59$ .&4N$,8;9NZG0FR3UIM52UQ3*3:M-CM,(89,5M@=]:R),K)^!>$F*
MUUS<NMBRFN0L'(AW:4Z1,5D9>R)R%7=S;-4FD ,R)"E#C_2M!)^62;ZP;Y3[
M XQ#TC+T1.2:VCP;PN$5Q85HI,7L0=_:",,9GA5.;9B;]TU.;;#;;7+AA-,#
M/L0E,Z4-84]$WN8-Z&Q]^*TBV=9Q7K*T*,[%?04/Y2!G;Y2SZIM5\7)J<@ 6
M%;?GD#$Y&5L2^6W<>VVJ+;MQ,3V9N#02-\NV?_-5Y$!.Q3>ZC8QN,U>W@BM_
M3=7$1:CD)<>L<Q&JIHK7821FJ^0JT"[8:MOD<\R_L"N*BT]*R]@3D2MI !$D
M!&E'04O35/+1I\&;>07.FP-M0>&Z*-,U&"_ -Q(F(V%S=>NBJZF2(R<(OF0O
MP<9 )BMF2S*_D:MUFJ'FYUVSK+A%*W]7O]J>* J.GZ5UL)FXV[VWO'4$+0,1
ME!;!F;@U]21TS20'77S.5U:\'NE;%V&Z02Y9[(LN# S_D31925O6N8I+A2*;
M+]DCCXB3[#@]T;DJG#ZWC]@X@ISZ 2(E.5(KM*ZM710S"N ;69.2M9FZ]:R;
MU=0-DV1FXFF47/MCZOV_XXO+/BNCV_QW9K2*5]$J+UJM:VHU=;M)A UP/9HW
MX*&KM:ZK-;#Q&H_$J-5ZC:>I6>033;);HL?4#1P.*61K$"%QDA)7+GE='+8T
MTDU8=#T"&WEGH6CVD3X9Z5LA=%W,V2HY9]"W9(=^@O%.6N*69*Z--WP5A,24
ME;\*XB4#]GG:_ZYW<'Y?C'H'XBVU14[%-_J1A'YTKVY-0;K5,DDW[<,_#-6R
M(K8@<4V<&:IQ/PJ[8)X_\ $=1$Y2Y K5KN*^I8']3(E)6M//? DXIM8F?_9_
M@ IBO"1&YHB1I!BMEKJFMM T,&#)2YI1'+!VPA:N#BXQ6\6K@R,X",ZSP-E%
M4&IKR):T;,W$K8TMF]RO977.W.P%, B:E*"M4+HFZBP-UYZ4%K2YN'6QU51)
M-Z'1A?X%\9(1KP=]:R,,^_KUX?4,8#8;]KV&!>F;EH%]?7E#EU%K7]^R<0%'
M>=FR:UW T<8>O;QLV24]^A>#H^/=''G!T6N]FV.;NIBZPP\9B%N\1CL2]AL3
MMB!Q79RUH>W-GE#XQ%D:'8T $T[Q,JJ4P*W6NHJFL:W:Y"RK S:0DM*T*'%-
MX:NMMLE''PSE_Z3\$=M(G)3$K1:[+O8,O"8A+VM&K=<DVK9.3L91,NTFCGMS
MS1V7(F8R8K:L<SW$M52KB=%,4LSNQ:V@JX_@O%5P-@M*O].2ZRW=M!I7=,QN
MZ471:NLO<15(GGP-89L%M]0[X-R9G@1TC)XCH><4:%U3ZVYH&OET=.T,A]1#
MW"3$[;' M3&FBT<_CU+.0;E\?'X4I6)Q0T1.2N0*]:Z-0+PB(S%NQ5=D$!P$
MYUG@["(H6>WLS\B6C&S-Q*V+K38NF"LO6^TZ%\R%['%:I,1L538MLF7B?5%Y
MP3%KO2_:,BV#'/NWV2JGB)BDB"UJ7$6(LE1LVZ3E9RYN32$*'X.3F:U:'X-K
MV2;&+6G9FHM;%UL6=MOE9<NJ[N(Y@O-&P=E!4&I;;7*0)'#PPFU&1$U"U JT
MKB!D&:J.?719.;H7MYZ09:BFA6Q)R]9,W+K8LG#Y)GG9LNI<JM50VRUR%@9"
MU/QA%.1,4LY6"%U))PN!0J 0* 0*@4*@?@^@-NQF91O\NW(HE!9,P-:N'VL3
M6X:N:OLJ@=R7B_C\MW#FJ:Y(,?^=25GQ&SCS(I2\??/5J:!5HL(J\^Y8!>UW
M4D&O1 6]?A7TWTF%9B4J-%^JPN5!MPL*_+KQ5^3\FLS=JL3<RR\=WI6Y5^3\
MFLQM5&)NHS9SK\CY-9G;K,3<9OTAW2P/Z:O634C&46/LA/X 4MP7B>SZ&J&N
MFN0;"YP$NO<X!U?B =,JH:L8@2-0"-1V@3(L<LE9 I)0[RP,*3]P7=B+8,D*
M5HG@%0!FV7@'5E:6YMJNO3(X=F[H/J="V<7^59YSO@?RYTX8#Q@?*XD_IAW%
M,M7Q\H)2\Q[E^PT_Q7WA^ZHHHFX"PKPDRIT3*S&H#[;VPQ67,[=5@MT,$?)*
M01+).-AN718VLK*"RF(D$'>*CSO\>G9^O J9EUI#4);_))-QT#$LNZ-<CZ@R
M8$' [AYB#'-=,5_.4^Y&X$XPI*!NFJF?C/Q8$1>].]LO5^+P(7TD"X$!1U9,
M3<V+R:ER)[[$3F4 CIZ"*8NM>,T2" VYGQBZ$E.7/7WOP<J1F<NBZ7?E"+Y%
MC355&8 -8A$AUE9S)FV^&AP(/<P&3'LSC'[ZT:,1,&QM, )>G6)/5U5+TW4+
M?K0, DGM[0D=9T+=O\E2N?.3$8BVH/#\K9>=O>=*7U)J"/\1A(6G!9[_/=/3
M:BW(N7CD@[#O&LZ'=XV(4_CN,V\*_Q/^^>%_4$L! A0#"@    @ Q:6;-X<1
M @<7$   =%0! !(              *2!     &5X96-U=&EO;E]L;V<N:'1M
7;%!+!08      0 ! $    !'$      ! 
end


Mime
View raw message