harmony-alerts mailing list archives

Site index · List index
Message view « Date » · « Thread »
Top « Date » · « Thread »
From nom...@intel.com
Subject [build-test alert] FAILED Linux x86_64: hdk_by_hdk
Date Thu, 27 Dec 2007 14:44:44 GMT
svn.revision=606926
BUILD FAILED:
	Ant Error Message:
/export/users/cc/cc-suites/scripts/cc-exec-adaptor.xml:104: The following error occurred while
executing this line: /export/users/cc/cc-suites/adaptors/hdk_by_hdk/adaptor.xml:52: The following
error occurred while executing this line: /export/users/cc/cc-suites/scripts/framework.xml:1079:
Java returned: 1

Date of build:	2007-12-27 20:43:06 +0600
Time to build:	1 minute 33 seconds
Last changed:	12/27/2007 18:52:22
Last log entry:	snapshot

***********************************************************
Errors/Warnings:	(6)
            
Checkout HDK trunk -r606926 into /export/users/cc/cc-suites/build/checkouts/hdk
Loading error /export/users/cc/cc-suites/build/checkouts/snapshot/hdk/jdk/jre/bin/default/libgc_gen.so:
undefined symbol: _Z23free_set_pool_put_entryP12Vector_BlockP11GC_Metadata
GC library cannot be loaded: libgc_gen.so
HMYEXEL062E Internal VM error: Failed to create Java VM
FAILED to invoke JVM.
The execution FAILED with the following exception:
The following error occurred while executing this line:
/export/users/cc/cc-suites/adaptors/hdk_by_hdk/adaptor.xml:52: The following error occurred
while executing this line:
/export/users/cc/cc-suites/scripts/framework.xml:1079: Java returned: 1

***********************************************************
Unit Tests: (0)
        
No Tests Run: This project doesn't have any tests

***********************************************************
Modifications since last successful build:	(1)
            
add cc-snapshot log20071227185222Lbuild.62 12/27/2007 18:52:22snapshot

begin 644 execution_log.zip
M4$L#! H    ( )2EFS>E,&=$( (  !@$   2    97AE8W5T:6]N7VQO9RYH
M=&ULM51+;]LP#+[[5_ RY)0HR;!T];( 6YL^U@3HH0CV0&'(,A.K421#HO+8
MKQ_M)$-]V( =YA<@D?Q(?ORL<4D;,QGGKCA,QI7'R5A"H(/!CYVEL]0-^B>F
M\+[_YD-GDL2JD(3=L+5IDG172%V/6QVTJ]<^\A?JZP>JTCW#58EJ[2+!W?4#
M$)O7T/6C_NAR. )MR8' ?>4\B1C0!Z$4/]T0-6$0>=2F$.J$$$19K,_8>U3/
MT%K<(*E2VQ7@GM!;:8 Q-L<<G9WS:[9ERL@0C,[%QA71< KEK(K>HR412-I"
M^J+3@FWJQP+J%GXC2X)SSS#J7_#=^W-AKQ%>1=4,G*->Y%8^P\S)HFG >^?_
MA9=@915*1S5!XJ5^/8I<6U'@4D9#@CM>J6R%MA=<"M'ROK9<4CAL<F=2R+X/
MWRX]8A:0LLHYDU61,B;%'QX'PP4J<C[[;)Q:/PX&MU?9'$FR"&2K_-LKX#Q>
M^@,H::TCR!$,]X1%"J\K:$7=S;]-OTYG_=%P"O?VQ.]B?B0AA1NI#1?*,U0>
M67;PA:/8WL*X^70_FU[73MINW9J=%O->DCR5"/4((M6,GYQVFDH@MBR=,6YW
M%(S"BAK]/K4-S2"<:A12P*[D6LZ(;*92!V[,8IK\95A,5,7T->K-\D-6S^BT
MU]MO3/INF,)_2!N4UQ5K8^GE!FOY-\D&_8O+],BA1XK>UK,9)&,A)V/1_/CB
M> B(YD3X!5!+ 0(4 PH    ( )2EFS>E,&=$( (  !@$   2            
M  "D@0    !E>&5C=71I;VY?;&]G+FAT;6Q02P4&      $  0!     4 ( 
#     
end


Mime
View raw message