harmony-alerts mailing list archives

Site index · List index
Message view « Date » · « Thread »
Top « Date » · « Thread »
From nom...@intel.com
Subject [build-test alert] FAILED Linux x86_64: dacapo
Date Thu, 27 Dec 2007 14:43:02 GMT
svn.revision=606926
BUILD FAILED:
	Ant Error Message:
/export/users/cc/cc-suites/scripts/cc-exec-adaptor.xml:104: The following error occurred while
executing this line: /export/users/cc/cc-suites/adaptors/dacapo/adaptor.xml:112: Not all workloads
completed successfully

Date of build:	2007-12-27 20:42:56 +0600
Time to build:	1 second
Last changed:	12/27/2007 18:52:22
Last log entry:	snapshot

***********************************************************
Errors/Warnings:	(12)
            
java version "1.5.0"
pre-alpha : not complete or compatible
svn = r606926, (Dec 27 2007), Linux/em64t/gcc 4.1.0, release build
http://harmony.apache.org
Loading error /export/users/cc/cc-suites/build/checkouts/snapshot/hdk/jdk/jre/bin/default/libgc_gen.so:
undefined symbol: _Z23free_set_pool_put_entryP12Vector_BlockP11GC_Metadata
GC library cannot be loaded: libgc_gen.so
HMYEXEL062E Internal VM error: Failed to create Java VM
FAILED to invoke JVM.
Number of tests: (...........)
N of runned tests(${number.of.runned.tests})
The execution FAILED with the following exception:
The following error occurred while executing this line:
/export/users/cc/cc-suites/adaptors/dacapo/adaptor.xml:112: Not all workloads completed successfully

***********************************************************
Unit Tests: (0)
        
No Tests Run: This project doesn't have any tests

***********************************************************
Modifications since last successful build:	(1)
            
add cc-snapshot log20071227185222Lbuild.62 12/27/2007 18:52:22snapshot

begin 644 execution_log.zip
M4$L#! H    ( %VEFS?!:SORI0(  )0$   2    97AE8W5T:6]N7VQO9RYH
M=&ULA51M;]HP$/[.KSA5FUHDB GKZ)I1I*ZE+Q-4U3:AO:A"CG,A*<:.; ?(
MIOWWG0/MFB];E""2>^[EN7O.P\RMY&@8ZZ0:#0N#HR$'ZRJ)9X>I5JYK\Y\8
MP;O>Z_>'HU99)-QAUZY5U&J9DG[!7S]PB^(!S@LN,H0;;E9:53#AI:)W Q$<
MB39<Z*(R^2)S$)Z>AAWH]WHG\(7P>[?/.G4;;A"N=*DH3:X5: .YLR!S@<IJ
M8SO +?"BH \\EA@TTC_R-8<U&NL]#\+@;= [@ :"Z'6Y+#).)2GM0.A5(=&A
MS^/_4U**VG AJG &9M ;G/8''3BZ1 ']D[KX=@<FN2JW#%>#8\<60L!Q$ :]
M#AB4R"U"7.8R:83+G"LBQK)=BP)>4P^T6310$\V37"T C:'*&&X+;1PK+7%C
M0M#=M67NT+(Z :,08JE+9YE5O+"9=BQ+ENS1/P99G"N68,I+Z9C,XX68+U %
M5D= ?<8T5YB K5:QEA',O_??I 9Q;M'-"ZWEO"C=')4SU7W8GZ%PVLP_2"V6
M]V%X?3&?HN,T*]XH__J")A8;;BH07/E&QPB2.&$2P<L*&EXWTV_CK^-);] ?
MPZUR:!27,)ONFA#!%<\E%>HT"(,D0OCHQSV;-F)<G=].QI<>E*NU7A)H-FV*
MY!-:ZD,$X?ZK(%4^U-KT#0\AI2S>_[]--W4@RQ(N>/',1&3Z >[*54RRURD0
MW%F2?_#W:C>A'D6+Y&=0@X]>_5*U>Z#38&<(:L/O=JOEM\73*.OEV)/=Y"X#
M1Y942ZDWM6ZV @N/B6J7%X9:4%J(TAC*N,D\VWU$,KLL]\NF,&K]@S\-O" 9
M/%%_>@^V*QF%83^".YHXEQ(VVBS]V.WSHI'02B'0VK24LFH-&1\-67WHL-T!
MQ.K3Z ]02P$"% ,*    " !=I9LWP6L[\J4"  "4!   $@              
MI($     97AE8W5T:6]N7VQO9RYH=&UL4$L%!@     !  $ 0    -4"    
!  $! 
end


Mime
View raw message