harmony-alerts mailing list archives

Site index · List index
Message view « Date » · « Thread »
Top « Date » · « Thread »
From nom...@intel.com
Subject [build-test alert] FAILED Linux x86_64: axis2_app
Date Thu, 27 Dec 2007 14:42:51 GMT
Axis-2 client log:


***********************************************************
Axis-2 server log:


============== Starting /export/users/cc/cc-suites/build/libs/axis2-1.1.1/bin/axis2server.R.sh
in the next test run =====

JAVA_HOME=/export/users/cc/cc-suites/build/checkouts/snapshot/hdk/jdk/jre
JAVA_OPTS=
AXIS2_HOME=/export/users/cc/cc-suites/build/libs/axis2-1.1.1
Loading error /export/users/cc/cc-suites/build/checkouts/snapshot/hdk/jdk/jre/bin/default/libgc_gen.so:
undefined symbol: _Z23free_set_pool_put_entryP12Vector_BlockP11GC_Metadata
GC library cannot be loaded: libgc_gen.so
HMYEXEL062E Internal VM error: Failed to create Java VM
FAILED to invoke JVM.

***********************************************************

BUILD FAILED:
	Ant Error Message:
/export/users/cc/cc-suites/scripts/cc-exec-adaptor.xml:104: The following error occurred while
executing this line: /export/users/cc/cc-suites/adaptors/axis2_app/adaptor.xml:90: The following
error occurred while executing this line: /export/users/cc/cc-suites/adaptors/axis2_app/adaptor.xml:184:
Axis2 server startup timeout exceeded

Date of build:	2007-12-27 20:37:45 +0600
Time to build:	5 minutes 1 second
Last changed:	12/27/2007 18:52:22
Last log entry:	snapshot

***********************************************************
Errors/Warnings:	(3)
            
[exec] Result: 1
The execution FAILED with the following exception:
The following error occurred while executing this line:
/export/users/cc/cc-suites/adaptors/axis2_app/adaptor.xml:90: The following error occurred
while executing this line:
/export/users/cc/cc-suites/adaptors/axis2_app/adaptor.xml:184: Axis2 server startup timeout
exceeded

***********************************************************
Unit Tests: (0)
        
No Tests Run: This project doesn't have any tests

***********************************************************
Modifications since last successful build:	(1)
            
add cc-snapshot log20071227185222Lbuild.62 12/27/2007 18:52:22snapshot

begin 644 execution_log.zip
M4$L#! H    ( %BEFS>V^:([&P(  $8&   2    97AE8W5T:6]N7VQO9RYH
M=&ULO57?;]HP$'[/7W$O4U]&7*H]=!E#H@4T)K9)4*9)$ZI,<A"WQH[L"S_V
MU^^<L DJF":&IB1R[,_W?7=GG]W*::G;K9G-MNU6X;#=DN!IJ_']U=P::GCU
M Q.XO7[U[JH=E44F"1M^99(H:BS0H O]5"LTQ$.N9   OF>HD7 *W= JLTA 
MX*:PCD3IT7F1IOPV?*D(O9B52F?"H2\U>2$WRM\\RJ(08[4L-'9"?XQNA2[6
M=G$Y^MKKF'W^Q<O,3W(EIW 73.9*<^25=;Q9ZH,)!QU/TE'L*Q>3 ^1,7[6:
M[1QM-&-^A"=;U"EX2<__F.;VA4?[P*@T9RC.E*G[=5CQ*/;Y28F.6_C+KO!1
M&75&(,?(-ICR_\3S8D#GVV!\\_CARZ=>PMC%Z3]VOG9^L\/?**0YIL^VY#1Y
M(PN?6Q)Y]BR>PN?PI-ZHRFT"S=/;]&XR&'9A/+F_[XW'_<GP 'RP)#606O*6
M;X+'U)ILO\1]N5Q*MTV.C@4:-D@E3:'/5?/OU0B910_&$B#/H/A XK.M1T."
M0Y%ZD";CR6#0$V9 N*'7S!!PILBYC:*''"&DJB1E#?0[@V&O"VM%.1 C<ZNU
M70<#W*18A#E)9;('.&<=V#0MG6.1=1X"W3$RS#(>M#*81'^(7F:R(.OV ]\-
MA2,F>7N=P/]7;=Z^2: J0JBKO3[1RJ+:#[P7JZ1@AEG4$K+=$M4U(>HK0U3W
MQT]02P$"% ,*    " !8I9LWMOFB.QL"  !&!@  $@              I($ 
K    97AE8W5T:6]N7VQO9RYH=&UL4$L%!@     !  $ 0    $L"      $! 
end


Mime
View raw message