harmony-alerts mailing list archives

Site index · List index
Message view « Date » · « Thread »
Top « Date » · « Thread »
From nom...@intel.com
Subject [build-test alert] FAILED Linux x86_64: JettyScenario
Date Thu, 27 Dec 2007 14:37:41 GMT

BUILD FAILED:
	Ant Error Message:
/export/users/cc/cc-suites/scripts/cc-exec-adaptor.xml:104: The following error occurred while
executing this line: /export/users/cc/cc-suites/adaptors/JettyScenario/adaptor.xml:134: Jetty
server startup timeout exceeded

Date of build:	2007-12-27 20:32:21 +0600
Time to build:	5 minutes 14 seconds
Last changed:	12/27/2007 18:52:22
Last log entry:	snapshot

***********************************************************
Errors/Warnings:	(2)
            
The execution FAILED with the following exception:
The following error occurred while executing this line:
/export/users/cc/cc-suites/adaptors/JettyScenario/adaptor.xml:134: Jetty server startup timeout
exceeded

***********************************************************
Unit Tests: (0)
        
No Tests Run: This project doesn't have any tests

***********************************************************
Modifications since last successful build:	(1)
            
add cc-snapshot log20071227185222Lbuild.62 12/27/2007 18:52:22snapshot

begin 644 execution_log.zip
M4$L#! H    ( +*DFS=_@B-T80$  ( "   2    97AE8W5T:6]N7VQO9RYH
M=&ULI5+)3L,P$+W[*^:">DK="E0J$R)5+!(5)^!6Y6#L*3$X<62/N_#UV"D5
MRX$+EA?),^]IWLPK&VIM53X[O:_*WF-52@BTMW@Y6KN.BF#>4<!\<G(QJECL
MM20LPJ83#/):X0Y5#0L"CQL3C.M@-CF?S.9CQ@KEVMY8+,RZZ! U:L&8CU]0
MU;@:+K\O6&C9D_.P3F>)1/M'A9WTQ@EXB!V,QQF[TFB1L(;K_)KN!;3QJ!)N
M#QQWO?/$8T ?N%)I%R$:PL"?H[&:>PS14N _V(>*5NU;XJGARF,2J3.I^ _?
M4>$C23]4.:1 (MJ@_\QXE1M9PS+=\# 0"9@R]M0@Y,9&R@V]7=S=WUS#UE #
ME")K9ZW;9D+<*>QSCA@@WP+>IP8ZI:+W2<FV26,X,J8P-2: -1T*]H<^>9C%
M+VG'[_&NM6)Z>B9^R$K626)C#V1:=)&&$O/H6<EE5?+!8/Q@-CXX[P-02P$"
M% ,*    " "RI)LW?X(C=&$!  "  @  $@              I($     97AE
E8W5T:6]N7VQO9RYH=&UL4$L%!@     !  $ 0    )$!      $! 
end


Mime
View raw message