harmony-alerts mailing list archives

Site index · List index
Message view « Date » · « Thread »
Top « Date » · « Thread »
From nom...@intel.com
Subject [build-test alert] FAILED Linux x86: hdk_by_hdk
Date Thu, 27 Dec 2007 12:54:27 GMT
svn.revision=606926
BUILD FAILED:
	Ant Error Message:
/export/users.2/cc/cc-suites/scripts/cc-exec-adaptor.xml:104: The following error occurred
while executing this line: /export/users.2/cc/cc-suites/adaptors/hdk_by_hdk/adaptor.xml:52:
The following error occurred while executing this line: /export/users.2/cc/cc-suites/scripts/framework.xml:1079:
Java returned: 1

Date of build:	2007-12-27 18:53:12 +0600
Time to build:	1 minute 7 seconds
Last changed:	12/27/2007 14:12:38
Last log entry:	snapshot

***********************************************************
Errors/Warnings:	(6)
            
Checkout HDK trunk -r606926 into /export/users.2/cc/cc-suites/build/checkouts/hdk
Loading error /export/users.2/cc/cc-suites/build/checkouts/snapshot/hdk/jdk/jre/bin/default/libgc_gen_uncomp.so:
undefined symbol: _Z23free_set_pool_put_entryP12Vector_BlockP11GC_Metadata
GC library cannot be loaded: libgc_gen_uncomp.so
HMYEXEL062E Internal VM error: Failed to create Java VM
FAILED to invoke JVM.
The execution FAILED with the following exception:
The following error occurred while executing this line:
/export/users.2/cc/cc-suites/adaptors/hdk_by_hdk/adaptor.xml:52: The following error occurred
while executing this line:
/export/users.2/cc/cc-suites/scripts/framework.xml:1079: Java returned: 1

***********************************************************
Unit Tests: (0)
        
No Tests Run: This project doesn't have any tests

***********************************************************
Modifications since last successful build:	(1)
            
add cc-snapshot log20071227141238Lbuild.73 12/27/2007 14:12:38snapshot

begin 644 execution_log.zip
M4$L#! H    ( ,J6FS>EVKJF* (  "X$   2    97AE8W5T:6]N7VQO9RYH
M=&ULM53;CMHP$'W/5\Q+Q1,8J,IV4XK4LNRE7:1]6*UZ$8H<9R!>'#NRQUSZ
M]9T$J!:IK=2'1DDD9SQGYIPS\;BDRDS&N2OVDW'M<3*6$&AO\'UGZ2QU@_Z!
M*;SMOWK7F22Q+B1A-VQLFB3=%5+7XT8'[9JUC_R&YOJ.JG0+F):HUBX2W%Y]
M!N+P&KI^U!]=#D>@+3D0N*N=)Q$#^M ;"J7X[H:H"8/(HS:%4$>,(,IB?4+?
MH5K V>(:297:K@!WA-Y* XQ1':ITMLZO.98I(T,P.A>5*Z+A$LI9%;U'2R*0
MM(7T1><,MF6 !30D?B%+@A-K&/4O^J-A[\^-O41XD=5H<,IZEANY@'LGBY: 
M]\[_FS+!RCJ4CAJ)Q'/S>!2YMJ+ I8R&!'->J6R%-HM6N:KN!9="M!S6EGL+
M^RIW)H7LV_#UTB-F 2FKG3-9'2EC=?S^83!\0D7.9Q^-4^N'P>!FFLV1),^#
M/.-Q,P4NYZ7?@Y+6.H(<P3 Y+%+X32-GR;?SK[,OLWN6= 9W]JCWT_P@2@K7
M4AONESU5'GD0X1-G<?P,X_K#W?WLJMFD[<:M>=/3O)<DCR5"8TFDQH'CIJVF
M$H@C2V>,VQX&2&%-[40_G@=:8YQJ)Z: ;<F]G! Y3*4.S,]BFOS5/%:L9AW;
M><[R?=9X=OS6VU4F?3-,X;\4#LKKFJ=EZ66%S2_1EAOT+R[3@XX>*7K;V#1(
MQD).QJ(]#L3A:!#M.?$34$L! A0#"@    @ RI:;-Z7:NJ8H @  +@0  !( 
M             *2!     &5X96-U=&EO;E]L;V<N:'1M;%!+!08      0 !
+ $    !8 @     ! 
end


Mime
View raw message