harmony-alerts mailing list archives

Site index · List index
Message view « Date » · « Thread »
Top « Date » · « Thread »
From nom...@intel.com
Subject [build-test alert] FAILED Linux x86: drlvm-test
Date Thu, 27 Dec 2007 11:42:52 GMT
svn.revision=606926
BUILD FAILED:
	Ant Error Message:
/export/users.2/cc/cc-suites/scripts/cc-exec-adaptor.xml:104: The following error occurred while executing this line: /export/users.2/cc/cc-suites/adaptors/drlvm-test/adaptor.xml:76: There were drlvm-test failures

Date of build:	2007-12-27 15:39:27 +0600
Time to build:	123 minutes 17 seconds
Last changed:	12/27/2007 14:12:38
Last log entry:	snapshot

***********************************************************
Errors/Warnings:	(397)
            
[junit] Test Breakpoint1.Breakpoint1 FAILED
[junit] Test PopFrame1.PopFrame1 FAILED
[junit] Test SingleStep1.SingleStep1 FAILED
[junit] Test VMInit1.VMInit1 FAILED
[junit] Test Breakpoint1.Breakpoint1 FAILED
[junit] Test PopFrame1.PopFrame1 FAILED
[junit] Test SingleStep1.SingleStep1 FAILED
[junit] Test VMInit1.VMInit1 FAILED
[junit] Test Breakpoint1.Breakpoint1 FAILED
[junit] Test PopFrame1.PopFrame1 FAILED
[junit] Test SingleStep1.SingleStep1 FAILED
[junit] Test VMInit1.VMInit1 FAILED
[exec] Result: 139
[exec] Result: 139
[exec] Result: 139
[exec] Result: 139
[exec] Result: 139
[exec] Result: 139
[exec] Result: 139
[exec] Result: 139
[exec] Result: 143
[exec] Result: 143
[exec] Result: 143
[exec] Result: 139
[exec] Result: 139
[exec] Result: 139
[exec] Result: 143
[exec] Result: 139
[java] Java Result: 1
[java] Java Result: 1
[java] Java Result: 1
[java] Java Result: 1
[java] Java Result: 1
[java] Java Result: 1
[java] Java Result: 1
[java] Java Result: 1
[java] Java Result: 1
[java] Java Result: 1
[java] Java Result: 1
[java] Java Result: 1
[java] Java Result: 1
[java] Java Result: 1
[java] Java Result: 1
[java] Java Result: 1
[java] Java Result: 1
[java] Java Result: 1
[java] Java Result: 1
[java] Java Result: 1
[java] Java Result: 1
[java] Java Result: 1
[java] Java Result: 1
[java] Java Result: 1
[java] Java Result: 1
[java] Java Result: 1
[java] Java Result: 1
[java] Java Result: 1
[java] Java Result: 1
[java] Java Result: 1
[java] Java Result: 1
[java] Java Result: 1
[java] Java Result: 1
[java] Java Result: 1
[java] Java Result: 1
[java] Java Result: 1
[java] Java Result: 1
[java] Java Result: 1
[java] Java Result: 1
[java] Java Result: 1
[java] Java Result: 1
[java] Java Result: 1
[java] Java Result: 1
[java] Java Result: 1
[java] Java Result: 1
[java] Java Result: 1
[java] Java Result: 1
[java] Java Result: 1
[java] Java Result: 1
[java] Java Result: 1
[java] Java Result: 1
[java] Java Result: 1
[java] Java Result: 1
[java] Java Result: 1
[java] Java Result: 1
[java] Java Result: 1
[java] Java Result: 1
[java] Java Result: 1
[java] Java Result: 1
[java] Java Result: 1
[java] Java Result: 1
[java] Java Result: 1
[java] Java Result: 1
[java] Java Result: 1
[java] Java Result: 1
[java] Java Result: 1
[java] Java Result: 1
[java] Java Result: 1
[java] Java Result: 1
[java] Java Result: 1
[java] Java Result: 1
[java] Java Result: 1
[java] Java Result: 1
[java] Java Result: 1
[java] Java Result: 1
[java] Java Result: 1
[java] Java Result: 1
[java] Java Result: 1
[java] Java Result: 1
[java] Java Result: 1
[java] Java Result: 1
[java] Java Result: 1
[java] Java Result: 1
[java] Java Result: 1
[java] Java Result: 1
[java] Java Result: 1
[java] Java Result: 1
[java] Java Result: 1
[java] Java Result: 1
[java] Java Result: 1
[java] Java Result: 1
[java] Java Result: 1
[java] Java Result: 1
[java] Java Result: 1
[java] Java Result: 1
[java] Java Result: 1
[java] Java Result: 1
[java] Java Result: 1
[java] Java Result: 1
[java] Java Result: 1
[java] Java Result: 1
[java] Java Result: 1
[java] Java Result: 1
[java] Java Result: 1
[java] Java Result: 1
[java] Java Result: 1
[java] Java Result: 1
[java] Java Result: 1
[java] Java Result: 1
[java] Java Result: 1
[java] Java Result: 1
[java] Java Result: 1
[java] Java Result: 1
[java] Java Result: 1
[java] Java Result: 1
[java] Java Result: 1
[java] Java Result: 1
[java] Java Result: 1
[java] Java Result: 1
[java] Java Result: 1
[java] Java Result: 1
[java] Java Result: 1
[java] Java Result: 1
[java] Java Result: 1
[java] Java Result: 1
[java] Java Result: 1
[java] Java Result: 1
[java] Java Result: 1
[java] Java Result: 1
[java] Java Result: 1
[java] Java Result: 1
[java] Java Result: 1
[java] Java Result: 1
[java] Java Result: 1
[java] Java Result: 1
[java] Java Result: 1
[java] Java Result: 1
[java] Java Result: 1
[java] Java Result: 1
[java] Java Result: 1
[java] Java Result: 1
[java] Java Result: 1
[java] Java Result: 1
[java] Java Result: 1
[java] Java Result: 1
[java] Java Result: 1
[java] Java Result: 1
[java] Java Result: 1
[java] Java Result: 1
[java] Java Result: 1
[java] Java Result: 1
[java] Java Result: 1
[java] Java Result: 1
[java] Java Result: 1
[java] Java Result: 1
[java] Java Result: 1
[java] Java Result: 1
[java] Java Result: 1
[java] Java Result: 1
[java] Java Result: 1
[java] Java Result: 1
[java] Java Result: 1
[java] Java Result: 1
[java] Java Result: 1
[java] Java Result: 1
[java] Java Result: 1
[java] Java Result: 1
[java] Java Result: 1
[java] Java Result: 1
[java] Java Result: 1
[java] Java Result: 1
[java] Java Result: 1
[java] Java Result: 1
[java] Java Result: 1
[java] Java Result: 1
[java] Java Result: 1
[java] Java Result: 1
[java] Java Result: 1
[java] Java Result: 1
[java] Java Result: 1
[java] Java Result: 1
[java] Java Result: 1
[java] Java Result: 1
[java] Java Result: 1
[java] Java Result: 1
[java] Java Result: 1
[java] Java Result: 1
[java] Java Result: 1
[java] Java Result: 1
[java] Java Result: 1
[java] Java Result: 1
[java] Java Result: 1
[java] Java Result: 1
[java] Java Result: 1
[java] Java Result: 1
[java] Java Result: 1
[java] Java Result: 1
[java] Java Result: 1
[java] Java Result: 1
[java] Java Result: 1
[java] Java Result: 1
[java] Java Result: 1
[java] Java Result: 1
[java] Java Result: 1
[java] Java Result: 1
[java] Java Result: 1
[java] Java Result: 1
[java] Java Result: 1
[java] Java Result: 1
[java] Java Result: 1
[java] Java Result: 1
[java] Java Result: 1
[java] Java Result: 1
[java] Java Result: 1
[java] Java Result: 1
[java] Java Result: 1
[java] Java Result: 1
[java] Java Result: 1
[java] Java Result: 1
[java] Java Result: 1
[java] Java Result: 1
[java] Java Result: 1
[java] Java Result: 1
[java] Java Result: 1
[java] Java Result: 1
[java] Java Result: 1
[java] Java Result: 1
[java] Java Result: 1
[java] Java Result: 1
[java] Java Result: 1
[java] Java Result: 1
[java] Java Result: 1
[java] Java Result: 1
[java] Java Result: 1
[java] Java Result: 1
[java] Java Result: 1
[java] Java Result: 1
[java] Java Result: 1
[java] Java Result: 1
[java] Java Result: 1
[java] Java Result: 1
[java] Java Result: 1
[java] Java Result: 1
[java] Java Result: 1
[java] Java Result: 1
[java] Java Result: 1
[java] Java Result: 1
[java] Java Result: 1
[java] Java Result: 1
[java] Java Result: 1
[java] Java Result: 1
[java] Java Result: 1
[java] Java Result: 1
[java] Java Result: 1
[java] Java Result: 1
[java] Java Result: 1
[java] Java Result: 1
[java] Java Result: 1
[java] Java Result: 1
[java] Java Result: 1
[java] Java Result: 1
[java] Java Result: 1
[java] Java Result: 1
[java] Java Result: 1
[java] Java Result: 1
[java] Java Result: 1
[java] Java Result: 1
[java] Java Result: 1
[java] Java Result: 1
[java] Java Result: 1
[java] Java Result: 1
[java] Java Result: 1
[java] Java Result: 1
[java] Java Result: 1
[java] Java Result: 1
[java] Java Result: 1
[java] Java Result: 1
[java] Java Result: 1
[java] Java Result: 1
[java] Java Result: 1
[java] Java Result: 1
[java] Java Result: 1
[java] Java Result: 1
[java] Java Result: 1
[java] Java Result: 1
[java] Java Result: 1
[java] Java Result: 1
[java] Java Result: 1
[java] Java Result: 1
[java] Java Result: 1
[java] Java Result: 1
[java] Java Result: 1
[java] Java Result: 1
[java] Java Result: 1
[java] Java Result: 1
[java] Java Result: 1
[java] Java Result: 1
[java] Java Result: 1
[java] Java Result: 1
[java] Java Result: 1
[java] Java Result: 1
[java] Java Result: 1
[java] Java Result: 1
[java] Java Result: 1
[java] Java Result: 1
[java] Java Result: 1
[java] Java Result: 1
[java] Java Result: 1
[java] Java Result: 1
[java] Java Result: 1
[java] Java Result: 1
[java] Java Result: 1
[java] Java Result: 1
[java] Java Result: 1
[java] Java Result: 1
[java] Java Result: 1
[java] Java Result: 1
[java] Java Result: 1
[java] Java Result: 1
[java] Java Result: 1
[java] Java Result: 1
[java] Java Result: 1
[java] Java Result: 1
[java] Java Result: 1
[java] Java Result: 1
[java] Java Result: 1
[java] Java Result: 1
[java] Java Result: 1
[java] Java Result: 1
[java] Java Result: 1
[java] Java Result: 1
[java] Java Result: 1
[java] Java Result: 1
[java] Java Result: 1
[java] Java Result: 1
[java] Java Result: 1
[java] Java Result: 1
[java] Java Result: 1
[java] Java Result: 1
[java] Java Result: 1
[java] Java Result: 1
[java] Java Result: 1
[java] Java Result: 1
[java] Java Result: 1
[java] Java Result: 1
[java] Java Result: 1
[java] Java Result: 1
[java] Java Result: 1
[java] Java Result: 1
[java] Java Result: 1
[java] Java Result: 1
[java] Java Result: 1
[java] Java Result: 1
[java] Java Result: 1
[java] Java Result: 1
[java] Java Result: 1
[java] Java Result: 1
[java] Java Result: 1
[java] Java Result: 1
[junit] Tests FAILED
[junit] Tests FAILED
[junit] Tests FAILED
[junit] Tests FAILED
[junit] Tests FAILED
BUILD FAILED
/export/users.2/cc/cc-suites/build/checkouts/hdk/working_vm/build/make/build.xml:506: Some tests failed
Total time: 122 minutes 41 seconds
The execution FAILED with the following exception:
The following error occurred while executing this line:
/export/users.2/cc/cc-suites/adaptors/drlvm-test/adaptor.xml:76: There were drlvm-test failures

***********************************************************
Unit Tests: (378)
        
failure: test test_java_attrs
failure: test test_java_basic
failure: test test_java_identify
failure: test test_java_interrupt
failure: test test_java_monitors
failure: test test_java_park
failure: test test_java_ptr_conv
failure: test test_java_suspend
failure: test test_native_basic
failure: test test_native_suspend
failure: test test_native_thin_monitor
failure: test test_ti_instrum
failure: test test_ti_local_storage
failure: test test_ti_monitor_info
failure: test test_ti_raw_monitors
failure: test test_ti_state
failure: interpreter Hi_int
failure: jitrino.JET Hi_jet
failure: Client mode JIT (default) Hi_jit
failure: jitrino.OPT Hi_opt
failure: Server mode JIT Hi_srv
failure: interpreter StackTest_int
failure: jitrino.JET StackTest_jet
failure: Client mode JIT (default) StackTest_jit
failure: jitrino.OPT StackTest_opt
failure: Server mode JIT StackTest_srv
failure: interpreter classloader.ClassTestGetDeclaringClass_int
failure: jitrino.JET classloader.ClassTestGetDeclaringClass_jet
failure: Client mode JIT (default) classloader.ClassTestGetDeclaringClass_jit
failure: jitrino.OPT classloader.ClassTestGetDeclaringClass_opt
failure: Server mode JIT classloader.ClassTestGetDeclaringClass_srv
failure: interpreter classloader.ExceptionInInitializerTest_int
failure: jitrino.JET classloader.ExceptionInInitializerTest_jet
failure: Client mode JIT (default) classloader.ExceptionInInitializerTest_jit
failure: jitrino.OPT classloader.ExceptionInInitializerTest_opt
failure: Server mode JIT classloader.ExceptionInInitializerTest_srv
failure: interpreter classloader.LogLoader_int
failure: jitrino.JET classloader.LogLoader_jet
failure: Client mode JIT (default) classloader.LogLoader_jit
failure: jitrino.OPT classloader.LogLoader_opt
failure: Server mode JIT classloader.LogLoader_srv
failure: interpreter classloader.NotFound_int
failure: jitrino.JET classloader.NotFound_jet
failure: Client mode JIT (default) classloader.NotFound_jit
failure: jitrino.OPT classloader.NotFound_opt
failure: Server mode JIT classloader.NotFound_srv
failure: interpreter classloader.StressLoader_int
failure: jitrino.JET classloader.StressLoader_jet
failure: Client mode JIT (default) classloader.StressLoader_jit
failure: jitrino.OPT classloader.StressLoader_opt
failure: Server mode JIT classloader.StressLoader_srv
failure: interpreter exception.ExceptionStackTest_int
failure: jitrino.JET exception.ExceptionStackTest_jet
failure: Client mode JIT (default) exception.ExceptionStackTest_jit
failure: jitrino.OPT exception.ExceptionStackTest_opt
failure: Server mode JIT exception.ExceptionStackTest_srv
failure: interpreter exception.FinalizeStackTest_int
failure: jitrino.JET exception.FinalizeStackTest_jet
failure: Client mode JIT (default) exception.FinalizeStackTest_jit
failure: jitrino.OPT exception.FinalizeStackTest_opt
failure: Server mode JIT exception.FinalizeStackTest_srv
failure: interpreter exception.NPE_int
failure: jitrino.JET exception.NPE_jet
failure: Client mode JIT (default) exception.NPE_jit
failure: jitrino.OPT exception.NPE_opt
failure: Server mode JIT exception.NPE_srv
failure: interpreter gc.FinAlloc_int
failure: jitrino.JET gc.FinAlloc_jet
failure: Client mode JIT (default) gc.FinAlloc_jit
failure: jitrino.OPT gc.FinAlloc_opt
failure: Server mode JIT gc.FinAlloc_srv
failure: interpreter gc.Finalizer_int
failure: jitrino.JET gc.Finalizer_jet
failure: Client mode JIT (default) gc.Finalizer_jit
failure: jitrino.OPT gc.Finalizer_opt
failure: Server mode JIT gc.Finalizer_srv
failure: interpreter gc.Force_int
failure: jitrino.JET gc.Force_jet
failure: Client mode JIT (default) gc.Force_jit
failure: jitrino.OPT gc.Force_opt
failure: Server mode JIT gc.Force_srv
failure: interpreter gc.Fragment_int
failure: jitrino.JET gc.Fragment_jet
failure: Client mode JIT (default) gc.Fragment_jit
failure: jitrino.OPT gc.Fragment_opt
failure: Server mode JIT gc.Fragment_srv
failure: interpreter gc.Free_int
failure: jitrino.JET gc.Free_jet
failure: Client mode JIT (default) gc.Free_jit
failure: jitrino.OPT gc.Free_opt
failure: Server mode JIT gc.Free_srv
failure: interpreter gc.LOS_int
failure: jitrino.JET gc.LOS_jet
failure: Client mode JIT (default) gc.LOS_jit
failure: jitrino.OPT gc.LOS_opt
failure: Server mode JIT gc.LOS_srv
failure: interpreter gc.List_int
failure: jitrino.JET gc.List_jet
failure: Client mode JIT (default) gc.List_jit
failure: jitrino.OPT gc.List_opt
failure: Server mode JIT gc.List_srv
failure: jitrino.JET gc.Mark_jet
failure: Client mode JIT (default) gc.Mark_jit
failure: jitrino.OPT gc.Mark_opt
failure: Server mode JIT gc.Mark_srv
failure: interpreter gc.MultiThreads_int
failure: jitrino.JET gc.MultiThreads_jet
failure: Client mode JIT (default) gc.MultiThreads_jit
failure: jitrino.OPT gc.MultiThreads_opt
failure: Server mode JIT gc.MultiThreads_srv
failure: interpreter gc.NPE_int
failure: interpreter gc.PhantomReferenceQueueTest_int
failure: jitrino.JET gc.PhantomReferenceQueueTest_jet
failure: Client mode JIT (default) gc.PhantomReferenceQueueTest_jit
failure: jitrino.OPT gc.PhantomReferenceQueueTest_opt
failure: Server mode JIT gc.PhantomReferenceQueueTest_srv
failure: interpreter gc.RefRemove_int
failure: jitrino.JET gc.RefRemove_jet
failure: Client mode JIT (default) gc.RefRemove_jit
failure: jitrino.OPT gc.RefRemove_opt
failure: Server mode JIT gc.RefRemove_srv
failure: interpreter gc.RunFinalizersOnExitTest_int
failure: jitrino.JET gc.RunFinalizersOnExitTest_jet
failure: Client mode JIT (default) gc.RunFinalizersOnExitTest_jit
failure: jitrino.OPT gc.RunFinalizersOnExitTest_opt
failure: Server mode JIT gc.RunFinalizersOnExitTest_srv
failure: interpreter gc.StressRef_int
failure: jitrino.JET gc.StressRef_jet
failure: Client mode JIT (default) gc.StressRef_jit
failure: jitrino.OPT gc.StressRef_opt
failure: Server mode JIT gc.StressRef_srv
failure: interpreter gc.SynchronizedFinalizersTest_int
failure: jitrino.JET gc.SynchronizedFinalizersTest_jet
failure: Client mode JIT (default) gc.SynchronizedFinalizersTest_jit
failure: jitrino.OPT gc.SynchronizedFinalizersTest_opt
failure: Server mode JIT gc.SynchronizedFinalizersTest_srv
failure: interpreter gc.ThreadSuspension_int
failure: jitrino.JET gc.ThreadSuspension_jet
failure: Client mode JIT (default) gc.ThreadSuspension_jit
failure: jitrino.OPT gc.ThreadSuspension_opt
failure: Server mode JIT gc.ThreadSuspension_srv
failure: interpreter init.ErrorInInitializer_int
failure: jitrino.JET init.ErrorInInitializer_jet
failure: Client mode JIT (default) init.ErrorInInitializer_jit
failure: jitrino.OPT init.ErrorInInitializer_opt
failure: Server mode JIT init.ErrorInInitializer_srv
failure: interpreter init.Other_int
failure: jitrino.JET init.Other_jet
failure: Client mode JIT (default) init.Other_jit
failure: jitrino.OPT init.Other_opt
failure: Server mode JIT init.Other_srv
failure: interpreter io.ArrayList_int
failure: jitrino.JET io.ArrayList_jet
failure: Client mode JIT (default) io.ArrayList_jit
failure: jitrino.OPT io.ArrayList_opt
failure: Server mode JIT io.ArrayList_srv
failure: jitrino.JET io.Integers_jet
failure: Client mode JIT (default) io.Integers_jit
failure: jitrino.OPT io.Integers_opt
failure: Server mode JIT io.Integers_srv
failure: interpreter jni.LoadLibrary_int
failure: jitrino.JET jni.LoadLibrary_jet
failure: Client mode JIT (default) jni.LoadLibrary_jit
failure: jitrino.OPT jni.LoadLibrary_opt
failure: Server mode JIT jni.LoadLibrary_srv
failure: interpreter outofmemory.Double_int
failure: jitrino.JET outofmemory.Double_jet
failure: Client mode JIT (default) outofmemory.Double_jit
failure: jitrino.OPT outofmemory.Double_opt
failure: Server mode JIT outofmemory.Double_srv
failure: interpreter outofmemory.Int_int
failure: jitrino.JET outofmemory.Int_jet
failure: Client mode JIT (default) outofmemory.Int_jit
failure: jitrino.OPT outofmemory.Int_opt
failure: Server mode JIT outofmemory.Int_srv
failure: interpreter outofmemory.Plain_int
failure: jitrino.JET outofmemory.Plain_jet
failure: Client mode JIT (default) outofmemory.Plain_jit
failure: jitrino.OPT outofmemory.Plain_opt
failure: Server mode JIT outofmemory.Plain_srv
failure: interpreter outofmemory.Ref_int
failure: jitrino.JET outofmemory.Ref_jet
failure: Client mode JIT (default) outofmemory.Ref_jit
failure: jitrino.OPT outofmemory.Ref_opt
failure: Server mode JIT outofmemory.Ref_srv
failure: interpreter outofmemory.Throw_int
failure: jitrino.JET outofmemory.Throw_jet
failure: Client mode JIT (default) outofmemory.Throw_jit
failure: jitrino.OPT outofmemory.Throw_opt
failure: Server mode JIT outofmemory.Throw_srv
failure: interpreter outofmemory.VectorDouble_int
failure: jitrino.JET outofmemory.VectorDouble_jet
failure: Client mode JIT (default) outofmemory.VectorDouble_jit
failure: jitrino.OPT outofmemory.VectorDouble_opt
failure: Server mode JIT outofmemory.VectorDouble_srv
failure: interpreter outofmemory.VectorInt_int
failure: jitrino.JET outofmemory.VectorInt_jet
failure: Client mode JIT (default) outofmemory.VectorInt_jit
failure: jitrino.OPT outofmemory.VectorInt_opt
failure: Server mode JIT outofmemory.VectorInt_srv
failure: interpreter outofmemory.VectorRef_int
failure: jitrino.JET outofmemory.VectorRef_jet
failure: Client mode JIT (default) outofmemory.VectorRef_jit
failure: jitrino.OPT outofmemory.VectorRef_opt
failure: Server mode JIT outofmemory.VectorRef_srv
failure: interpreter outofmemory.Vector_int
failure: jitrino.JET outofmemory.Vector_jet
failure: Client mode JIT (default) outofmemory.Vector_jit
failure: jitrino.OPT outofmemory.Vector_opt
failure: Server mode JIT outofmemory.Vector_srv
failure: interpreter perf.CreateManyExceptions_depth_int
failure: jitrino.JET perf.CreateManyExceptions_depth_jet
failure: Client mode JIT (default) perf.CreateManyExceptions_depth_jit
failure: jitrino.OPT perf.CreateManyExceptions_depth_opt
failure: Server mode JIT perf.CreateManyExceptions_depth_srv
failure: interpreter perf.CreateManyExceptions_int
failure: jitrino.JET perf.CreateManyExceptions_jet
failure: Client mode JIT (default) perf.CreateManyExceptions_jit
failure: jitrino.OPT perf.CreateManyExceptions_opt
failure: Server mode JIT perf.CreateManyExceptions_srv
failure: interpreter perf.MultiThreadsSimple_int
failure: jitrino.JET perf.MultiThreadsSimple_jet
failure: Client mode JIT (default) perf.MultiThreadsSimple_jit
failure: jitrino.OPT perf.MultiThreadsSimple_opt
failure: Server mode JIT perf.MultiThreadsSimple_srv
failure: interpreter perf.SeveralThreads_int
failure: jitrino.JET perf.SeveralThreads_jet
failure: Client mode JIT (default) perf.SeveralThreads_jit
failure: jitrino.OPT perf.SeveralThreads_opt
failure: Server mode JIT perf.SeveralThreads_srv
failure: interpreter perf.StressCornerSize_a_int
failure: jitrino.JET perf.StressCornerSize_a_jet
failure: Client mode JIT (default) perf.StressCornerSize_a_jit
failure: jitrino.OPT perf.StressCornerSize_a_opt
failure: Server mode JIT perf.StressCornerSize_a_srv
failure: interpreter perf.StressCornerSize_int
failure: jitrino.JET perf.StressCornerSize_jet
failure: Client mode JIT (default) perf.StressCornerSize_jit
failure: jitrino.OPT perf.StressCornerSize_opt
failure: Server mode JIT perf.StressCornerSize_srv
failure: interpreter perf.ThrowManyExceptions_depth_int
failure: jitrino.JET perf.ThrowManyExceptions_depth_jet
failure: Client mode JIT (default) perf.ThrowManyExceptions_depth_jit
failure: jitrino.OPT perf.ThrowManyExceptions_depth_opt
failure: Server mode JIT perf.ThrowManyExceptions_depth_srv
failure: interpreter perf.ThrowManyExceptions_int
failure: jitrino.JET perf.ThrowManyExceptions_jet
failure: Client mode JIT (default) perf.ThrowManyExceptions_jit
failure: jitrino.OPT perf.ThrowManyExceptions_opt
failure: Server mode JIT perf.ThrowManyExceptions_srv
failure: interpreter perf.ThrowMany_depth_int
failure: jitrino.JET perf.ThrowMany_depth_jet
failure: Client mode JIT (default) perf.ThrowMany_depth_jit
failure: jitrino.OPT perf.ThrowMany_depth_opt
failure: Server mode JIT perf.ThrowMany_depth_srv
failure: interpreter perf.ThrowMany_int
failure: jitrino.JET perf.ThrowMany_jet
failure: Client mode JIT (default) perf.ThrowMany_jit
failure: jitrino.OPT perf.ThrowMany_opt
failure: Server mode JIT perf.ThrowMany_srv
failure: interpreter reflect.GetMethod_int
failure: jitrino.JET reflect.GetMethod_jet
failure: Client mode JIT (default) reflect.GetMethod_jit
failure: jitrino.OPT reflect.GetMethod_opt
failure: Server mode JIT reflect.GetMethod_srv
failure: interpreter shutdown.TestDaemonOnWait_int
failure: jitrino.JET shutdown.TestDaemonOnWait_jet
failure: Client mode JIT (default) shutdown.TestDaemonOnWait_jit
failure: jitrino.OPT shutdown.TestDaemonOnWait_opt
failure: Server mode JIT shutdown.TestDaemonOnWait_srv
failure: interpreter shutdown.TestFatalError_int
failure: jitrino.JET shutdown.TestFatalError_jet
failure: Client mode JIT (default) shutdown.TestFatalError_jit
failure: jitrino.OPT shutdown.TestFatalError_opt
failure: Server mode JIT shutdown.TestFatalError_srv
failure: interpreter shutdown.TestInterrupt_int
failure: jitrino.JET shutdown.TestInterrupt_jet
failure: Client mode JIT (default) shutdown.TestInterrupt_jit
failure: jitrino.OPT shutdown.TestInterrupt_opt
failure: Server mode JIT shutdown.TestInterrupt_srv
failure: interpreter shutdown.TestLock_int
failure: jitrino.JET shutdown.TestLock_jet
failure: Client mode JIT (default) shutdown.TestLock_jit
failure: jitrino.OPT shutdown.TestLock_opt
failure: Server mode JIT shutdown.TestLock_srv
failure: interpreter stress.BigStringBuffer_int
failure: jitrino.JET stress.BigStringBuffer_jet
failure: Client mode JIT (default) stress.BigStringBuffer_jit
failure: jitrino.OPT stress.BigStringBuffer_opt
failure: Server mode JIT stress.BigStringBuffer_srv
failure: interpreter stress.Finalizer_int
failure: jitrino.JET stress.Finalizer_jet
failure: Client mode JIT (default) stress.Finalizer_jit
failure: jitrino.OPT stress.Finalizer_opt
failure: Server mode JIT stress.Finalizer_srv
failure: jitrino.JET stress.Intern_jet
failure: Client mode JIT (default) stress.Intern_jit
failure: jitrino.OPT stress.Intern_opt
failure: Server mode JIT stress.Intern_srv
failure: interpreter stress.Mix_int
failure: jitrino.JET stress.Mix_jet
failure: Client mode JIT (default) stress.Mix_jit
failure: jitrino.OPT stress.Mix_opt
failure: Server mode JIT stress.Mix_srv
failure: interpreter stress.Stack_int
failure: interpreter stress.Sync_int
failure: jitrino.JET stress.Sync_jet
failure: Client mode JIT (default) stress.Sync_jit
failure: jitrino.OPT stress.Sync_opt
failure: Server mode JIT stress.Sync_srv
failure: interpreter stress.Vector_int
failure: jitrino.JET stress.Vector_jet
failure: Client mode JIT (default) stress.Vector_jit
failure: jitrino.OPT stress.Vector_opt
failure: Server mode JIT stress.Vector_srv
failure: interpreter stress.WeakHashmapTest_int
failure: jitrino.JET stress.WeakHashmapTest_jet
failure: Client mode JIT (default) stress.WeakHashmapTest_jit
failure: jitrino.OPT stress.WeakHashmapTest_opt
failure: Server mode JIT stress.WeakHashmapTest_srv
failure: interpreter thread.ExitShutdownHook_int
failure: jitrino.JET thread.ExitShutdownHook_jet
failure: Client mode JIT (default) thread.ExitShutdownHook_jit
failure: jitrino.OPT thread.ExitShutdownHook_opt
failure: Server mode JIT thread.ExitShutdownHook_srv
failure: interpreter thread.InfiniteFinalizer_int
failure: jitrino.JET thread.InfiniteFinalizer_jet
failure: Client mode JIT (default) thread.InfiniteFinalizer_jit
failure: jitrino.OPT thread.InfiniteFinalizer_opt
failure: Server mode JIT thread.InfiniteFinalizer_srv
failure: interpreter thread.InterruptWait_int
failure: jitrino.JET thread.InterruptWait_jet
failure: Client mode JIT (default) thread.InterruptWait_jit
failure: jitrino.OPT thread.InterruptWait_opt
failure: Server mode JIT thread.InterruptWait_srv
failure: interpreter thread.Sleep_int
failure: jitrino.JET thread.Sleep_jet
failure: Client mode JIT (default) thread.Sleep_jit
failure: jitrino.OPT thread.Sleep_opt
failure: Server mode JIT thread.Sleep_srv
failure: interpreter thread.SmallStackThreadTest_int
failure: jitrino.JET thread.SmallStackThreadTest_jet
failure: Client mode JIT (default) thread.SmallStackThreadTest_jit
failure: jitrino.OPT thread.SmallStackThreadTest_opt
failure: Server mode JIT thread.SmallStackThreadTest_srv
failure: interpreter thread.ThreadInterrupt_int
failure: jitrino.JET thread.ThreadInterrupt_jet
failure: Client mode JIT (default) thread.ThreadInterrupt_jit
failure: jitrino.OPT thread.ThreadInterrupt_opt
failure: Server mode JIT thread.ThreadInterrupt_srv
failure: interpreter thread.ThreadOOM_int
failure: jitrino.JET thread.ThreadOOM_jet
failure: Client mode JIT (default) thread.ThreadOOM_jit
failure: jitrino.OPT thread.ThreadOOM_opt
failure: Server mode JIT thread.ThreadOOM_srv
failure: interpreter util.Date_int
failure: jitrino.JET util.Date_jet
failure: Client mode JIT (default) util.Date_jit
failure: jitrino.OPT util.Date_opt
failure: Server mode JIT util.Date_srv
failure: interpreter util.DoPriveleged_int
failure: jitrino.JET util.DoPriveleged_jet
failure: Client mode JIT (default) util.DoPriveleged_jit
failure: jitrino.OPT util.DoPriveleged_opt
failure: Server mode JIT util.DoPriveleged_srv
failure: interpreter util.Prop_int
failure: jitrino.JET util.Prop_jet
failure: Client mode JIT (default) util.Prop_jit
failure: jitrino.OPT util.Prop_opt
failure: Server mode JIT util.Prop_srv
failure: interpreter util.StringIntern_int
failure: jitrino.JET util.StringIntern_jet
failure: Client mode JIT (default) util.StringIntern_jit
failure: jitrino.OPT util.StringIntern_opt
failure: Server mode JIT util.StringIntern_srv
Unit Test Error Details:	(375)
                
Test: testClass: test_java_attrsExit code: 139 Err: INFO: TEST test_jthread_get_priority start
Loading error /export/users.2/cc/cc-suites/build/checkouts/snapshot/hdk/jdk/jre/bin/default/libgc_gen_uncomp.so: undefined symbol: _Z23free_set_pool_put_entryP12Vector_BlockP11GC_Metadata
GC library cannot be loaded: libgc_gen_uncomp.so
Test: testClass: test_java_basicExit code: 139 Err: INFO: TEST test_jthread_attach start
Loading error /export/users.2/cc/cc-suites/build/checkouts/snapshot/hdk/jdk/jre/bin/default/libgc_gen_uncomp.so: undefined symbol: _Z23free_set_pool_put_entryP12Vector_BlockP11GC_Metadata
GC library cannot be loaded: libgc_gen_uncomp.so
Test: testClass: test_java_identifyExit code: 139 Err: INFO: TEST test_jthread_self start
Loading error /export/users.2/cc/cc-suites/build/checkouts/snapshot/hdk/jdk/jre/bin/default/libgc_gen_uncomp.so: undefined symbol: _Z23free_set_pool_put_entryP12Vector_BlockP11GC_Metadata
GC library cannot be loaded: libgc_gen_uncomp.so
Test: testClass: test_java_interruptExit code: 139 Err: INFO: TEST test_jthread_interrupt start
Loading error /export/users.2/cc/cc-suites/build/checkouts/snapshot/hdk/jdk/jre/bin/default/libgc_gen_uncomp.so: undefined symbol: _Z23free_set_pool_put_entryP12Vector_BlockP11GC_Metadata
GC library cannot be loaded: libgc_gen_uncomp.so
Test: testClass: test_java_monitorsExit code: 139 Err: INFO: TEST test_jthread_monitor_init start
Loading error /export/users.2/cc/cc-suites/build/checkouts/snapshot/hdk/jdk/jre/bin/default/libgc_gen_uncomp.so: undefined symbol: _Z23free_set_pool_put_entryP12Vector_BlockP11GC_Metadata
GC library cannot be loaded: libgc_gen_uncomp.so
Test: testClass: test_java_parkExit code: 139 Err: INFO: TEST test_jthread_park_unpark start
Loading error /export/users.2/cc/cc-suites/build/checkouts/snapshot/hdk/jdk/jre/bin/default/libgc_gen_uncomp.so: undefined symbol: _Z23free_set_pool_put_entryP12Vector_BlockP11GC_Metadata
GC library cannot be loaded: libgc_gen_uncomp.so
Test: testClass: test_java_ptr_convExit code: 139 Err: INFO: TEST test_jthread_get_java_thread start
Loading error /export/users.2/cc/cc-suites/build/checkouts/snapshot/hdk/jdk/jre/bin/default/libgc_gen_uncomp.so: undefined symbol: _Z23free_set_pool_put_entryP12Vector_BlockP11GC_Metadata
GC library cannot be loaded: libgc_gen_uncomp.so
Test: testClass: test_java_suspendExit code: 139 Err: INFO: TEST test_jthread_suspend_resume start
Loading error /export/users.2/cc/cc-suites/build/checkouts/snapshot/hdk/jdk/jre/bin/default/libgc_gen_uncomp.so: undefined symbol: _Z23free_set_pool_put_entryP12Vector_BlockP11GC_Metadata
GC library cannot be loaded: libgc_gen_uncomp.so
Test: testClass: test_native_basicExit code: 143 Err: INFO: TEST test_hythread_self_base start
Loading error /export/users.2/cc/cc-suites/build/checkouts/snapshot/hdk/jdk/jre/bin/default/libgc_gen_uncomp.so: undefined symbol: _Z23free_set_pool_put_entryP12Vector_BlockP11GC_Metadata
GC library cannot be loaded: libgc_gen_uncomp.so
INFO: TEST test_hythread_self_base: PASSED
INFO: TEST test_hythread_create start
Test: testClass: test_native_suspendExit code: 143 Err: INFO: TEST test_hythread_thread_suspend start
Loading error /export/users.2/cc/cc-suites/build/checkouts/snapshot/hdk/jdk/jre/bin/default/libgc_gen_uncomp.so: undefined symbol: _Z23free_set_pool_put_entryP12Vector_BlockP11GC_Metadata
GC library cannot be loaded: libgc_gen_uncomp.so
INFO: TEST test_hythread_thread_suspend: PASSED
INFO: TEST test_hythread_thread_suspend_all start
Test: testClass: test_native_thin_monitorExit code: 143 Err: INFO: TEST test_hythread_thin_monitor_enter start
Loading error /export/users.2/cc/cc-suites/build/checkouts/snapshot/hdk/jdk/jre/bin/default/libgc_gen_uncomp.so: undefined symbol: _Z23free_set_pool_put_entryP12Vector_BlockP11GC_Metadata
GC library cannot be loaded: libgc_gen_uncomp.so
INFO: TEST test_hythread_thin_monitor_enter: PASSED
INFO: TEST test_hythread_thin_monitor_try_enter start
Test: testClass: test_ti_instrumExit code: 139 Err: INFO: TEST test_jthread_get_all_threads start
Loading error /export/users.2/cc/cc-suites/build/checkouts/snapshot/hdk/jdk/jre/bin/default/libgc_gen_uncomp.so: undefined symbol: _Z23free_set_pool_put_entryP12Vector_BlockP11GC_Metadata
GC library cannot be loaded: libgc_gen_uncomp.so
Test: testClass: test_ti_local_storageExit code: 139 Err: INFO: TEST test_jthread_set_and_get_local_storage start
Loading error /export/users.2/cc/cc-suites/build/checkouts/snapshot/hdk/jdk/jre/bin/default/libgc_gen_uncomp.so: undefined symbol: _Z23free_set_pool_put_entryP12Vector_BlockP11GC_Metadata
GC library cannot be loaded: libgc_gen_uncomp.so
Test: testClass: test_ti_monitor_infoExit code: 139 Err: INFO: TEST test_jthread_get_contended_monitor start
Loading error /export/users.2/cc/cc-suites/build/checkouts/snapshot/hdk/jdk/jre/bin/default/libgc_gen_uncomp.so: undefined symbol: _Z23free_set_pool_put_entryP12Vector_BlockP11GC_Metadata
GC library cannot be loaded: libgc_gen_uncomp.so
Test: testClass: test_ti_raw_monitorsExit code: 143 Err: INFO: TEST test_jthread_raw_monitor_create start
Loading error /export/users.2/cc/cc-suites/build/checkouts/snapshot/hdk/jdk/jre/bin/default/libgc_gen_uncomp.so: undefined symbol: _Z23free_set_pool_put_entryP12Vector_BlockP11GC_Metadata
GC library cannot be loaded: libgc_gen_uncomp.so
INFO: TEST test_jthread_raw_monitor_create: PASSED
INFO: TEST test_jthread_raw_monitor_destroy start
Test: testClass: test_ti_stateExit code: 139 Err: INFO: TEST test_jthread_get_jvmti_state_6 start
Loading error /export/users.2/cc/cc-suites/build/checkouts/snapshot/hdk/jdk/jre/bin/default/libgc_gen_uncomp.so: undefined symbol: _Z23free_set_pool_put_entryP12Vector_BlockP11GC_Metadata
GC library cannot be loaded: libgc_gen_uncomp.so
Test: interpreterClass: Hi_intExit code: 1 Err: Loading error /export/users.2/cc/cc-suites/build/checkouts/snapshot/hdk/jdk/jre/bin/default/libgc_gen_uncomp.so: undefined symbol: _Z23free_set_pool_put_entryP12Vector_BlockP11GC_Metadata
GC library cannot be loaded: libgc_gen_uncomp.so
HMYEXEL062E Internal VM error: Failed to create Java VM
FAILED to invoke JVM.
Test: jitrino.JETClass: Hi_jetExit code: 1 Err: Loading error /export/users.2/cc/cc-suites/build/checkouts/snapshot/hdk/jdk/jre/bin/default/libgc_gen_uncomp.so: undefined symbol: _Z23free_set_pool_put_entryP12Vector_BlockP11GC_Metadata
GC library cannot be loaded: libgc_gen_uncomp.so
HMYEXEL062E Internal VM error: Failed to create Java VM
FAILED to invoke JVM.
Test: Client mode JIT (default)Class: Hi_jitExit code: 1 Err: Loading error /export/users.2/cc/cc-suites/build/checkouts/snapshot/hdk/jdk/jre/bin/default/libgc_gen_uncomp.so: undefined symbol: _Z23free_set_pool_put_entryP12Vector_BlockP11GC_Metadata
GC library cannot be loaded: libgc_gen_uncomp.so
HMYEXEL062E Internal VM error: Failed to create Java VM
FAILED to invoke JVM.
Test: jitrino.OPTClass: Hi_optExit code: 1 Err: Loading error /export/users.2/cc/cc-suites/build/checkouts/snapshot/hdk/jdk/jre/bin/default/libgc_gen_uncomp.so: undefined symbol: _Z23free_set_pool_put_entryP12Vector_BlockP11GC_Metadata
GC library cannot be loaded: libgc_gen_uncomp.so
HMYEXEL062E Internal VM error: Failed to create Java VM
FAILED to invoke JVM.
Test: Server mode JITClass: Hi_srvExit code: 1 Err: Loading error /export/users.2/cc/cc-suites/build/checkouts/snapshot/hdk/jdk/jre/bin/default/libgc_gen_uncomp.so: undefined symbol: _Z23free_set_pool_put_entryP12Vector_BlockP11GC_Metadata
GC library cannot be loaded: libgc_gen_uncomp.so
HMYEXEL062E Internal VM error: Failed to create Java VM
FAILED to invoke JVM.
Test: interpreterClass: StackTest_intExit code: 1 Err: Loading error /export/users.2/cc/cc-suites/build/checkouts/snapshot/hdk/jdk/jre/bin/default/libgc_gen_uncomp.so: undefined symbol: _Z23free_set_pool_put_entryP12Vector_BlockP11GC_Metadata
GC library cannot be loaded: libgc_gen_uncomp.so
HMYEXEL062E Internal VM error: Failed to create Java VM
FAILED to invoke JVM.
Test: jitrino.JETClass: StackTest_jetExit code: 1 Err: Loading error /export/users.2/cc/cc-suites/build/checkouts/snapshot/hdk/jdk/jre/bin/default/libgc_gen_uncomp.so: undefined symbol: _Z23free_set_pool_put_entryP12Vector_BlockP11GC_Metadata
GC library cannot be loaded: libgc_gen_uncomp.so
HMYEXEL062E Internal VM error: Failed to create Java VM
FAILED to invoke JVM.
Test: Client mode JIT (default)Class: StackTest_jitExit code: 1 Err: Loading error /export/users.2/cc/cc-suites/build/checkouts/snapshot/hdk/jdk/jre/bin/default/libgc_gen_uncomp.so: undefined symbol: _Z23free_set_pool_put_entryP12Vector_BlockP11GC_Metadata
GC library cannot be loaded: libgc_gen_uncomp.so
HMYEXEL062E Internal VM error: Failed to create Java VM
FAILED to invoke JVM.
Test: jitrino.OPTClass: StackTest_optExit code: 1 Err: Loading error /export/users.2/cc/cc-suites/build/checkouts/snapshot/hdk/jdk/jre/bin/default/libgc_gen_uncomp.so: undefined symbol: _Z23free_set_pool_put_entryP12Vector_BlockP11GC_Metadata
GC library cannot be loaded: libgc_gen_uncomp.so
HMYEXEL062E Internal VM error: Failed to create Java VM
FAILED to invoke JVM.
Test: Server mode JITClass: StackTest_srvExit code: 1 Err: Loading error /export/users.2/cc/cc-suites/build/checkouts/snapshot/hdk/jdk/jre/bin/default/libgc_gen_uncomp.so: undefined symbol: _Z23free_set_pool_put_entryP12Vector_BlockP11GC_Metadata
GC library cannot be loaded: libgc_gen_uncomp.so
HMYEXEL062E Internal VM error: Failed to create Java VM
FAILED to invoke JVM.
Test: interpreterClass: classloader.ClassTestGetDeclaringClass_intExit code: 1 Err: Loading error /export/users.2/cc/cc-suites/build/checkouts/snapshot/hdk/jdk/jre/bin/default/libgc_gen_uncomp.so: undefined symbol: _Z23free_set_pool_put_entryP12Vector_BlockP11GC_Metadata
GC library cannot be loaded: libgc_gen_uncomp.so
HMYEXEL062E Internal VM error: Failed to create Java VM
FAILED to invoke JVM.
Test: jitrino.JETClass: classloader.ClassTestGetDeclaringClass_jetExit code: 1 Err: Loading error /export/users.2/cc/cc-suites/build/checkouts/snapshot/hdk/jdk/jre/bin/default/libgc_gen_uncomp.so: undefined symbol: _Z23free_set_pool_put_entryP12Vector_BlockP11GC_Metadata
GC library cannot be loaded: libgc_gen_uncomp.so
HMYEXEL062E Internal VM error: Failed to create Java VM
FAILED to invoke JVM.
Test: Client mode JIT (default)Class: classloader.ClassTestGetDeclaringClass_jitExit code: 1 Err: Loading error /export/users.2/cc/cc-suites/build/checkouts/snapshot/hdk/jdk/jre/bin/default/libgc_gen_uncomp.so: undefined symbol: _Z23free_set_pool_put_entryP12Vector_BlockP11GC_Metadata
GC library cannot be loaded: libgc_gen_uncomp.so
HMYEXEL062E Internal VM error: Failed to create Java VM
FAILED to invoke JVM.
Test: jitrino.OPTClass: classloader.ClassTestGetDeclaringClass_optExit code: 1 Err: Loading error /export/users.2/cc/cc-suites/build/checkouts/snapshot/hdk/jdk/jre/bin/default/libgc_gen_uncomp.so: undefined symbol: _Z23free_set_pool_put_entryP12Vector_BlockP11GC_Metadata
GC library cannot be loaded: libgc_gen_uncomp.so
HMYEXEL062E Internal VM error: Failed to create Java VM
FAILED to invoke JVM.
Test: Server mode JITClass: classloader.ClassTestGetDeclaringClass_srvExit code: 1 Err: Loading error /export/users.2/cc/cc-suites/build/checkouts/snapshot/hdk/jdk/jre/bin/default/libgc_gen_uncomp.so: undefined symbol: _Z23free_set_pool_put_entryP12Vector_BlockP11GC_Metadata
GC library cannot be loaded: libgc_gen_uncomp.so
HMYEXEL062E Internal VM error: Failed to create Java VM
FAILED to invoke JVM.
Test: interpreterClass: classloader.ExceptionInInitializerTest_intExit code: 1 Err: Loading error /export/users.2/cc/cc-suites/build/checkouts/snapshot/hdk/jdk/jre/bin/default/libgc_gen_uncomp.so: undefined symbol: _Z23free_set_pool_put_entryP12Vector_BlockP11GC_Metadata
GC library cannot be loaded: libgc_gen_uncomp.so
HMYEXEL062E Internal VM error: Failed to create Java VM
FAILED to invoke JVM.
Test: jitrino.JETClass: classloader.ExceptionInInitializerTest_jetExit code: 1 Err: Loading error /export/users.2/cc/cc-suites/build/checkouts/snapshot/hdk/jdk/jre/bin/default/libgc_gen_uncomp.so: undefined symbol: _Z23free_set_pool_put_entryP12Vector_BlockP11GC_Metadata
GC library cannot be loaded: libgc_gen_uncomp.so
HMYEXEL062E Internal VM error: Failed to create Java VM
FAILED to invoke JVM.
Test: Client mode JIT (default)Class: classloader.ExceptionInInitializerTest_jitExit code: 1 Err: Loading error /export/users.2/cc/cc-suites/build/checkouts/snapshot/hdk/jdk/jre/bin/default/libgc_gen_uncomp.so: undefined symbol: _Z23free_set_pool_put_entryP12Vector_BlockP11GC_Metadata
GC library cannot be loaded: libgc_gen_uncomp.so
HMYEXEL062E Internal VM error: Failed to create Java VM
FAILED to invoke JVM.
Test: jitrino.OPTClass: classloader.ExceptionInInitializerTest_optExit code: 1 Err: Loading error /export/users.2/cc/cc-suites/build/checkouts/snapshot/hdk/jdk/jre/bin/default/libgc_gen_uncomp.so: undefined symbol: _Z23free_set_pool_put_entryP12Vector_BlockP11GC_Metadata
GC library cannot be loaded: libgc_gen_uncomp.so
HMYEXEL062E Internal VM error: Failed to create Java VM
FAILED to invoke JVM.
Test: Server mode JITClass: classloader.ExceptionInInitializerTest_srvExit code: 1 Err: Loading error /export/users.2/cc/cc-suites/build/checkouts/snapshot/hdk/jdk/jre/bin/default/libgc_gen_uncomp.so: undefined symbol: _Z23free_set_pool_put_entryP12Vector_BlockP11GC_Metadata
GC library cannot be loaded: libgc_gen_uncomp.so
HMYEXEL062E Internal VM error: Failed to create Java VM
FAILED to invoke JVM.
Test: interpreterClass: classloader.LogLoader_intExit code: 1 Err: Loading error /export/users.2/cc/cc-suites/build/checkouts/snapshot/hdk/jdk/jre/bin/default/libgc_gen_uncomp.so: undefined symbol: _Z23free_set_pool_put_entryP12Vector_BlockP11GC_Metadata
GC library cannot be loaded: libgc_gen_uncomp.so
HMYEXEL062E Internal VM error: Failed to create Java VM
FAILED to invoke JVM.
Test: jitrino.JETClass: classloader.LogLoader_jetExit code: 1 Err: Loading error /export/users.2/cc/cc-suites/build/checkouts/snapshot/hdk/jdk/jre/bin/default/libgc_gen_uncomp.so: undefined symbol: _Z23free_set_pool_put_entryP12Vector_BlockP11GC_Metadata
GC library cannot be loaded: libgc_gen_uncomp.so
HMYEXEL062E Internal VM error: Failed to create Java VM
FAILED to invoke JVM.
Test: Client mode JIT (default)Class: classloader.LogLoader_jitExit code: 1 Err: Loading error /export/users.2/cc/cc-suites/build/checkouts/snapshot/hdk/jdk/jre/bin/default/libgc_gen_uncomp.so: undefined symbol: _Z23free_set_pool_put_entryP12Vector_BlockP11GC_Metadata
GC library cannot be loaded: libgc_gen_uncomp.so
HMYEXEL062E Internal VM error: Failed to create Java VM
FAILED to invoke JVM.
Test: jitrino.OPTClass: classloader.LogLoader_optExit code: 1 Err: Loading error /export/users.2/cc/cc-suites/build/checkouts/snapshot/hdk/jdk/jre/bin/default/libgc_gen_uncomp.so: undefined symbol: _Z23free_set_pool_put_entryP12Vector_BlockP11GC_Metadata
GC library cannot be loaded: libgc_gen_uncomp.so
HMYEXEL062E Internal VM error: Failed to create Java VM
FAILED to invoke JVM.
Test: Server mode JITClass: classloader.LogLoader_srvExit code: 1 Err: Loading error /export/users.2/cc/cc-suites/build/checkouts/snapshot/hdk/jdk/jre/bin/default/libgc_gen_uncomp.so: undefined symbol: _Z23free_set_pool_put_entryP12Vector_BlockP11GC_Metadata
GC library cannot be loaded: libgc_gen_uncomp.so
HMYEXEL062E Internal VM error: Failed to create Java VM
FAILED to invoke JVM.
Test: interpreterClass: classloader.NotFound_intExit code: 1 Err: Loading error /export/users.2/cc/cc-suites/build/checkouts/snapshot/hdk/jdk/jre/bin/default/libgc_gen_uncomp.so: undefined symbol: _Z23free_set_pool_put_entryP12Vector_BlockP11GC_Metadata
GC library cannot be loaded: libgc_gen_uncomp.so
HMYEXEL062E Internal VM error: Failed to create Java VM
FAILED to invoke JVM.
Test: jitrino.JETClass: classloader.NotFound_jetExit code: 1 Err: Loading error /export/users.2/cc/cc-suites/build/checkouts/snapshot/hdk/jdk/jre/bin/default/libgc_gen_uncomp.so: undefined symbol: _Z23free_set_pool_put_entryP12Vector_BlockP11GC_Metadata
GC library cannot be loaded: libgc_gen_uncomp.so
HMYEXEL062E Internal VM error: Failed to create Java VM
FAILED to invoke JVM.
Test: Client mode JIT (default)Class: classloader.NotFound_jitExit code: 1 Err: Loading error /export/users.2/cc/cc-suites/build/checkouts/snapshot/hdk/jdk/jre/bin/default/libgc_gen_uncomp.so: undefined symbol: _Z23free_set_pool_put_entryP12Vector_BlockP11GC_Metadata
GC library cannot be loaded: libgc_gen_uncomp.so
HMYEXEL062E Internal VM error: Failed to create Java VM
FAILED to invoke JVM.
Test: jitrino.OPTClass: classloader.NotFound_optExit code: 1 Err: Loading error /export/users.2/cc/cc-suites/build/checkouts/snapshot/hdk/jdk/jre/bin/default/libgc_gen_uncomp.so: undefined symbol: _Z23free_set_pool_put_entryP12Vector_BlockP11GC_Metadata
GC library cannot be loaded: libgc_gen_uncomp.so
HMYEXEL062E Internal VM error: Failed to create Java VM
FAILED to invoke JVM.
Test: Server mode JITClass: classloader.NotFound_srvExit code: 1 Err: Loading error /export/users.2/cc/cc-suites/build/checkouts/snapshot/hdk/jdk/jre/bin/default/libgc_gen_uncomp.so: undefined symbol: _Z23free_set_pool_put_entryP12Vector_BlockP11GC_Metadata
GC library cannot be loaded: libgc_gen_uncomp.so
HMYEXEL062E Internal VM error: Failed to create Java VM
FAILED to invoke JVM.
Test: interpreterClass: classloader.StressLoader_intExit code: 1 Err: Loading error /export/users.2/cc/cc-suites/build/checkouts/snapshot/hdk/jdk/jre/bin/default/libgc_gen_uncomp.so: undefined symbol: _Z23free_set_pool_put_entryP12Vector_BlockP11GC_Metadata
GC library cannot be loaded: libgc_gen_uncomp.so
HMYEXEL062E Internal VM error: Failed to create Java VM
FAILED to invoke JVM.
Test: jitrino.JETClass: classloader.StressLoader_jetExit code: 1 Err: Loading error /export/users.2/cc/cc-suites/build/checkouts/snapshot/hdk/jdk/jre/bin/default/libgc_gen_uncomp.so: undefined symbol: _Z23free_set_pool_put_entryP12Vector_BlockP11GC_Metadata
GC library cannot be loaded: libgc_gen_uncomp.so
HMYEXEL062E Internal VM error: Failed to create Java VM
FAILED to invoke JVM.
Test: Client mode JIT (default)Class: classloader.StressLoader_jitExit code: 1 Err: Loading error /export/users.2/cc/cc-suites/build/checkouts/snapshot/hdk/jdk/jre/bin/default/libgc_gen_uncomp.so: undefined symbol: _Z23free_set_pool_put_entryP12Vector_BlockP11GC_Metadata
GC library cannot be loaded: libgc_gen_uncomp.so
HMYEXEL062E Internal VM error: Failed to create Java VM
FAILED to invoke JVM.
Test: jitrino.OPTClass: classloader.StressLoader_optExit code: 1 Err: Loading error /export/users.2/cc/cc-suites/build/checkouts/snapshot/hdk/jdk/jre/bin/default/libgc_gen_uncomp.so: undefined symbol: _Z23free_set_pool_put_entryP12Vector_BlockP11GC_Metadata
GC library cannot be loaded: libgc_gen_uncomp.so
HMYEXEL062E Internal VM error: Failed to create Java VM
FAILED to invoke JVM.
Test: Server mode JITClass: classloader.StressLoader_srvExit code: 1 Err: Loading error /export/users.2/cc/cc-suites/build/checkouts/snapshot/hdk/jdk/jre/bin/default/libgc_gen_uncomp.so: undefined symbol: _Z23free_set_pool_put_entryP12Vector_BlockP11GC_Metadata
GC library cannot be loaded: libgc_gen_uncomp.so
HMYEXEL062E Internal VM error: Failed to create Java VM
FAILED to invoke JVM.
Test: interpreterClass: exception.ExceptionStackTest_intExit code: 1 Err: Loading error /export/users.2/cc/cc-suites/build/checkouts/snapshot/hdk/jdk/jre/bin/default/libgc_gen_uncomp.so: undefined symbol: _Z23free_set_pool_put_entryP12Vector_BlockP11GC_Metadata
GC library cannot be loaded: libgc_gen_uncomp.so
HMYEXEL062E Internal VM error: Failed to create Java VM
FAILED to invoke JVM.
Test: jitrino.JETClass: exception.ExceptionStackTest_jetExit code: 1 Err: Loading error /export/users.2/cc/cc-suites/build/checkouts/snapshot/hdk/jdk/jre/bin/default/libgc_gen_uncomp.so: undefined symbol: _Z23free_set_pool_put_entryP12Vector_BlockP11GC_Metadata
GC library cannot be loaded: libgc_gen_uncomp.so
HMYEXEL062E Internal VM error: Failed to create Java VM
FAILED to invoke JVM.
Test: Client mode JIT (default)Class: exception.ExceptionStackTest_jitExit code: 1 Err: Loading error /export/users.2/cc/cc-suites/build/checkouts/snapshot/hdk/jdk/jre/bin/default/libgc_gen_uncomp.so: undefined symbol: _Z23free_set_pool_put_entryP12Vector_BlockP11GC_Metadata
GC library cannot be loaded: libgc_gen_uncomp.so
HMYEXEL062E Internal VM error: Failed to create Java VM
FAILED to invoke JVM.
Test: jitrino.OPTClass: exception.ExceptionStackTest_optExit code: 1 Err: Loading error /export/users.2/cc/cc-suites/build/checkouts/snapshot/hdk/jdk/jre/bin/default/libgc_gen_uncomp.so: undefined symbol: _Z23free_set_pool_put_entryP12Vector_BlockP11GC_Metadata
GC library cannot be loaded: libgc_gen_uncomp.so
HMYEXEL062E Internal VM error: Failed to create Java VM
FAILED to invoke JVM.
Test: Server mode JITClass: exception.ExceptionStackTest_srvExit code: 1 Err: Loading error /export/users.2/cc/cc-suites/build/checkouts/snapshot/hdk/jdk/jre/bin/default/libgc_gen_uncomp.so: undefined symbol: _Z23free_set_pool_put_entryP12Vector_BlockP11GC_Metadata
GC library cannot be loaded: libgc_gen_uncomp.so
HMYEXEL062E Internal VM error: Failed to create Java VM
FAILED to invoke JVM.
Test: interpreterClass: exception.FinalizeStackTest_intExit code: 1 Err: Loading error /export/users.2/cc/cc-suites/build/checkouts/snapshot/hdk/jdk/jre/bin/default/libgc_gen_uncomp.so: undefined symbol: _Z23free_set_pool_put_entryP12Vector_BlockP11GC_Metadata
GC library cannot be loaded: libgc_gen_uncomp.so
HMYEXEL062E Internal VM error: Failed to create Java VM
FAILED to invoke JVM.
Test: jitrino.JETClass: exception.FinalizeStackTest_jetExit code: 1 Err: Loading error /export/users.2/cc/cc-suites/build/checkouts/snapshot/hdk/jdk/jre/bin/default/libgc_gen_uncomp.so: undefined symbol: _Z23free_set_pool_put_entryP12Vector_BlockP11GC_Metadata
GC library cannot be loaded: libgc_gen_uncomp.so
HMYEXEL062E Internal VM error: Failed to create Java VM
FAILED to invoke JVM.
Test: Client mode JIT (default)Class: exception.FinalizeStackTest_jitExit code: 1 Err: Loading error /export/users.2/cc/cc-suites/build/checkouts/snapshot/hdk/jdk/jre/bin/default/libgc_gen_uncomp.so: undefined symbol: _Z23free_set_pool_put_entryP12Vector_BlockP11GC_Metadata
GC library cannot be loaded: libgc_gen_uncomp.so
HMYEXEL062E Internal VM error: Failed to create Java VM
FAILED to invoke JVM.
Test: jitrino.OPTClass: exception.FinalizeStackTest_optExit code: 1 Err: Loading error /export/users.2/cc/cc-suites/build/checkouts/snapshot/hdk/jdk/jre/bin/default/libgc_gen_uncomp.so: undefined symbol: _Z23free_set_pool_put_entryP12Vector_BlockP11GC_Metadata
GC library cannot be loaded: libgc_gen_uncomp.so
HMYEXEL062E Internal VM error: Failed to create Java VM
FAILED to invoke JVM.
Test: Server mode JITClass: exception.FinalizeStackTest_srvExit code: 1 Err: Loading error /export/users.2/cc/cc-suites/build/checkouts/snapshot/hdk/jdk/jre/bin/default/libgc_gen_uncomp.so: undefined symbol: _Z23free_set_pool_put_entryP12Vector_BlockP11GC_Metadata
GC library cannot be loaded: libgc_gen_uncomp.so
HMYEXEL062E Internal VM error: Failed to create Java VM
FAILED to invoke JVM.
Test: interpreterClass: exception.NPE_intExit code: 1 Err: Loading error /export/users.2/cc/cc-suites/build/checkouts/snapshot/hdk/jdk/jre/bin/default/libgc_gen_uncomp.so: undefined symbol: _Z23free_set_pool_put_entryP12Vector_BlockP11GC_Metadata
GC library cannot be loaded: libgc_gen_uncomp.so
HMYEXEL062E Internal VM error: Failed to create Java VM
FAILED to invoke JVM.
Test: jitrino.JETClass: exception.NPE_jetExit code: 1 Err: Loading error /export/users.2/cc/cc-suites/build/checkouts/snapshot/hdk/jdk/jre/bin/default/libgc_gen_uncomp.so: undefined symbol: _Z23free_set_pool_put_entryP12Vector_BlockP11GC_Metadata
GC library cannot be loaded: libgc_gen_uncomp.so
HMYEXEL062E Internal VM error: Failed to create Java VM
FAILED to invoke JVM.
Test: Client mode JIT (default)Class: exception.NPE_jitExit code: 1 Err: Loading error /export/users.2/cc/cc-suites/build/checkouts/snapshot/hdk/jdk/jre/bin/default/libgc_gen_uncomp.so: undefined symbol: _Z23free_set_pool_put_entryP12Vector_BlockP11GC_Metadata
GC library cannot be loaded: libgc_gen_uncomp.so
HMYEXEL062E Internal VM error: Failed to create Java VM
FAILED to invoke JVM.
Test: jitrino.OPTClass: exception.NPE_optExit code: 1 Err: Loading error /export/users.2/cc/cc-suites/build/checkouts/snapshot/hdk/jdk/jre/bin/default/libgc_gen_uncomp.so: undefined symbol: _Z23free_set_pool_put_entryP12Vector_BlockP11GC_Metadata
GC library cannot be loaded: libgc_gen_uncomp.so
HMYEXEL062E Internal VM error: Failed to create Java VM
FAILED to invoke JVM.
Test: Server mode JITClass: exception.NPE_srvExit code: 1 Err: Loading error /export/users.2/cc/cc-suites/build/checkouts/snapshot/hdk/jdk/jre/bin/default/libgc_gen_uncomp.so: undefined symbol: _Z23free_set_pool_put_entryP12Vector_BlockP11GC_Metadata
GC library cannot be loaded: libgc_gen_uncomp.so
HMYEXEL062E Internal VM error: Failed to create Java VM
FAILED to invoke JVM.
Test: interpreterClass: gc.FinAlloc_intExit code: 1 Err: Loading error /export/users.2/cc/cc-suites/build/checkouts/snapshot/hdk/jdk/jre/bin/default/libgc_gen_uncomp.so: undefined symbol: _Z23free_set_pool_put_entryP12Vector_BlockP11GC_Metadata
GC library cannot be loaded: libgc_gen_uncomp.so
HMYEXEL062E Internal VM error: Failed to create Java VM
FAILED to invoke JVM.
Test: jitrino.JETClass: gc.FinAlloc_jetExit code: 1 Err: Loading error /export/users.2/cc/cc-suites/build/checkouts/snapshot/hdk/jdk/jre/bin/default/libgc_gen_uncomp.so: undefined symbol: _Z23free_set_pool_put_entryP12Vector_BlockP11GC_Metadata
GC library cannot be loaded: libgc_gen_uncomp.so
HMYEXEL062E Internal VM error: Failed to create Java VM
FAILED to invoke JVM.
Test: Client mode JIT (default)Class: gc.FinAlloc_jitExit code: 1 Err: Loading error /export/users.2/cc/cc-suites/build/checkouts/snapshot/hdk/jdk/jre/bin/default/libgc_gen_uncomp.so: undefined symbol: _Z23free_set_pool_put_entryP12Vector_BlockP11GC_Metadata
GC library cannot be loaded: libgc_gen_uncomp.so
HMYEXEL062E Internal VM error: Failed to create Java VM
FAILED to invoke JVM.
Test: jitrino.OPTClass: gc.FinAlloc_optExit code: 1 Err: Loading error /export/users.2/cc/cc-suites/build/checkouts/snapshot/hdk/jdk/jre/bin/default/libgc_gen_uncomp.so: undefined symbol: _Z23free_set_pool_put_entryP12Vector_BlockP11GC_Metadata
GC library cannot be loaded: libgc_gen_uncomp.so
HMYEXEL062E Internal VM error: Failed to create Java VM
FAILED to invoke JVM.
Test: Server mode JITClass: gc.FinAlloc_srvExit code: 1 Err: Loading error /export/users.2/cc/cc-suites/build/checkouts/snapshot/hdk/jdk/jre/bin/default/libgc_gen_uncomp.so: undefined symbol: _Z23free_set_pool_put_entryP12Vector_BlockP11GC_Metadata
GC library cannot be loaded: libgc_gen_uncomp.so
HMYEXEL062E Internal VM error: Failed to create Java VM
FAILED to invoke JVM.
Test: interpreterClass: gc.Finalizer_intExit code: 1 Err: Loading error /export/users.2/cc/cc-suites/build/checkouts/snapshot/hdk/jdk/jre/bin/default/libgc_gen_uncomp.so: undefined symbol: _Z23free_set_pool_put_entryP12Vector_BlockP11GC_Metadata
GC library cannot be loaded: libgc_gen_uncomp.so
HMYEXEL062E Internal VM error: Failed to create Java VM
FAILED to invoke JVM.
Test: jitrino.JETClass: gc.Finalizer_jetExit code: 1 Err: Loading error /export/users.2/cc/cc-suites/build/checkouts/snapshot/hdk/jdk/jre/bin/default/libgc_gen_uncomp.so: undefined symbol: _Z23free_set_pool_put_entryP12Vector_BlockP11GC_Metadata
GC library cannot be loaded: libgc_gen_uncomp.so
HMYEXEL062E Internal VM error: Failed to create Java VM
FAILED to invoke JVM.
Test: Client mode JIT (default)Class: gc.Finalizer_jitExit code: 1 Err: Loading error /export/users.2/cc/cc-suites/build/checkouts/snapshot/hdk/jdk/jre/bin/default/libgc_gen_uncomp.so: undefined symbol: _Z23free_set_pool_put_entryP12Vector_BlockP11GC_Metadata
GC library cannot be loaded: libgc_gen_uncomp.so
HMYEXEL062E Internal VM error: Failed to create Java VM
FAILED to invoke JVM.
Test: jitrino.OPTClass: gc.Finalizer_optExit code: 1 Err: Loading error /export/users.2/cc/cc-suites/build/checkouts/snapshot/hdk/jdk/jre/bin/default/libgc_gen_uncomp.so: undefined symbol: _Z23free_set_pool_put_entryP12Vector_BlockP11GC_Metadata
GC library cannot be loaded: libgc_gen_uncomp.so
HMYEXEL062E Internal VM error: Failed to create Java VM
FAILED to invoke JVM.
Test: Server mode JITClass: gc.Finalizer_srvExit code: 1 Err: Loading error /export/users.2/cc/cc-suites/build/checkouts/snapshot/hdk/jdk/jre/bin/default/libgc_gen_uncomp.so: undefined symbol: _Z23free_set_pool_put_entryP12Vector_BlockP11GC_Metadata
GC library cannot be loaded: libgc_gen_uncomp.so
HMYEXEL062E Internal VM error: Failed to create Java VM
FAILED to invoke JVM.
Test: interpreterClass: gc.Force_intExit code: 1 Err: Loading error /export/users.2/cc/cc-suites/build/checkouts/snapshot/hdk/jdk/jre/bin/default/libgc_gen_uncomp.so: undefined symbol: _Z23free_set_pool_put_entryP12Vector_BlockP11GC_Metadata
GC library cannot be loaded: libgc_gen_uncomp.so
HMYEXEL062E Internal VM error: Failed to create Java VM
FAILED to invoke JVM.
Test: jitrino.JETClass: gc.Force_jetExit code: 1 Err: Loading error /export/users.2/cc/cc-suites/build/checkouts/snapshot/hdk/jdk/jre/bin/default/libgc_gen_uncomp.so: undefined symbol: _Z23free_set_pool_put_entryP12Vector_BlockP11GC_Metadata
GC library cannot be loaded: libgc_gen_uncomp.so
HMYEXEL062E Internal VM error: Failed to create Java VM
FAILED to invoke JVM.
Test: Client mode JIT (default)Class: gc.Force_jitExit code: 1 Err: Loading error /export/users.2/cc/cc-suites/build/checkouts/snapshot/hdk/jdk/jre/bin/default/libgc_gen_uncomp.so: undefined symbol: _Z23free_set_pool_put_entryP12Vector_BlockP11GC_Metadata
GC library cannot be loaded: libgc_gen_uncomp.so
HMYEXEL062E Internal VM error: Failed to create Java VM
FAILED to invoke JVM.
Test: jitrino.OPTClass: gc.Force_optExit code: 1 Err: Loading error /export/users.2/cc/cc-suites/build/checkouts/snapshot/hdk/jdk/jre/bin/default/libgc_gen_uncomp.so: undefined symbol: _Z23free_set_pool_put_entryP12Vector_BlockP11GC_Metadata
GC library cannot be loaded: libgc_gen_uncomp.so
HMYEXEL062E Internal VM error: Failed to create Java VM
FAILED to invoke JVM.
Test: Server mode JITClass: gc.Force_srvExit code: 1 Err: Loading error /export/users.2/cc/cc-suites/build/checkouts/snapshot/hdk/jdk/jre/bin/default/libgc_gen_uncomp.so: undefined symbol: _Z23free_set_pool_put_entryP12Vector_BlockP11GC_Metadata
GC library cannot be loaded: libgc_gen_uncomp.so
HMYEXEL062E Internal VM error: Failed to create Java VM
FAILED to invoke JVM.
Test: interpreterClass: gc.Fragment_intExit code: 1 Err: Loading error /export/users.2/cc/cc-suites/build/checkouts/snapshot/hdk/jdk/jre/bin/default/libgc_gen_uncomp.so: undefined symbol: _Z23free_set_pool_put_entryP12Vector_BlockP11GC_Metadata
GC library cannot be loaded: libgc_gen_uncomp.so
HMYEXEL062E Internal VM error: Failed to create Java VM
FAILED to invoke JVM.
Test: jitrino.JETClass: gc.Fragment_jetExit code: 1 Err: Loading error /export/users.2/cc/cc-suites/build/checkouts/snapshot/hdk/jdk/jre/bin/default/libgc_gen_uncomp.so: undefined symbol: _Z23free_set_pool_put_entryP12Vector_BlockP11GC_Metadata
GC library cannot be loaded: libgc_gen_uncomp.so
HMYEXEL062E Internal VM error: Failed to create Java VM
FAILED to invoke JVM.
Test: Client mode JIT (default)Class: gc.Fragment_jitExit code: 1 Err: Loading error /export/users.2/cc/cc-suites/build/checkouts/snapshot/hdk/jdk/jre/bin/default/libgc_gen_uncomp.so: undefined symbol: _Z23free_set_pool_put_entryP12Vector_BlockP11GC_Metadata
GC library cannot be loaded: libgc_gen_uncomp.so
HMYEXEL062E Internal VM error: Failed to create Java VM
FAILED to invoke JVM.
Test: jitrino.OPTClass: gc.Fragment_optExit code: 1 Err: Loading error /export/users.2/cc/cc-suites/build/checkouts/snapshot/hdk/jdk/jre/bin/default/libgc_gen_uncomp.so: undefined symbol: _Z23free_set_pool_put_entryP12Vector_BlockP11GC_Metadata
GC library cannot be loaded: libgc_gen_uncomp.so
HMYEXEL062E Internal VM error: Failed to create Java VM
FAILED to invoke JVM.
Test: Server mode JITClass: gc.Fragment_srvExit code: 1 Err: Loading error /export/users.2/cc/cc-suites/build/checkouts/snapshot/hdk/jdk/jre/bin/default/libgc_gen_uncomp.so: undefined symbol: _Z23free_set_pool_put_entryP12Vector_BlockP11GC_Metadata
GC library cannot be loaded: libgc_gen_uncomp.so
HMYEXEL062E Internal VM error: Failed to create Java VM
FAILED to invoke JVM.
Test: interpreterClass: gc.Free_intExit code: 1 Err: Loading error /export/users.2/cc/cc-suites/build/checkouts/snapshot/hdk/jdk/jre/bin/default/libgc_gen_uncomp.so: undefined symbol: _Z23free_set_pool_put_entryP12Vector_BlockP11GC_Metadata
GC library cannot be loaded: libgc_gen_uncomp.so
HMYEXEL062E Internal VM error: Failed to create Java VM
FAILED to invoke JVM.
Test: jitrino.JETClass: gc.Free_jetExit code: 1 Err: Loading error /export/users.2/cc/cc-suites/build/checkouts/snapshot/hdk/jdk/jre/bin/default/libgc_gen_uncomp.so: undefined symbol: _Z23free_set_pool_put_entryP12Vector_BlockP11GC_Metadata
GC library cannot be loaded: libgc_gen_uncomp.so
HMYEXEL062E Internal VM error: Failed to create Java VM
FAILED to invoke JVM.
Test: Client mode JIT (default)Class: gc.Free_jitExit code: 1 Err: Loading error /export/users.2/cc/cc-suites/build/checkouts/snapshot/hdk/jdk/jre/bin/default/libgc_gen_uncomp.so: undefined symbol: _Z23free_set_pool_put_entryP12Vector_BlockP11GC_Metadata
GC library cannot be loaded: libgc_gen_uncomp.so
HMYEXEL062E Internal VM error: Failed to create Java VM
FAILED to invoke JVM.
Test: jitrino.OPTClass: gc.Free_optExit code: 1 Err: Loading error /export/users.2/cc/cc-suites/build/checkouts/snapshot/hdk/jdk/jre/bin/default/libgc_gen_uncomp.so: undefined symbol: _Z23free_set_pool_put_entryP12Vector_BlockP11GC_Metadata
GC library cannot be loaded: libgc_gen_uncomp.so
HMYEXEL062E Internal VM error: Failed to create Java VM
FAILED to invoke JVM.
Test: Server mode JITClass: gc.Free_srvExit code: 1 Err: Loading error /export/users.2/cc/cc-suites/build/checkouts/snapshot/hdk/jdk/jre/bin/default/libgc_gen_uncomp.so: undefined symbol: _Z23free_set_pool_put_entryP12Vector_BlockP11GC_Metadata
GC library cannot be loaded: libgc_gen_uncomp.so
HMYEXEL062E Internal VM error: Failed to create Java VM
FAILED to invoke JVM.
Test: interpreterClass: gc.LOS_intExit code: 1 Err: Loading error /export/users.2/cc/cc-suites/build/checkouts/snapshot/hdk/jdk/jre/bin/default/libgc_gen_uncomp.so: undefined symbol: _Z23free_set_pool_put_entryP12Vector_BlockP11GC_Metadata
GC library cannot be loaded: libgc_gen_uncomp.so
HMYEXEL062E Internal VM error: Failed to create Java VM
FAILED to invoke JVM.
Test: jitrino.JETClass: gc.LOS_jetExit code: 1 Err: Loading error /export/users.2/cc/cc-suites/build/checkouts/snapshot/hdk/jdk/jre/bin/default/libgc_gen_uncomp.so: undefined symbol: _Z23free_set_pool_put_entryP12Vector_BlockP11GC_Metadata
GC library cannot be loaded: libgc_gen_uncomp.so
HMYEXEL062E Internal VM error: Failed to create Java VM
FAILED to invoke JVM.
Test: Client mode JIT (default)Class: gc.LOS_jitExit code: 1 Err: Loading error /export/users.2/cc/cc-suites/build/checkouts/snapshot/hdk/jdk/jre/bin/default/libgc_gen_uncomp.so: undefined symbol: _Z23free_set_pool_put_entryP12Vector_BlockP11GC_Metadata
GC library cannot be loaded: libgc_gen_uncomp.so
HMYEXEL062E Internal VM error: Failed to create Java VM
FAILED to invoke JVM.
Test: jitrino.OPTClass: gc.LOS_optExit code: 1 Err: Loading error /export/users.2/cc/cc-suites/build/checkouts/snapshot/hdk/jdk/jre/bin/default/libgc_gen_uncomp.so: undefined symbol: _Z23free_set_pool_put_entryP12Vector_BlockP11GC_Metadata
GC library cannot be loaded: libgc_gen_uncomp.so
HMYEXEL062E Internal VM error: Failed to create Java VM
FAILED to invoke JVM.
Test: Server mode JITClass: gc.LOS_srvExit code: 1 Err: Loading error /export/users.2/cc/cc-suites/build/checkouts/snapshot/hdk/jdk/jre/bin/default/libgc_gen_uncomp.so: undefined symbol: _Z23free_set_pool_put_entryP12Vector_BlockP11GC_Metadata
GC library cannot be loaded: libgc_gen_uncomp.so
HMYEXEL062E Internal VM error: Failed to create Java VM
FAILED to invoke JVM.
Test: interpreterClass: gc.List_intExit code: 1 Err: Loading error /export/users.2/cc/cc-suites/build/checkouts/snapshot/hdk/jdk/jre/bin/default/libgc_gen_uncomp.so: undefined symbol: _Z23free_set_pool_put_entryP12Vector_BlockP11GC_Metadata
GC library cannot be loaded: libgc_gen_uncomp.so
HMYEXEL062E Internal VM error: Failed to create Java VM
FAILED to invoke JVM.
Test: jitrino.JETClass: gc.List_jetExit code: 1 Err: Loading error /export/users.2/cc/cc-suites/build/checkouts/snapshot/hdk/jdk/jre/bin/default/libgc_gen_uncomp.so: undefined symbol: _Z23free_set_pool_put_entryP12Vector_BlockP11GC_Metadata
GC library cannot be loaded: libgc_gen_uncomp.so
HMYEXEL062E Internal VM error: Failed to create Java VM
FAILED to invoke JVM.
Test: Client mode JIT (default)Class: gc.List_jitExit code: 1 Err: Loading error /export/users.2/cc/cc-suites/build/checkouts/snapshot/hdk/jdk/jre/bin/default/libgc_gen_uncomp.so: undefined symbol: _Z23free_set_pool_put_entryP12Vector_BlockP11GC_Metadata
GC library cannot be loaded: libgc_gen_uncomp.so
HMYEXEL062E Internal VM error: Failed to create Java VM
FAILED to invoke JVM.
Test: jitrino.OPTClass: gc.List_optExit code: 1 Err: Loading error /export/users.2/cc/cc-suites/build/checkouts/snapshot/hdk/jdk/jre/bin/default/libgc_gen_uncomp.so: undefined symbol: _Z23free_set_pool_put_entryP12Vector_BlockP11GC_Metadata
GC library cannot be loaded: libgc_gen_uncomp.so
HMYEXEL062E Internal VM error: Failed to create Java VM
FAILED to invoke JVM.
Test: Server mode JITClass: gc.List_srvExit code: 1 Err: Loading error /export/users.2/cc/cc-suites/build/checkouts/snapshot/hdk/jdk/jre/bin/default/libgc_gen_uncomp.so: undefined symbol: _Z23free_set_pool_put_entryP12Vector_BlockP11GC_Metadata
GC library cannot be loaded: libgc_gen_uncomp.so
HMYEXEL062E Internal VM error: Failed to create Java VM
FAILED to invoke JVM.
Test: jitrino.JETClass: gc.Mark_jetExit code: 1 Err: Loading error /export/users.2/cc/cc-suites/build/checkouts/snapshot/hdk/jdk/jre/bin/default/libgc_gen_uncomp.so: undefined symbol: _Z23free_set_pool_put_entryP12Vector_BlockP11GC_Metadata
GC library cannot be loaded: libgc_gen_uncomp.so
HMYEXEL062E Internal VM error: Failed to create Java VM
FAILED to invoke JVM.
Test: Client mode JIT (default)Class: gc.Mark_jitExit code: 1 Err: Loading error /export/users.2/cc/cc-suites/build/checkouts/snapshot/hdk/jdk/jre/bin/default/libgc_gen_uncomp.so: undefined symbol: _Z23free_set_pool_put_entryP12Vector_BlockP11GC_Metadata
GC library cannot be loaded: libgc_gen_uncomp.so
HMYEXEL062E Internal VM error: Failed to create Java VM
FAILED to invoke JVM.
Test: jitrino.OPTClass: gc.Mark_optExit code: 1 Err: Loading error /export/users.2/cc/cc-suites/build/checkouts/snapshot/hdk/jdk/jre/bin/default/libgc_gen_uncomp.so: undefined symbol: _Z23free_set_pool_put_entryP12Vector_BlockP11GC_Metadata
GC library cannot be loaded: libgc_gen_uncomp.so
HMYEXEL062E Internal VM error: Failed to create Java VM
FAILED to invoke JVM.
Test: Server mode JITClass: gc.Mark_srvExit code: 1 Err: Loading error /export/users.2/cc/cc-suites/build/checkouts/snapshot/hdk/jdk/jre/bin/default/libgc_gen_uncomp.so: undefined symbol: _Z23free_set_pool_put_entryP12Vector_BlockP11GC_Metadata
GC library cannot be loaded: libgc_gen_uncomp.so
HMYEXEL062E Internal VM error: Failed to create Java VM
FAILED to invoke JVM.
Test: interpreterClass: gc.MultiThreads_intExit code: 1 Err: Loading error /export/users.2/cc/cc-suites/build/checkouts/snapshot/hdk/jdk/jre/bin/default/libgc_gen_uncomp.so: undefined symbol: _Z23free_set_pool_put_entryP12Vector_BlockP11GC_Metadata
GC library cannot be loaded: libgc_gen_uncomp.so
HMYEXEL062E Internal VM error: Failed to create Java VM
FAILED to invoke JVM.
Test: jitrino.JETClass: gc.MultiThreads_jetExit code: 1 Err: Loading error /export/users.2/cc/cc-suites/build/checkouts/snapshot/hdk/jdk/jre/bin/default/libgc_gen_uncomp.so: undefined symbol: _Z23free_set_pool_put_entryP12Vector_BlockP11GC_Metadata
GC library cannot be loaded: libgc_gen_uncomp.so
HMYEXEL062E Internal VM error: Failed to create Java VM
FAILED to invoke JVM.
Test: Client mode JIT (default)Class: gc.MultiThreads_jitExit code: 1 Err: Loading error /export/users.2/cc/cc-suites/build/checkouts/snapshot/hdk/jdk/jre/bin/default/libgc_gen_uncomp.so: undefined symbol: _Z23free_set_pool_put_entryP12Vector_BlockP11GC_Metadata
GC library cannot be loaded: libgc_gen_uncomp.so
HMYEXEL062E Internal VM error: Failed to create Java VM
FAILED to invoke JVM.
Test: jitrino.OPTClass: gc.MultiThreads_optExit code: 1 Err: Loading error /export/users.2/cc/cc-suites/build/checkouts/snapshot/hdk/jdk/jre/bin/default/libgc_gen_uncomp.so: undefined symbol: _Z23free_set_pool_put_entryP12Vector_BlockP11GC_Metadata
GC library cannot be loaded: libgc_gen_uncomp.so
HMYEXEL062E Internal VM error: Failed to create Java VM
FAILED to invoke JVM.
Test: Server mode JITClass: gc.MultiThreads_srvExit code: 1 Err: Loading error /export/users.2/cc/cc-suites/build/checkouts/snapshot/hdk/jdk/jre/bin/default/libgc_gen_uncomp.so: undefined symbol: _Z23free_set_pool_put_entryP12Vector_BlockP11GC_Metadata
GC library cannot be loaded: libgc_gen_uncomp.so
HMYEXEL062E Internal VM error: Failed to create Java VM
FAILED to invoke JVM.
Test: interpreterClass: gc.NPE_intExit code: 1 Err: Loading error /export/users.2/cc/cc-suites/build/checkouts/snapshot/hdk/jdk/jre/bin/default/libgc_gen_uncomp.so: undefined symbol: _Z23free_set_pool_put_entryP12Vector_BlockP11GC_Metadata
GC library cannot be loaded: libgc_gen_uncomp.so
HMYEXEL062E Internal VM error: Failed to create Java VM
FAILED to invoke JVM.
Test: interpreterClass: gc.PhantomReferenceQueueTest_intExit code: 1 Err: Loading error /export/users.2/cc/cc-suites/build/checkouts/snapshot/hdk/jdk/jre/bin/default/libgc_gen_uncomp.so: undefined symbol: _Z23free_set_pool_put_entryP12Vector_BlockP11GC_Metadata
GC library cannot be loaded: libgc_gen_uncomp.so
HMYEXEL062E Internal VM error: Failed to create Java VM
FAILED to invoke JVM.
Test: jitrino.JETClass: gc.PhantomReferenceQueueTest_jetExit code: 1 Err: Loading error /export/users.2/cc/cc-suites/build/checkouts/snapshot/hdk/jdk/jre/bin/default/libgc_gen_uncomp.so: undefined symbol: _Z23free_set_pool_put_entryP12Vector_BlockP11GC_Metadata
GC library cannot be loaded: libgc_gen_uncomp.so
HMYEXEL062E Internal VM error: Failed to create Java VM
FAILED to invoke JVM.
Test: Client mode JIT (default)Class: gc.PhantomReferenceQueueTest_jitExit code: 1 Err: Loading error /export/users.2/cc/cc-suites/build/checkouts/snapshot/hdk/jdk/jre/bin/default/libgc_gen_uncomp.so: undefined symbol: _Z23free_set_pool_put_entryP12Vector_BlockP11GC_Metadata
GC library cannot be loaded: libgc_gen_uncomp.so
HMYEXEL062E Internal VM error: Failed to create Java VM
FAILED to invoke JVM.
Test: jitrino.OPTClass: gc.PhantomReferenceQueueTest_optExit code: 1 Err: Loading error /export/users.2/cc/cc-suites/build/checkouts/snapshot/hdk/jdk/jre/bin/default/libgc_gen_uncomp.so: undefined symbol: _Z23free_set_pool_put_entryP12Vector_BlockP11GC_Metadata
GC library cannot be loaded: libgc_gen_uncomp.so
HMYEXEL062E Internal VM error: Failed to create Java VM
FAILED to invoke JVM.
Test: Server mode JITClass: gc.PhantomReferenceQueueTest_srvExit code: 1 Err: Loading error /export/users.2/cc/cc-suites/build/checkouts/snapshot/hdk/jdk/jre/bin/default/libgc_gen_uncomp.so: undefined symbol: _Z23free_set_pool_put_entryP12Vector_BlockP11GC_Metadata
GC library cannot be loaded: libgc_gen_uncomp.so
HMYEXEL062E Internal VM error: Failed to create Java VM
FAILED to invoke JVM.
Test: interpreterClass: gc.RefRemove_intExit code: 1 Err: Loading error /export/users.2/cc/cc-suites/build/checkouts/snapshot/hdk/jdk/jre/bin/default/libgc_gen_uncomp.so: undefined symbol: _Z23free_set_pool_put_entryP12Vector_BlockP11GC_Metadata
GC library cannot be loaded: libgc_gen_uncomp.so
HMYEXEL062E Internal VM error: Failed to create Java VM
FAILED to invoke JVM.
Test: jitrino.JETClass: gc.RefRemove_jetExit code: 1 Err: Loading error /export/users.2/cc/cc-suites/build/checkouts/snapshot/hdk/jdk/jre/bin/default/libgc_gen_uncomp.so: undefined symbol: _Z23free_set_pool_put_entryP12Vector_BlockP11GC_Metadata
GC library cannot be loaded: libgc_gen_uncomp.so
HMYEXEL062E Internal VM error: Failed to create Java VM
FAILED to invoke JVM.
Test: Client mode JIT (default)Class: gc.RefRemove_jitExit code: 1 Err: Loading error /export/users.2/cc/cc-suites/build/checkouts/snapshot/hdk/jdk/jre/bin/default/libgc_gen_uncomp.so: undefined symbol: _Z23free_set_pool_put_entryP12Vector_BlockP11GC_Metadata
GC library cannot be loaded: libgc_gen_uncomp.so
HMYEXEL062E Internal VM error: Failed to create Java VM
FAILED to invoke JVM.
Test: jitrino.OPTClass: gc.RefRemove_optExit code: 1 Err: Loading error /export/users.2/cc/cc-suites/build/checkouts/snapshot/hdk/jdk/jre/bin/default/libgc_gen_uncomp.so: undefined symbol: _Z23free_set_pool_put_entryP12Vector_BlockP11GC_Metadata
GC library cannot be loaded: libgc_gen_uncomp.so
HMYEXEL062E Internal VM error: Failed to create Java VM
FAILED to invoke JVM.
Test: Server mode JITClass: gc.RefRemove_srvExit code: 1 Err: Loading error /export/users.2/cc/cc-suites/build/checkouts/snapshot/hdk/jdk/jre/bin/default/libgc_gen_uncomp.so: undefined symbol: _Z23free_set_pool_put_entryP12Vector_BlockP11GC_Metadata
GC library cannot be loaded: libgc_gen_uncomp.so
HMYEXEL062E Internal VM error: Failed to create Java VM
FAILED to invoke JVM.
Test: interpreterClass: gc.RunFinalizersOnExitTest_intExit code: 1 Err: Loading error /export/users.2/cc/cc-suites/build/checkouts/snapshot/hdk/jdk/jre/bin/default/libgc_gen_uncomp.so: undefined symbol: _Z23free_set_pool_put_entryP12Vector_BlockP11GC_Metadata
GC library cannot be loaded: libgc_gen_uncomp.so
HMYEXEL062E Internal VM error: Failed to create Java VM
FAILED to invoke JVM.
Test: jitrino.JETClass: gc.RunFinalizersOnExitTest_jetExit code: 1 Err: Loading error /export/users.2/cc/cc-suites/build/checkouts/snapshot/hdk/jdk/jre/bin/default/libgc_gen_uncomp.so: undefined symbol: _Z23free_set_pool_put_entryP12Vector_BlockP11GC_Metadata
GC library cannot be loaded: libgc_gen_uncomp.so
HMYEXEL062E Internal VM error: Failed to create Java VM
FAILED to invoke JVM.
Test: Client mode JIT (default)Class: gc.RunFinalizersOnExitTest_jitExit code: 1 Err: Loading error /export/users.2/cc/cc-suites/build/checkouts/snapshot/hdk/jdk/jre/bin/default/libgc_gen_uncomp.so: undefined symbol: _Z23free_set_pool_put_entryP12Vector_BlockP11GC_Metadata
GC library cannot be loaded: libgc_gen_uncomp.so
HMYEXEL062E Internal VM error: Failed to create Java VM
FAILED to invoke JVM.
Test: jitrino.OPTClass: gc.RunFinalizersOnExitTest_optExit code: 1 Err: Loading error /export/users.2/cc/cc-suites/build/checkouts/snapshot/hdk/jdk/jre/bin/default/libgc_gen_uncomp.so: undefined symbol: _Z23free_set_pool_put_entryP12Vector_BlockP11GC_Metadata
GC library cannot be loaded: libgc_gen_uncomp.so
HMYEXEL062E Internal VM error: Failed to create Java VM
FAILED to invoke JVM.
Test: Server mode JITClass: gc.RunFinalizersOnExitTest_srvExit code: 1 Err: Loading error /export/users.2/cc/cc-suites/build/checkouts/snapshot/hdk/jdk/jre/bin/default/libgc_gen_uncomp.so: undefined symbol: _Z23free_set_pool_put_entryP12Vector_BlockP11GC_Metadata
GC library cannot be loaded: libgc_gen_uncomp.so
HMYEXEL062E Internal VM error: Failed to create Java VM
FAILED to invoke JVM.
Test: interpreterClass: gc.StressRef_intExit code: 1 Err: Loading error /export/users.2/cc/cc-suites/build/checkouts/snapshot/hdk/jdk/jre/bin/default/libgc_gen_uncomp.so: undefined symbol: _Z23free_set_pool_put_entryP12Vector_BlockP11GC_Metadata
GC library cannot be loaded: libgc_gen_uncomp.so
HMYEXEL062E Internal VM error: Failed to create Java VM
FAILED to invoke JVM.
Test: jitrino.JETClass: gc.StressRef_jetExit code: 1 Err: Loading error /export/users.2/cc/cc-suites/build/checkouts/snapshot/hdk/jdk/jre/bin/default/libgc_gen_uncomp.so: undefined symbol: _Z23free_set_pool_put_entryP12Vector_BlockP11GC_Metadata
GC library cannot be loaded: libgc_gen_uncomp.so
HMYEXEL062E Internal VM error: Failed to create Java VM
FAILED to invoke JVM.
Test: Client mode JIT (default)Class: gc.StressRef_jitExit code: 1 Err: Loading error /export/users.2/cc/cc-suites/build/checkouts/snapshot/hdk/jdk/jre/bin/default/libgc_gen_uncomp.so: undefined symbol: _Z23free_set_pool_put_entryP12Vector_BlockP11GC_Metadata
GC library cannot be loaded: libgc_gen_uncomp.so
HMYEXEL062E Internal VM error: Failed to create Java VM
FAILED to invoke JVM.
Test: jitrino.OPTClass: gc.StressRef_optExit code: 1 Err: Loading error /export/users.2/cc/cc-suites/build/checkouts/snapshot/hdk/jdk/jre/bin/default/libgc_gen_uncomp.so: undefined symbol: _Z23free_set_pool_put_entryP12Vector_BlockP11GC_Metadata
GC library cannot be loaded: libgc_gen_uncomp.so
HMYEXEL062E Internal VM error: Failed to create Java VM
FAILED to invoke JVM.
Test: Server mode JITClass: gc.StressRef_srvExit code: 1 Err: Loading error /export/users.2/cc/cc-suites/build/checkouts/snapshot/hdk/jdk/jre/bin/default/libgc_gen_uncomp.so: undefined symbol: _Z23free_set_pool_put_entryP12Vector_BlockP11GC_Metadata
GC library cannot be loaded: libgc_gen_uncomp.so
HMYEXEL062E Internal VM error: Failed to create Java VM
FAILED to invoke JVM.
Test: interpreterClass: gc.SynchronizedFinalizersTest_intExit code: 1 Err: Loading error /export/users.2/cc/cc-suites/build/checkouts/snapshot/hdk/jdk/jre/bin/default/libgc_gen_uncomp.so: undefined symbol: _Z23free_set_pool_put_entryP12Vector_BlockP11GC_Metadata
GC library cannot be loaded: libgc_gen_uncomp.so
HMYEXEL062E Internal VM error: Failed to create Java VM
FAILED to invoke JVM.
Test: jitrino.JETClass: gc.SynchronizedFinalizersTest_jetExit code: 1 Err: Loading error /export/users.2/cc/cc-suites/build/checkouts/snapshot/hdk/jdk/jre/bin/default/libgc_gen_uncomp.so: undefined symbol: _Z23free_set_pool_put_entryP12Vector_BlockP11GC_Metadata
GC library cannot be loaded: libgc_gen_uncomp.so
HMYEXEL062E Internal VM error: Failed to create Java VM
FAILED to invoke JVM.
Test: Client mode JIT (default)Class: gc.SynchronizedFinalizersTest_jitExit code: 1 Err: Loading error /export/users.2/cc/cc-suites/build/checkouts/snapshot/hdk/jdk/jre/bin/default/libgc_gen_uncomp.so: undefined symbol: _Z23free_set_pool_put_entryP12Vector_BlockP11GC_Metadata
GC library cannot be loaded: libgc_gen_uncomp.so
HMYEXEL062E Internal VM error: Failed to create Java VM
FAILED to invoke JVM.
Test: jitrino.OPTClass: gc.SynchronizedFinalizersTest_optExit code: 1 Err: Loading error /export/users.2/cc/cc-suites/build/checkouts/snapshot/hdk/jdk/jre/bin/default/libgc_gen_uncomp.so: undefined symbol: _Z23free_set_pool_put_entryP12Vector_BlockP11GC_Metadata
GC library cannot be loaded: libgc_gen_uncomp.so
HMYEXEL062E Internal VM error: Failed to create Java VM
FAILED to invoke JVM.
Test: Server mode JITClass: gc.SynchronizedFinalizersTest_srvExit code: 1 Err: Loading error /export/users.2/cc/cc-suites/build/checkouts/snapshot/hdk/jdk/jre/bin/default/libgc_gen_uncomp.so: undefined symbol: _Z23free_set_pool_put_entryP12Vector_BlockP11GC_Metadata
GC library cannot be loaded: libgc_gen_uncomp.so
HMYEXEL062E Internal VM error: Failed to create Java VM
FAILED to invoke JVM.
Test: interpreterClass: gc.ThreadSuspension_intExit code: 1 Err: Loading error /export/users.2/cc/cc-suites/build/checkouts/snapshot/hdk/jdk/jre/bin/default/libgc_gen_uncomp.so: undefined symbol: _Z23free_set_pool_put_entryP12Vector_BlockP11GC_Metadata
GC library cannot be loaded: libgc_gen_uncomp.so
HMYEXEL062E Internal VM error: Failed to create Java VM
FAILED to invoke JVM.
Test: jitrino.JETClass: gc.ThreadSuspension_jetExit code: 1 Err: Loading error /export/users.2/cc/cc-suites/build/checkouts/snapshot/hdk/jdk/jre/bin/default/libgc_gen_uncomp.so: undefined symbol: _Z23free_set_pool_put_entryP12Vector_BlockP11GC_Metadata
GC library cannot be loaded: libgc_gen_uncomp.so
HMYEXEL062E Internal VM error: Failed to create Java VM
FAILED to invoke JVM.
Test: Client mode JIT (default)Class: gc.ThreadSuspension_jitExit code: 1 Err: Loading error /export/users.2/cc/cc-suites/build/checkouts/snapshot/hdk/jdk/jre/bin/default/libgc_gen_uncomp.so: undefined symbol: _Z23free_set_pool_put_entryP12Vector_BlockP11GC_Metadata
GC library cannot be loaded: libgc_gen_uncomp.so
HMYEXEL062E Internal VM error: Failed to create Java VM
FAILED to invoke JVM.
Test: jitrino.OPTClass: gc.ThreadSuspension_optExit code: 1 Err: Loading error /export/users.2/cc/cc-suites/build/checkouts/snapshot/hdk/jdk/jre/bin/default/libgc_gen_uncomp.so: undefined symbol: _Z23free_set_pool_put_entryP12Vector_BlockP11GC_Metadata
GC library cannot be loaded: libgc_gen_uncomp.so
HMYEXEL062E Internal VM error: Failed to create Java VM
FAILED to invoke JVM.
Test: Server mode JITClass: gc.ThreadSuspension_srvExit code: 1 Err: Loading error /export/users.2/cc/cc-suites/build/checkouts/snapshot/hdk/jdk/jre/bin/default/libgc_gen_uncomp.so: undefined symbol: _Z23free_set_pool_put_entryP12Vector_BlockP11GC_Metadata
GC library cannot be loaded: libgc_gen_uncomp.so
HMYEXEL062E Internal VM error: Failed to create Java VM
FAILED to invoke JVM.
Test: interpreterClass: init.ErrorInInitializer_intExit code: 1 Err: Loading error /export/users.2/cc/cc-suites/build/checkouts/snapshot/hdk/jdk/jre/bin/default/libgc_gen_uncomp.so: undefined symbol: _Z23free_set_pool_put_entryP12Vector_BlockP11GC_Metadata
GC library cannot be loaded: libgc_gen_uncomp.so
HMYEXEL062E Internal VM error: Failed to create Java VM
FAILED to invoke JVM.
Test: jitrino.JETClass: init.ErrorInInitializer_jetExit code: 1 Err: Loading error /export/users.2/cc/cc-suites/build/checkouts/snapshot/hdk/jdk/jre/bin/default/libgc_gen_uncomp.so: undefined symbol: _Z23free_set_pool_put_entryP12Vector_BlockP11GC_Metadata
GC library cannot be loaded: libgc_gen_uncomp.so
HMYEXEL062E Internal VM error: Failed to create Java VM
FAILED to invoke JVM.
Test: Client mode JIT (default)Class: init.ErrorInInitializer_jitExit code: 1 Err: Loading error /export/users.2/cc/cc-suites/build/checkouts/snapshot/hdk/jdk/jre/bin/default/libgc_gen_uncomp.so: undefined symbol: _Z23free_set_pool_put_entryP12Vector_BlockP11GC_Metadata
GC library cannot be loaded: libgc_gen_uncomp.so
HMYEXEL062E Internal VM error: Failed to create Java VM
FAILED to invoke JVM.
Test: jitrino.OPTClass: init.ErrorInInitializer_optExit code: 1 Err: Loading error /export/users.2/cc/cc-suites/build/checkouts/snapshot/hdk/jdk/jre/bin/default/libgc_gen_uncomp.so: undefined symbol: _Z23free_set_pool_put_entryP12Vector_BlockP11GC_Metadata
GC library cannot be loaded: libgc_gen_uncomp.so
HMYEXEL062E Internal VM error: Failed to create Java VM
FAILED to invoke JVM.
Test: Server mode JITClass: init.ErrorInInitializer_srvExit code: 1 Err: Loading error /export/users.2/cc/cc-suites/build/checkouts/snapshot/hdk/jdk/jre/bin/default/libgc_gen_uncomp.so: undefined symbol: _Z23free_set_pool_put_entryP12Vector_BlockP11GC_Metadata
GC library cannot be loaded: libgc_gen_uncomp.so
HMYEXEL062E Internal VM error: Failed to create Java VM
FAILED to invoke JVM.
Test: interpreterClass: init.Other_intExit code: 1 Err: Loading error /export/users.2/cc/cc-suites/build/checkouts/snapshot/hdk/jdk/jre/bin/default/libgc_gen_uncomp.so: undefined symbol: _Z23free_set_pool_put_entryP12Vector_BlockP11GC_Metadata
GC library cannot be loaded: libgc_gen_uncomp.so
HMYEXEL062E Internal VM error: Failed to create Java VM
FAILED to invoke JVM.
Test: jitrino.JETClass: init.Other_jetExit code: 1 Err: Loading error /export/users.2/cc/cc-suites/build/checkouts/snapshot/hdk/jdk/jre/bin/default/libgc_gen_uncomp.so: undefined symbol: _Z23free_set_pool_put_entryP12Vector_BlockP11GC_Metadata
GC library cannot be loaded: libgc_gen_uncomp.so
HMYEXEL062E Internal VM error: Failed to create Java VM
FAILED to invoke JVM.
Test: Client mode JIT (default)Class: init.Other_jitExit code: 1 Err: Loading error /export/users.2/cc/cc-suites/build/checkouts/snapshot/hdk/jdk/jre/bin/default/libgc_gen_uncomp.so: undefined symbol: _Z23free_set_pool_put_entryP12Vector_BlockP11GC_Metadata
GC library cannot be loaded: libgc_gen_uncomp.so
HMYEXEL062E Internal VM error: Failed to create Java VM
FAILED to invoke JVM.
Test: jitrino.OPTClass: init.Other_optExit code: 1 Err: Loading error /export/users.2/cc/cc-suites/build/checkouts/snapshot/hdk/jdk/jre/bin/default/libgc_gen_uncomp.so: undefined symbol: _Z23free_set_pool_put_entryP12Vector_BlockP11GC_Metadata
GC library cannot be loaded: libgc_gen_uncomp.so
HMYEXEL062E Internal VM error: Failed to create Java VM
FAILED to invoke JVM.
Test: Server mode JITClass: init.Other_srvExit code: 1 Err: Loading error /export/users.2/cc/cc-suites/build/checkouts/snapshot/hdk/jdk/jre/bin/default/libgc_gen_uncomp.so: undefined symbol: _Z23free_set_pool_put_entryP12Vector_BlockP11GC_Metadata
GC library cannot be loaded: libgc_gen_uncomp.so
HMYEXEL062E Internal VM error: Failed to create Java VM
FAILED to invoke JVM.
Test: interpreterClass: io.ArrayList_intExit code: 1 Err: Loading error /export/users.2/cc/cc-suites/build/checkouts/snapshot/hdk/jdk/jre/bin/default/libgc_gen_uncomp.so: undefined symbol: _Z23free_set_pool_put_entryP12Vector_BlockP11GC_Metadata
GC library cannot be loaded: libgc_gen_uncomp.so
HMYEXEL062E Internal VM error: Failed to create Java VM
FAILED to invoke JVM.
Test: jitrino.JETClass: io.ArrayList_jetExit code: 1 Err: Loading error /export/users.2/cc/cc-suites/build/checkouts/snapshot/hdk/jdk/jre/bin/default/libgc_gen_uncomp.so: undefined symbol: _Z23free_set_pool_put_entryP12Vector_BlockP11GC_Metadata
GC library cannot be loaded: libgc_gen_uncomp.so
HMYEXEL062E Internal VM error: Failed to create Java VM
FAILED to invoke JVM.
Test: Client mode JIT (default)Class: io.ArrayList_jitExit code: 1 Err: Loading error /export/users.2/cc/cc-suites/build/checkouts/snapshot/hdk/jdk/jre/bin/default/libgc_gen_uncomp.so: undefined symbol: _Z23free_set_pool_put_entryP12Vector_BlockP11GC_Metadata
GC library cannot be loaded: libgc_gen_uncomp.so
HMYEXEL062E Internal VM error: Failed to create Java VM
FAILED to invoke JVM.
Test: jitrino.OPTClass: io.ArrayList_optExit code: 1 Err: Loading error /export/users.2/cc/cc-suites/build/checkouts/snapshot/hdk/jdk/jre/bin/default/libgc_gen_uncomp.so: undefined symbol: _Z23free_set_pool_put_entryP12Vector_BlockP11GC_Metadata
GC library cannot be loaded: libgc_gen_uncomp.so
HMYEXEL062E Internal VM error: Failed to create Java VM
FAILED to invoke JVM.
Test: Server mode JITClass: io.ArrayList_srvExit code: 1 Err: Loading error /export/users.2/cc/cc-suites/build/checkouts/snapshot/hdk/jdk/jre/bin/default/libgc_gen_uncomp.so: undefined symbol: _Z23free_set_pool_put_entryP12Vector_BlockP11GC_Metadata
GC library cannot be loaded: libgc_gen_uncomp.so
HMYEXEL062E Internal VM error: Failed to create Java VM
FAILED to invoke JVM.
Test: jitrino.JETClass: io.Integers_jetExit code: 1 Err: Loading error /export/users.2/cc/cc-suites/build/checkouts/snapshot/hdk/jdk/jre/bin/default/libgc_gen_uncomp.so: undefined symbol: _Z23free_set_pool_put_entryP12Vector_BlockP11GC_Metadata
GC library cannot be loaded: libgc_gen_uncomp.so
HMYEXEL062E Internal VM error: Failed to create Java VM
FAILED to invoke JVM.
Test: Client mode JIT (default)Class: io.Integers_jitExit code: 1 Err: Loading error /export/users.2/cc/cc-suites/build/checkouts/snapshot/hdk/jdk/jre/bin/default/libgc_gen_uncomp.so: undefined symbol: _Z23free_set_pool_put_entryP12Vector_BlockP11GC_Metadata
GC library cannot be loaded: libgc_gen_uncomp.so
HMYEXEL062E Internal VM error: Failed to create Java VM
FAILED to invoke JVM.
Test: jitrino.OPTClass: io.Integers_optExit code: 1 Err: Loading error /export/users.2/cc/cc-suites/build/checkouts/snapshot/hdk/jdk/jre/bin/default/libgc_gen_uncomp.so: undefined symbol: _Z23free_set_pool_put_entryP12Vector_BlockP11GC_Metadata
GC library cannot be loaded: libgc_gen_uncomp.so
HMYEXEL062E Internal VM error: Failed to create Java VM
FAILED to invoke JVM.
Test: Server mode JITClass: io.Integers_srvExit code: 1 Err: Loading error /export/users.2/cc/cc-suites/build/checkouts/snapshot/hdk/jdk/jre/bin/default/libgc_gen_uncomp.so: undefined symbol: _Z23free_set_pool_put_entryP12Vector_BlockP11GC_Metadata
GC library cannot be loaded: libgc_gen_uncomp.so
HMYEXEL062E Internal VM error: Failed to create Java VM
FAILED to invoke JVM.
Test: interpreterClass: jni.LoadLibrary_intExit code: 1 Err: Loading error /export/users.2/cc/cc-suites/build/checkouts/snapshot/hdk/jdk/jre/bin/default/libgc_gen_uncomp.so: undefined symbol: _Z23free_set_pool_put_entryP12Vector_BlockP11GC_Metadata
GC library cannot be loaded: libgc_gen_uncomp.so
HMYEXEL062E Internal VM error: Failed to create Java VM
FAILED to invoke JVM.
Test: jitrino.JETClass: jni.LoadLibrary_jetExit code: 1 Err: Loading error /export/users.2/cc/cc-suites/build/checkouts/snapshot/hdk/jdk/jre/bin/default/libgc_gen_uncomp.so: undefined symbol: _Z23free_set_pool_put_entryP12Vector_BlockP11GC_Metadata
GC library cannot be loaded: libgc_gen_uncomp.so
HMYEXEL062E Internal VM error: Failed to create Java VM
FAILED to invoke JVM.
Test: Client mode JIT (default)Class: jni.LoadLibrary_jitExit code: 1 Err: Loading error /export/users.2/cc/cc-suites/build/checkouts/snapshot/hdk/jdk/jre/bin/default/libgc_gen_uncomp.so: undefined symbol: _Z23free_set_pool_put_entryP12Vector_BlockP11GC_Metadata
GC library cannot be loaded: libgc_gen_uncomp.so
HMYEXEL062E Internal VM error: Failed to create Java VM
FAILED to invoke JVM.
Test: jitrino.OPTClass: jni.LoadLibrary_optExit code: 1 Err: Loading error /export/users.2/cc/cc-suites/build/checkouts/snapshot/hdk/jdk/jre/bin/default/libgc_gen_uncomp.so: undefined symbol: _Z23free_set_pool_put_entryP12Vector_BlockP11GC_Metadata
GC library cannot be loaded: libgc_gen_uncomp.so
HMYEXEL062E Internal VM error: Failed to create Java VM
FAILED to invoke JVM.
Test: Server mode JITClass: jni.LoadLibrary_srvExit code: 1 Err: Loading error /export/users.2/cc/cc-suites/build/checkouts/snapshot/hdk/jdk/jre/bin/default/libgc_gen_uncomp.so: undefined symbol: _Z23free_set_pool_put_entryP12Vector_BlockP11GC_Metadata
GC library cannot be loaded: libgc_gen_uncomp.so
HMYEXEL062E Internal VM error: Failed to create Java VM
FAILED to invoke JVM.
Test: interpreterClass: outofmemory.Double_intExit code: 1 Err: Loading error /export/users.2/cc/cc-suites/build/checkouts/snapshot/hdk/jdk/jre/bin/default/libgc_gen_uncomp.so: undefined symbol: _Z23free_set_pool_put_entryP12Vector_BlockP11GC_Metadata
GC library cannot be loaded: libgc_gen_uncomp.so
HMYEXEL062E Internal VM error: Failed to create Java VM
FAILED to invoke JVM.
Test: jitrino.JETClass: outofmemory.Double_jetExit code: 1 Err: Loading error /export/users.2/cc/cc-suites/build/checkouts/snapshot/hdk/jdk/jre/bin/default/libgc_gen_uncomp.so: undefined symbol: _Z23free_set_pool_put_entryP12Vector_BlockP11GC_Metadata
GC library cannot be loaded: libgc_gen_uncomp.so
HMYEXEL062E Internal VM error: Failed to create Java VM
FAILED to invoke JVM.
Test: Client mode JIT (default)Class: outofmemory.Double_jitExit code: 1 Err: Loading error /export/users.2/cc/cc-suites/build/checkouts/snapshot/hdk/jdk/jre/bin/default/libgc_gen_uncomp.so: undefined symbol: _Z23free_set_pool_put_entryP12Vector_BlockP11GC_Metadata
GC library cannot be loaded: libgc_gen_uncomp.so
HMYEXEL062E Internal VM error: Failed to create Java VM
FAILED to invoke JVM.
Test: jitrino.OPTClass: outofmemory.Double_optExit code: 1 Err: Loading error /export/users.2/cc/cc-suites/build/checkouts/snapshot/hdk/jdk/jre/bin/default/libgc_gen_uncomp.so: undefined symbol: _Z23free_set_pool_put_entryP12Vector_BlockP11GC_Metadata
GC library cannot be loaded: libgc_gen_uncomp.so
HMYEXEL062E Internal VM error: Failed to create Java VM
FAILED to invoke JVM.
Test: Server mode JITClass: outofmemory.Double_srvExit code: 1 Err: Loading error /export/users.2/cc/cc-suites/build/checkouts/snapshot/hdk/jdk/jre/bin/default/libgc_gen_uncomp.so: undefined symbol: _Z23free_set_pool_put_entryP12Vector_BlockP11GC_Metadata
GC library cannot be loaded: libgc_gen_uncomp.so
HMYEXEL062E Internal VM error: Failed to create Java VM
FAILED to invoke JVM.
Test: interpreterClass: outofmemory.Int_intExit code: 1 Err: Loading error /export/users.2/cc/cc-suites/build/checkouts/snapshot/hdk/jdk/jre/bin/default/libgc_gen_uncomp.so: undefined symbol: _Z23free_set_pool_put_entryP12Vector_BlockP11GC_Metadata
GC library cannot be loaded: libgc_gen_uncomp.so
HMYEXEL062E Internal VM error: Failed to create Java VM
FAILED to invoke JVM.
Test: jitrino.JETClass: outofmemory.Int_jetExit code: 1 Err: Loading error /export/users.2/cc/cc-suites/build/checkouts/snapshot/hdk/jdk/jre/bin/default/libgc_gen_uncomp.so: undefined symbol: _Z23free_set_pool_put_entryP12Vector_BlockP11GC_Metadata
GC library cannot be loaded: libgc_gen_uncomp.so
HMYEXEL062E Internal VM error: Failed to create Java VM
FAILED to invoke JVM.
Test: Client mode JIT (default)Class: outofmemory.Int_jitExit code: 1 Err: Loading error /export/users.2/cc/cc-suites/build/checkouts/snapshot/hdk/jdk/jre/bin/default/libgc_gen_uncomp.so: undefined symbol: _Z23free_set_pool_put_entryP12Vector_BlockP11GC_Metadata
GC library cannot be loaded: libgc_gen_uncomp.so
HMYEXEL062E Internal VM error: Failed to create Java VM
FAILED to invoke JVM.
Test: jitrino.OPTClass: outofmemory.Int_optExit code: 1 Err: Loading error /export/users.2/cc/cc-suites/build/checkouts/snapshot/hdk/jdk/jre/bin/default/libgc_gen_uncomp.so: undefined symbol: _Z23free_set_pool_put_entryP12Vector_BlockP11GC_Metadata
GC library cannot be loaded: libgc_gen_uncomp.so
HMYEXEL062E Internal VM error: Failed to create Java VM
FAILED to invoke JVM.
Test: Server mode JITClass: outofmemory.Int_srvExit code: 1 Err: Loading error /export/users.2/cc/cc-suites/build/checkouts/snapshot/hdk/jdk/jre/bin/default/libgc_gen_uncomp.so: undefined symbol: _Z23free_set_pool_put_entryP12Vector_BlockP11GC_Metadata
GC library cannot be loaded: libgc_gen_uncomp.so
HMYEXEL062E Internal VM error: Failed to create Java VM
FAILED to invoke JVM.
Test: interpreterClass: outofmemory.Plain_intExit code: 1 Err: Loading error /export/users.2/cc/cc-suites/build/checkouts/snapshot/hdk/jdk/jre/bin/default/libgc_gen_uncomp.so: undefined symbol: _Z23free_set_pool_put_entryP12Vector_BlockP11GC_Metadata
GC library cannot be loaded: libgc_gen_uncomp.so
HMYEXEL062E Internal VM error: Failed to create Java VM
FAILED to invoke JVM.
Test: jitrino.JETClass: outofmemory.Plain_jetExit code: 1 Err: Loading error /export/users.2/cc/cc-suites/build/checkouts/snapshot/hdk/jdk/jre/bin/default/libgc_gen_uncomp.so: undefined symbol: _Z23free_set_pool_put_entryP12Vector_BlockP11GC_Metadata
GC library cannot be loaded: libgc_gen_uncomp.so
HMYEXEL062E Internal VM error: Failed to create Java VM
FAILED to invoke JVM.
Test: Client mode JIT (default)Class: outofmemory.Plain_jitExit code: 1 Err: Loading error /export/users.2/cc/cc-suites/build/checkouts/snapshot/hdk/jdk/jre/bin/default/libgc_gen_uncomp.so: undefined symbol: _Z23free_set_pool_put_entryP12Vector_BlockP11GC_Metadata
GC library cannot be loaded: libgc_gen_uncomp.so
HMYEXEL062E Internal VM error: Failed to create Java VM
FAILED to invoke JVM.
Test: jitrino.OPTClass: outofmemory.Plain_optExit code: 1 Err: Loading error /export/users.2/cc/cc-suites/build/checkouts/snapshot/hdk/jdk/jre/bin/default/libgc_gen_uncomp.so: undefined symbol: _Z23free_set_pool_put_entryP12Vector_BlockP11GC_Metadata
GC library cannot be loaded: libgc_gen_uncomp.so
HMYEXEL062E Internal VM error: Failed to create Java VM
FAILED to invoke JVM.
Test: Server mode JITClass: outofmemory.Plain_srvExit code: 1 Err: Loading error /export/users.2/cc/cc-suites/build/checkouts/snapshot/hdk/jdk/jre/bin/default/libgc_gen_uncomp.so: undefined symbol: _Z23free_set_pool_put_entryP12Vector_BlockP11GC_Metadata
GC library cannot be loaded: libgc_gen_uncomp.so
HMYEXEL062E Internal VM error: Failed to create Java VM
FAILED to invoke JVM.
Test: interpreterClass: outofmemory.Ref_intExit code: 1 Err: Loading error /export/users.2/cc/cc-suites/build/checkouts/snapshot/hdk/jdk/jre/bin/default/libgc_gen_uncomp.so: undefined symbol: _Z23free_set_pool_put_entryP12Vector_BlockP11GC_Metadata
GC library cannot be loaded: libgc_gen_uncomp.so
HMYEXEL062E Internal VM error: Failed to create Java VM
FAILED to invoke JVM.
Test: jitrino.JETClass: outofmemory.Ref_jetExit code: 1 Err: Loading error /export/users.2/cc/cc-suites/build/checkouts/snapshot/hdk/jdk/jre/bin/default/libgc_gen_uncomp.so: undefined symbol: _Z23free_set_pool_put_entryP12Vector_BlockP11GC_Metadata
GC library cannot be loaded: libgc_gen_uncomp.so
HMYEXEL062E Internal VM error: Failed to create Java VM
FAILED to invoke JVM.
Test: Client mode JIT (default)Class: outofmemory.Ref_jitExit code: 1 Err: Loading error /export/users.2/cc/cc-suites/build/checkouts/snapshot/hdk/jdk/jre/bin/default/libgc_gen_uncomp.so: undefined symbol: _Z23free_set_pool_put_entryP12Vector_BlockP11GC_Metadata
GC library cannot be loaded: libgc_gen_uncomp.so
HMYEXEL062E Internal VM error: Failed to create Java VM
FAILED to invoke JVM.
Test: jitrino.OPTClass: outofmemory.Ref_optExit code: 1 Err: Loading error /export/users.2/cc/cc-suites/build/checkouts/snapshot/hdk/jdk/jre/bin/default/libgc_gen_uncomp.so: undefined symbol: _Z23free_set_pool_put_entryP12Vector_BlockP11GC_Metadata
GC library cannot be loaded: libgc_gen_uncomp.so
HMYEXEL062E Internal VM error: Failed to create Java VM
FAILED to invoke JVM.
Test: Server mode JITClass: outofmemory.Ref_srvExit code: 1 Err: Loading error /export/users.2/cc/cc-suites/build/checkouts/snapshot/hdk/jdk/jre/bin/default/libgc_gen_uncomp.so: undefined symbol: _Z23free_set_pool_put_entryP12Vector_BlockP11GC_Metadata
GC library cannot be loaded: libgc_gen_uncomp.so
HMYEXEL062E Internal VM error: Failed to create Java VM
FAILED to invoke JVM.
Test: interpreterClass: outofmemory.Throw_intExit code: 1 Err: Loading error /export/users.2/cc/cc-suites/build/checkouts/snapshot/hdk/jdk/jre/bin/default/libgc_gen_uncomp.so: undefined symbol: _Z23free_set_pool_put_entryP12Vector_BlockP11GC_Metadata
GC library cannot be loaded: libgc_gen_uncomp.so
HMYEXEL062E Internal VM error: Failed to create Java VM
FAILED to invoke JVM.
Test: jitrino.JETClass: outofmemory.Throw_jetExit code: 1 Err: Loading error /export/users.2/cc/cc-suites/build/checkouts/snapshot/hdk/jdk/jre/bin/default/libgc_gen_uncomp.so: undefined symbol: _Z23free_set_pool_put_entryP12Vector_BlockP11GC_Metadata
GC library cannot be loaded: libgc_gen_uncomp.so
HMYEXEL062E Internal VM error: Failed to create Java VM
FAILED to invoke JVM.
Test: Client mode JIT (default)Class: outofmemory.Throw_jitExit code: 1 Err: Loading error /export/users.2/cc/cc-suites/build/checkouts/snapshot/hdk/jdk/jre/bin/default/libgc_gen_uncomp.so: undefined symbol: _Z23free_set_pool_put_entryP12Vector_BlockP11GC_Metadata
GC library cannot be loaded: libgc_gen_uncomp.so
HMYEXEL062E Internal VM error: Failed to create Java VM
FAILED to invoke JVM.
Test: jitrino.OPTClass: outofmemory.Throw_optExit code: 1 Err: Loading error /export/users.2/cc/cc-suites/build/checkouts/snapshot/hdk/jdk/jre/bin/default/libgc_gen_uncomp.so: undefined symbol: _Z23free_set_pool_put_entryP12Vector_BlockP11GC_Metadata
GC library cannot be loaded: libgc_gen_uncomp.so
HMYEXEL062E Internal VM error: Failed to create Java VM
FAILED to invoke JVM.
Test: Server mode JITClass: outofmemory.Throw_srvExit code: 1 Err: Loading error /export/users.2/cc/cc-suites/build/checkouts/snapshot/hdk/jdk/jre/bin/default/libgc_gen_uncomp.so: undefined symbol: _Z23free_set_pool_put_entryP12Vector_BlockP11GC_Metadata
GC library cannot be loaded: libgc_gen_uncomp.so
HMYEXEL062E Internal VM error: Failed to create Java VM
FAILED to invoke JVM.
Test: interpreterClass: outofmemory.VectorDouble_intExit code: 1 Err: Loading error /export/users.2/cc/cc-suites/build/checkouts/snapshot/hdk/jdk/jre/bin/default/libgc_gen_uncomp.so: undefined symbol: _Z23free_set_pool_put_entryP12Vector_BlockP11GC_Metadata
GC library cannot be loaded: libgc_gen_uncomp.so
HMYEXEL062E Internal VM error: Failed to create Java VM
FAILED to invoke JVM.
Test: jitrino.JETClass: outofmemory.VectorDouble_jetExit code: 1 Err: Loading error /export/users.2/cc/cc-suites/build/checkouts/snapshot/hdk/jdk/jre/bin/default/libgc_gen_uncomp.so: undefined symbol: _Z23free_set_pool_put_entryP12Vector_BlockP11GC_Metadata
GC library cannot be loaded: libgc_gen_uncomp.so
HMYEXEL062E Internal VM error: Failed to create Java VM
FAILED to invoke JVM.
Test: Client mode JIT (default)Class: outofmemory.VectorDouble_jitExit code: 1 Err: Loading error /export/users.2/cc/cc-suites/build/checkouts/snapshot/hdk/jdk/jre/bin/default/libgc_gen_uncomp.so: undefined symbol: _Z23free_set_pool_put_entryP12Vector_BlockP11GC_Metadata
GC library cannot be loaded: libgc_gen_uncomp.so
HMYEXEL062E Internal VM error: Failed to create Java VM
FAILED to invoke JVM.
Test: jitrino.OPTClass: outofmemory.VectorDouble_optExit code: 1 Err: Loading error /export/users.2/cc/cc-suites/build/checkouts/snapshot/hdk/jdk/jre/bin/default/libgc_gen_uncomp.so: undefined symbol: _Z23free_set_pool_put_entryP12Vector_BlockP11GC_Metadata
GC library cannot be loaded: libgc_gen_uncomp.so
HMYEXEL062E Internal VM error: Failed to create Java VM
FAILED to invoke JVM.
Test: Server mode JITClass: outofmemory.VectorDouble_srvExit code: 1 Err: Loading error /export/users.2/cc/cc-suites/build/checkouts/snapshot/hdk/jdk/jre/bin/default/libgc_gen_uncomp.so: undefined symbol: _Z23free_set_pool_put_entryP12Vector_BlockP11GC_Metadata
GC library cannot be loaded: libgc_gen_uncomp.so
HMYEXEL062E Internal VM error: Failed to create Java VM
FAILED to invoke JVM.
Test: interpreterClass: outofmemory.VectorInt_intExit code: 1 Err: Loading error /export/users.2/cc/cc-suites/build/checkouts/snapshot/hdk/jdk/jre/bin/default/libgc_gen_uncomp.so: undefined symbol: _Z23free_set_pool_put_entryP12Vector_BlockP11GC_Metadata
GC library cannot be loaded: libgc_gen_uncomp.so
HMYEXEL062E Internal VM error: Failed to create Java VM
FAILED to invoke JVM.
Test: jitrino.JETClass: outofmemory.VectorInt_jetExit code: 1 Err: Loading error /export/users.2/cc/cc-suites/build/checkouts/snapshot/hdk/jdk/jre/bin/default/libgc_gen_uncomp.so: undefined symbol: _Z23free_set_pool_put_entryP12Vector_BlockP11GC_Metadata
GC library cannot be loaded: libgc_gen_uncomp.so
HMYEXEL062E Internal VM error: Failed to create Java VM
FAILED to invoke JVM.
Test: Client mode JIT (default)Class: outofmemory.VectorInt_jitExit code: 1 Err: Loading error /export/users.2/cc/cc-suites/build/checkouts/snapshot/hdk/jdk/jre/bin/default/libgc_gen_uncomp.so: undefined symbol: _Z23free_set_pool_put_entryP12Vector_BlockP11GC_Metadata
GC library cannot be loaded: libgc_gen_uncomp.so
HMYEXEL062E Internal VM error: Failed to create Java VM
FAILED to invoke JVM.
Test: jitrino.OPTClass: outofmemory.VectorInt_optExit code: 1 Err: Loading error /export/users.2/cc/cc-suites/build/checkouts/snapshot/hdk/jdk/jre/bin/default/libgc_gen_uncomp.so: undefined symbol: _Z23free_set_pool_put_entryP12Vector_BlockP11GC_Metadata
GC library cannot be loaded: libgc_gen_uncomp.so
HMYEXEL062E Internal VM error: Failed to create Java VM
FAILED to invoke JVM.
Test: Server mode JITClass: outofmemory.VectorInt_srvExit code: 1 Err: Loading error /export/users.2/cc/cc-suites/build/checkouts/snapshot/hdk/jdk/jre/bin/default/libgc_gen_uncomp.so: undefined symbol: _Z23free_set_pool_put_entryP12Vector_BlockP11GC_Metadata
GC library cannot be loaded: libgc_gen_uncomp.so
HMYEXEL062E Internal VM error: Failed to create Java VM
FAILED to invoke JVM.
Test: interpreterClass: outofmemory.VectorRef_intExit code: 1 Err: Loading error /export/users.2/cc/cc-suites/build/checkouts/snapshot/hdk/jdk/jre/bin/default/libgc_gen_uncomp.so: undefined symbol: _Z23free_set_pool_put_entryP12Vector_BlockP11GC_Metadata
GC library cannot be loaded: libgc_gen_uncomp.so
HMYEXEL062E Internal VM error: Failed to create Java VM
FAILED to invoke JVM.
Test: jitrino.JETClass: outofmemory.VectorRef_jetExit code: 1 Err: Loading error /export/users.2/cc/cc-suites/build/checkouts/snapshot/hdk/jdk/jre/bin/default/libgc_gen_uncomp.so: undefined symbol: _Z23free_set_pool_put_entryP12Vector_BlockP11GC_Metadata
GC library cannot be loaded: libgc_gen_uncomp.so
HMYEXEL062E Internal VM error: Failed to create Java VM
FAILED to invoke JVM.
Test: Client mode JIT (default)Class: outofmemory.VectorRef_jitExit code: 1 Err: Loading error /export/users.2/cc/cc-suites/build/checkouts/snapshot/hdk/jdk/jre/bin/default/libgc_gen_uncomp.so: undefined symbol: _Z23free_set_pool_put_entryP12Vector_BlockP11GC_Metadata
GC library cannot be loaded: libgc_gen_uncomp.so
HMYEXEL062E Internal VM error: Failed to create Java VM
FAILED to invoke JVM.
Test: jitrino.OPTClass: outofmemory.VectorRef_optExit code: 1 Err: Loading error /export/users.2/cc/cc-suites/build/checkouts/snapshot/hdk/jdk/jre/bin/default/libgc_gen_uncomp.so: undefined symbol: _Z23free_set_pool_put_entryP12Vector_BlockP11GC_Metadata
GC library cannot be loaded: libgc_gen_uncomp.so
HMYEXEL062E Internal VM error: Failed to create Java VM
FAILED to invoke JVM.
Test: Server mode JITClass: outofmemory.VectorRef_srvExit code: 1 Err: Loading error /export/users.2/cc/cc-suites/build/checkouts/snapshot/hdk/jdk/jre/bin/default/libgc_gen_uncomp.so: undefined symbol: _Z23free_set_pool_put_entryP12Vector_BlockP11GC_Metadata
GC library cannot be loaded: libgc_gen_uncomp.so
HMYEXEL062E Internal VM error: Failed to create Java VM
FAILED to invoke JVM.
Test: interpreterClass: outofmemory.Vector_intExit code: 1 Err: Loading error /export/users.2/cc/cc-suites/build/checkouts/snapshot/hdk/jdk/jre/bin/default/libgc_gen_uncomp.so: undefined symbol: _Z23free_set_pool_put_entryP12Vector_BlockP11GC_Metadata
GC library cannot be loaded: libgc_gen_uncomp.so
HMYEXEL062E Internal VM error: Failed to create Java VM
FAILED to invoke JVM.
Test: jitrino.JETClass: outofmemory.Vector_jetExit code: 1 Err: Loading error /export/users.2/cc/cc-suites/build/checkouts/snapshot/hdk/jdk/jre/bin/default/libgc_gen_uncomp.so: undefined symbol: _Z23free_set_pool_put_entryP12Vector_BlockP11GC_Metadata
GC library cannot be loaded: libgc_gen_uncomp.so
HMYEXEL062E Internal VM error: Failed to create Java VM
FAILED to invoke JVM.
Test: Client mode JIT (default)Class: outofmemory.Vector_jitExit code: 1 Err: Loading error /export/users.2/cc/cc-suites/build/checkouts/snapshot/hdk/jdk/jre/bin/default/libgc_gen_uncomp.so: undefined symbol: _Z23free_set_pool_put_entryP12Vector_BlockP11GC_Metadata
GC library cannot be loaded: libgc_gen_uncomp.so
HMYEXEL062E Internal VM error: Failed to create Java VM
FAILED to invoke JVM.
Test: jitrino.OPTClass: outofmemory.Vector_optExit code: 1 Err: Loading error /export/users.2/cc/cc-suites/build/checkouts/snapshot/hdk/jdk/jre/bin/default/libgc_gen_uncomp.so: undefined symbol: _Z23free_set_pool_put_entryP12Vector_BlockP11GC_Metadata
GC library cannot be loaded: libgc_gen_uncomp.so
HMYEXEL062E Internal VM error: Failed to create Java VM
FAILED to invoke JVM.
Test: Server mode JITClass: outofmemory.Vector_srvExit code: 1 Err: Loading error /export/users.2/cc/cc-suites/build/checkouts/snapshot/hdk/jdk/jre/bin/default/libgc_gen_uncomp.so: undefined symbol: _Z23free_set_pool_put_entryP12Vector_BlockP11GC_Metadata
GC library cannot be loaded: libgc_gen_uncomp.so
HMYEXEL062E Internal VM error: Failed to create Java VM
FAILED to invoke JVM.
Test: interpreterClass: perf.CreateManyExceptions_depth_intExit code: 1 Err: Loading error /export/users.2/cc/cc-suites/build/checkouts/snapshot/hdk/jdk/jre/bin/default/libgc_gen_uncomp.so: undefined symbol: _Z23free_set_pool_put_entryP12Vector_BlockP11GC_Metadata
GC library cannot be loaded: libgc_gen_uncomp.so
HMYEXEL062E Internal VM error: Failed to create Java VM
FAILED to invoke JVM.
Test: jitrino.JETClass: perf.CreateManyExceptions_depth_jetExit code: 1 Err: Loading error /export/users.2/cc/cc-suites/build/checkouts/snapshot/hdk/jdk/jre/bin/default/libgc_gen_uncomp.so: undefined symbol: _Z23free_set_pool_put_entryP12Vector_BlockP11GC_Metadata
GC library cannot be loaded: libgc_gen_uncomp.so
HMYEXEL062E Internal VM error: Failed to create Java VM
FAILED to invoke JVM.
Test: Client mode JIT (default)Class: perf.CreateManyExceptions_depth_jitExit code: 1 Err: Loading error /export/users.2/cc/cc-suites/build/checkouts/snapshot/hdk/jdk/jre/bin/default/libgc_gen_uncomp.so: undefined symbol: _Z23free_set_pool_put_entryP12Vector_BlockP11GC_Metadata
GC library cannot be loaded: libgc_gen_uncomp.so
HMYEXEL062E Internal VM error: Failed to create Java VM
FAILED to invoke JVM.
Test: jitrino.OPTClass: perf.CreateManyExceptions_depth_optExit code: 1 Err: Loading error /export/users.2/cc/cc-suites/build/checkouts/snapshot/hdk/jdk/jre/bin/default/libgc_gen_uncomp.so: undefined symbol: _Z23free_set_pool_put_entryP12Vector_BlockP11GC_Metadata
GC library cannot be loaded: libgc_gen_uncomp.so
HMYEXEL062E Internal VM error: Failed to create Java VM
FAILED to invoke JVM.
Test: Server mode JITClass: perf.CreateManyExceptions_depth_srvExit code: 1 Err: Loading error /export/users.2/cc/cc-suites/build/checkouts/snapshot/hdk/jdk/jre/bin/default/libgc_gen_uncomp.so: undefined symbol: _Z23free_set_pool_put_entryP12Vector_BlockP11GC_Metadata
GC library cannot be loaded: libgc_gen_uncomp.so
HMYEXEL062E Internal VM error: Failed to create Java VM
FAILED to invoke JVM.
Test: interpreterClass: perf.CreateManyExceptions_intExit code: 1 Err: Loading error /export/users.2/cc/cc-suites/build/checkouts/snapshot/hdk/jdk/jre/bin/default/libgc_gen_uncomp.so: undefined symbol: _Z23free_set_pool_put_entryP12Vector_BlockP11GC_Metadata
GC library cannot be loaded: libgc_gen_uncomp.so
HMYEXEL062E Internal VM error: Failed to create Java VM
FAILED to invoke JVM.
Test: jitrino.JETClass: perf.CreateManyExceptions_jetExit code: 1 Err: Loading error /export/users.2/cc/cc-suites/build/checkouts/snapshot/hdk/jdk/jre/bin/default/libgc_gen_uncomp.so: undefined symbol: _Z23free_set_pool_put_entryP12Vector_BlockP11GC_Metadata
GC library cannot be loaded: libgc_gen_uncomp.so
HMYEXEL062E Internal VM error: Failed to create Java VM
FAILED to invoke JVM.
Test: Client mode JIT (default)Class: perf.CreateManyExceptions_jitExit code: 1 Err: Loading error /export/users.2/cc/cc-suites/build/checkouts/snapshot/hdk/jdk/jre/bin/default/libgc_gen_uncomp.so: undefined symbol: _Z23free_set_pool_put_entryP12Vector_BlockP11GC_Metadata
GC library cannot be loaded: libgc_gen_uncomp.so
HMYEXEL062E Internal VM error: Failed to create Java VM
FAILED to invoke JVM.
Test: jitrino.OPTClass: perf.CreateManyExceptions_optExit code: 1 Err: Loading error /export/users.2/cc/cc-suites/build/checkouts/snapshot/hdk/jdk/jre/bin/default/libgc_gen_uncomp.so: undefined symbol: _Z23free_set_pool_put_entryP12Vector_BlockP11GC_Metadata
GC library cannot be loaded: libgc_gen_uncomp.so
HMYEXEL062E Internal VM error: Failed to create Java VM
FAILED to invoke JVM.
Test: Server mode JITClass: perf.CreateManyExceptions_srvExit code: 1 Err: Loading error /export/users.2/cc/cc-suites/build/checkouts/snapshot/hdk/jdk/jre/bin/default/libgc_gen_uncomp.so: undefined symbol: _Z23free_set_pool_put_entryP12Vector_BlockP11GC_Metadata
GC library cannot be loaded: libgc_gen_uncomp.so
HMYEXEL062E Internal VM error: Failed to create Java VM
FAILED to invoke JVM.
Test: interpreterClass: perf.MultiThreadsSimple_intExit code: 1 Err: Loading error /export/users.2/cc/cc-suites/build/checkouts/snapshot/hdk/jdk/jre/bin/default/libgc_gen_uncomp.so: undefined symbol: _Z23free_set_pool_put_entryP12Vector_BlockP11GC_Metadata
GC library cannot be loaded: libgc_gen_uncomp.so
HMYEXEL062E Internal VM error: Failed to create Java VM
FAILED to invoke JVM.
Test: jitrino.JETClass: perf.MultiThreadsSimple_jetExit code: 1 Err: Loading error /export/users.2/cc/cc-suites/build/checkouts/snapshot/hdk/jdk/jre/bin/default/libgc_gen_uncomp.so: undefined symbol: _Z23free_set_pool_put_entryP12Vector_BlockP11GC_Metadata
GC library cannot be loaded: libgc_gen_uncomp.so
HMYEXEL062E Internal VM error: Failed to create Java VM
FAILED to invoke JVM.
Test: Client mode JIT (default)Class: perf.MultiThreadsSimple_jitExit code: 1 Err: Loading error /export/users.2/cc/cc-suites/build/checkouts/snapshot/hdk/jdk/jre/bin/default/libgc_gen_uncomp.so: undefined symbol: _Z23free_set_pool_put_entryP12Vector_BlockP11GC_Metadata
GC library cannot be loaded: libgc_gen_uncomp.so
HMYEXEL062E Internal VM error: Failed to create Java VM
FAILED to invoke JVM.
Test: jitrino.OPTClass: perf.MultiThreadsSimple_optExit code: 1 Err: Loading error /export/users.2/cc/cc-suites/build/checkouts/snapshot/hdk/jdk/jre/bin/default/libgc_gen_uncomp.so: undefined symbol: _Z23free_set_pool_put_entryP12Vector_BlockP11GC_Metadata
GC library cannot be loaded: libgc_gen_uncomp.so
HMYEXEL062E Internal VM error: Failed to create Java VM
FAILED to invoke JVM.
Test: Server mode JITClass: perf.MultiThreadsSimple_srvExit code: 1 Err: Loading error /export/users.2/cc/cc-suites/build/checkouts/snapshot/hdk/jdk/jre/bin/default/libgc_gen_uncomp.so: undefined symbol: _Z23free_set_pool_put_entryP12Vector_BlockP11GC_Metadata
GC library cannot be loaded: libgc_gen_uncomp.so
HMYEXEL062E Internal VM error: Failed to create Java VM
FAILED to invoke JVM.
Test: interpreterClass: perf.SeveralThreads_intExit code: 1 Err: Loading error /export/users.2/cc/cc-suites/build/checkouts/snapshot/hdk/jdk/jre/bin/default/libgc_gen_uncomp.so: undefined symbol: _Z23free_set_pool_put_entryP12Vector_BlockP11GC_Metadata
GC library cannot be loaded: libgc_gen_uncomp.so
HMYEXEL062E Internal VM error: Failed to create Java VM
FAILED to invoke JVM.
Test: jitrino.JETClass: perf.SeveralThreads_jetExit code: 1 Err: Loading error /export/users.2/cc/cc-suites/build/checkouts/snapshot/hdk/jdk/jre/bin/default/libgc_gen_uncomp.so: undefined symbol: _Z23free_set_pool_put_entryP12Vector_BlockP11GC_Metadata
GC library cannot be loaded: libgc_gen_uncomp.so
HMYEXEL062E Internal VM error: Failed to create Java VM
FAILED to invoke JVM.
Test: Client mode JIT (default)Class: perf.SeveralThreads_jitExit code: 1 Err: Loading error /export/users.2/cc/cc-suites/build/checkouts/snapshot/hdk/jdk/jre/bin/default/libgc_gen_uncomp.so: undefined symbol: _Z23free_set_pool_put_entryP12Vector_BlockP11GC_Metadata
GC library cannot be loaded: libgc_gen_uncomp.so
HMYEXEL062E Internal VM error: Failed to create Java VM
FAILED to invoke JVM.
Test: jitrino.OPTClass: perf.SeveralThreads_optExit code: 1 Err: Loading error /export/users.2/cc/cc-suites/build/checkouts/snapshot/hdk/jdk/jre/bin/default/libgc_gen_uncomp.so: undefined symbol: _Z23free_set_pool_put_entryP12Vector_BlockP11GC_Metadata
GC library cannot be loaded: libgc_gen_uncomp.so
HMYEXEL062E Internal VM error: Failed to create Java VM
FAILED to invoke JVM.
Test: Server mode JITClass: perf.SeveralThreads_srvExit code: 1 Err: Loading error /export/users.2/cc/cc-suites/build/checkouts/snapshot/hdk/jdk/jre/bin/default/libgc_gen_uncomp.so: undefined symbol: _Z23free_set_pool_put_entryP12Vector_BlockP11GC_Metadata
GC library cannot be loaded: libgc_gen_uncomp.so
HMYEXEL062E Internal VM error: Failed to create Java VM
FAILED to invoke JVM.
Test: interpreterClass: perf.StressCornerSize_a_intExit code: 1 Err: Loading error /export/users.2/cc/cc-suites/build/checkouts/snapshot/hdk/jdk/jre/bin/default/libgc_gen_uncomp.so: undefined symbol: _Z23free_set_pool_put_entryP12Vector_BlockP11GC_Metadata
GC library cannot be loaded: libgc_gen_uncomp.so
HMYEXEL062E Internal VM error: Failed to create Java VM
FAILED to invoke JVM.
Test: jitrino.JETClass: perf.StressCornerSize_a_jetExit code: 1 Err: Loading error /export/users.2/cc/cc-suites/build/checkouts/snapshot/hdk/jdk/jre/bin/default/libgc_gen_uncomp.so: undefined symbol: _Z23free_set_pool_put_entryP12Vector_BlockP11GC_Metadata
GC library cannot be loaded: libgc_gen_uncomp.so
HMYEXEL062E Internal VM error: Failed to create Java VM
FAILED to invoke JVM.
Test: Client mode JIT (default)Class: perf.StressCornerSize_a_jitExit code: 1 Err: Loading error /export/users.2/cc/cc-suites/build/checkouts/snapshot/hdk/jdk/jre/bin/default/libgc_gen_uncomp.so: undefined symbol: _Z23free_set_pool_put_entryP12Vector_BlockP11GC_Metadata
GC library cannot be loaded: libgc_gen_uncomp.so
HMYEXEL062E Internal VM error: Failed to create Java VM
FAILED to invoke JVM.
Test: jitrino.OPTClass: perf.StressCornerSize_a_optExit code: 1 Err: Loading error /export/users.2/cc/cc-suites/build/checkouts/snapshot/hdk/jdk/jre/bin/default/libgc_gen_uncomp.so: undefined symbol: _Z23free_set_pool_put_entryP12Vector_BlockP11GC_Metadata
GC library cannot be loaded: libgc_gen_uncomp.so
HMYEXEL062E Internal VM error: Failed to create Java VM
FAILED to invoke JVM.
Test: Server mode JITClass: perf.StressCornerSize_a_srvExit code: 1 Err: Loading error /export/users.2/cc/cc-suites/build/checkouts/snapshot/hdk/jdk/jre/bin/default/libgc_gen_uncomp.so: undefined symbol: _Z23free_set_pool_put_entryP12Vector_BlockP11GC_Metadata
GC library cannot be loaded: libgc_gen_uncomp.so
HMYEXEL062E Internal VM error: Failed to create Java VM
FAILED to invoke JVM.
Test: interpreterClass: perf.StressCornerSize_intExit code: 1 Err: Loading error /export/users.2/cc/cc-suites/build/checkouts/snapshot/hdk/jdk/jre/bin/default/libgc_gen_uncomp.so: undefined symbol: _Z23free_set_pool_put_entryP12Vector_BlockP11GC_Metadata
GC library cannot be loaded: libgc_gen_uncomp.so
HMYEXEL062E Internal VM error: Failed to create Java VM
FAILED to invoke JVM.
Test: jitrino.JETClass: perf.StressCornerSize_jetExit code: 1 Err: Loading error /export/users.2/cc/cc-suites/build/checkouts/snapshot/hdk/jdk/jre/bin/default/libgc_gen_uncomp.so: undefined symbol: _Z23free_set_pool_put_entryP12Vector_BlockP11GC_Metadata
GC library cannot be loaded: libgc_gen_uncomp.so
HMYEXEL062E Internal VM error: Failed to create Java VM
FAILED to invoke JVM.
Test: Client mode JIT (default)Class: perf.StressCornerSize_jitExit code: 1 Err: Loading error /export/users.2/cc/cc-suites/build/checkouts/snapshot/hdk/jdk/jre/bin/default/libgc_gen_uncomp.so: undefined symbol: _Z23free_set_pool_put_entryP12Vector_BlockP11GC_Metadata
GC library cannot be loaded: libgc_gen_uncomp.so
HMYEXEL062E Internal VM error: Failed to create Java VM
FAILED to invoke JVM.
Test: jitrino.OPTClass: perf.StressCornerSize_optExit code: 1 Err: Loading error /export/users.2/cc/cc-suites/build/checkouts/snapshot/hdk/jdk/jre/bin/default/libgc_gen_uncomp.so: undefined symbol: _Z23free_set_pool_put_entryP12Vector_BlockP11GC_Metadata
GC library cannot be loaded: libgc_gen_uncomp.so
HMYEXEL062E Internal VM error: Failed to create Java VM
FAILED to invoke JVM.
Test: Server mode JITClass: perf.StressCornerSize_srvExit code: 1 Err: Loading error /export/users.2/cc/cc-suites/build/checkouts/snapshot/hdk/jdk/jre/bin/default/libgc_gen_uncomp.so: undefined symbol: _Z23free_set_pool_put_entryP12Vector_BlockP11GC_Metadata
GC library cannot be loaded: libgc_gen_uncomp.so
HMYEXEL062E Internal VM error: Failed to create Java VM
FAILED to invoke JVM.
Test: interpreterClass: perf.ThrowManyExceptions_depth_intExit code: 1 Err: Loading error /export/users.2/cc/cc-suites/build/checkouts/snapshot/hdk/jdk/jre/bin/default/libgc_gen_uncomp.so: undefined symbol: _Z23free_set_pool_put_entryP12Vector_BlockP11GC_Metadata
GC library cannot be loaded: libgc_gen_uncomp.so
HMYEXEL062E Internal VM error: Failed to create Java VM
FAILED to invoke JVM.
Test: jitrino.JETClass: perf.ThrowManyExceptions_depth_jetExit code: 1 Err: Loading error /export/users.2/cc/cc-suites/build/checkouts/snapshot/hdk/jdk/jre/bin/default/libgc_gen_uncomp.so: undefined symbol: _Z23free_set_pool_put_entryP12Vector_BlockP11GC_Metadata
GC library cannot be loaded: libgc_gen_uncomp.so
HMYEXEL062E Internal VM error: Failed to create Java VM
FAILED to invoke JVM.
Test: Client mode JIT (default)Class: perf.ThrowManyExceptions_depth_jitExit code: 1 Err: Loading error /export/users.2/cc/cc-suites/build/checkouts/snapshot/hdk/jdk/jre/bin/default/libgc_gen_uncomp.so: undefined symbol: _Z23free_set_pool_put_entryP12Vector_BlockP11GC_Metadata
GC library cannot be loaded: libgc_gen_uncomp.so
HMYEXEL062E Internal VM error: Failed to create Java VM
FAILED to invoke JVM.
Test: jitrino.OPTClass: perf.ThrowManyExceptions_depth_optExit code: 1 Err: Loading error /export/users.2/cc/cc-suites/build/checkouts/snapshot/hdk/jdk/jre/bin/default/libgc_gen_uncomp.so: undefined symbol: _Z23free_set_pool_put_entryP12Vector_BlockP11GC_Metadata
GC library cannot be loaded: libgc_gen_uncomp.so
HMYEXEL062E Internal VM error: Failed to create Java VM
FAILED to invoke JVM.
Test: Server mode JITClass: perf.ThrowManyExceptions_depth_srvExit code: 1 Err: Loading error /export/users.2/cc/cc-suites/build/checkouts/snapshot/hdk/jdk/jre/bin/default/libgc_gen_uncomp.so: undefined symbol: _Z23free_set_pool_put_entryP12Vector_BlockP11GC_Metadata
GC library cannot be loaded: libgc_gen_uncomp.so
HMYEXEL062E Internal VM error: Failed to create Java VM
FAILED to invoke JVM.
Test: interpreterClass: perf.ThrowManyExceptions_intExit code: 1 Err: Loading error /export/users.2/cc/cc-suites/build/checkouts/snapshot/hdk/jdk/jre/bin/default/libgc_gen_uncomp.so: undefined symbol: _Z23free_set_pool_put_entryP12Vector_BlockP11GC_Metadata
GC library cannot be loaded: libgc_gen_uncomp.so
HMYEXEL062E Internal VM error: Failed to create Java VM
FAILED to invoke JVM.
Test: jitrino.JETClass: perf.ThrowManyExceptions_jetExit code: 1 Err: Loading error /export/users.2/cc/cc-suites/build/checkouts/snapshot/hdk/jdk/jre/bin/default/libgc_gen_uncomp.so: undefined symbol: _Z23free_set_pool_put_entryP12Vector_BlockP11GC_Metadata
GC library cannot be loaded: libgc_gen_uncomp.so
HMYEXEL062E Internal VM error: Failed to create Java VM
FAILED to invoke JVM.
Test: Client mode JIT (default)Class: perf.ThrowManyExceptions_jitExit code: 1 Err: Loading error /export/users.2/cc/cc-suites/build/checkouts/snapshot/hdk/jdk/jre/bin/default/libgc_gen_uncomp.so: undefined symbol: _Z23free_set_pool_put_entryP12Vector_BlockP11GC_Metadata
GC library cannot be loaded: libgc_gen_uncomp.so
HMYEXEL062E Internal VM error: Failed to create Java VM
FAILED to invoke JVM.
Test: jitrino.OPTClass: perf.ThrowManyExceptions_optExit code: 1 Err: Loading error /export/users.2/cc/cc-suites/build/checkouts/snapshot/hdk/jdk/jre/bin/default/libgc_gen_uncomp.so: undefined symbol: _Z23free_set_pool_put_entryP12Vector_BlockP11GC_Metadata
GC library cannot be loaded: libgc_gen_uncomp.so
HMYEXEL062E Internal VM error: Failed to create Java VM
FAILED to invoke JVM.
Test: Server mode JITClass: perf.ThrowManyExceptions_srvExit code: 1 Err: Loading error /export/users.2/cc/cc-suites/build/checkouts/snapshot/hdk/jdk/jre/bin/default/libgc_gen_uncomp.so: undefined symbol: _Z23free_set_pool_put_entryP12Vector_BlockP11GC_Metadata
GC library cannot be loaded: libgc_gen_uncomp.so
HMYEXEL062E Internal VM error: Failed to create Java VM
FAILED to invoke JVM.
Test: interpreterClass: perf.ThrowMany_depth_intExit code: 1 Err: Loading error /export/users.2/cc/cc-suites/build/checkouts/snapshot/hdk/jdk/jre/bin/default/libgc_gen_uncomp.so: undefined symbol: _Z23free_set_pool_put_entryP12Vector_BlockP11GC_Metadata
GC library cannot be loaded: libgc_gen_uncomp.so
HMYEXEL062E Internal VM error: Failed to create Java VM
FAILED to invoke JVM.
Test: jitrino.JETClass: perf.ThrowMany_depth_jetExit code: 1 Err: Loading error /export/users.2/cc/cc-suites/build/checkouts/snapshot/hdk/jdk/jre/bin/default/libgc_gen_uncomp.so: undefined symbol: _Z23free_set_pool_put_entryP12Vector_BlockP11GC_Metadata
GC library cannot be loaded: libgc_gen_uncomp.so
HMYEXEL062E Internal VM error: Failed to create Java VM
FAILED to invoke JVM.
Test: Client mode JIT (default)Class: perf.ThrowMany_depth_jitExit code: 1 Err: Loading error /export/users.2/cc/cc-suites/build/checkouts/snapshot/hdk/jdk/jre/bin/default/libgc_gen_uncomp.so: undefined symbol: _Z23free_set_pool_put_entryP12Vector_BlockP11GC_Metadata
GC library cannot be loaded: libgc_gen_uncomp.so
HMYEXEL062E Internal VM error: Failed to create Java VM
FAILED to invoke JVM.
Test: jitrino.OPTClass: perf.ThrowMany_depth_optExit code: 1 Err: Loading error /export/users.2/cc/cc-suites/build/checkouts/snapshot/hdk/jdk/jre/bin/default/libgc_gen_uncomp.so: undefined symbol: _Z23free_set_pool_put_entryP12Vector_BlockP11GC_Metadata
GC library cannot be loaded: libgc_gen_uncomp.so
HMYEXEL062E Internal VM error: Failed to create Java VM
FAILED to invoke JVM.
Test: Server mode JITClass: perf.ThrowMany_depth_srvExit code: 1 Err: Loading error /export/users.2/cc/cc-suites/build/checkouts/snapshot/hdk/jdk/jre/bin/default/libgc_gen_uncomp.so: undefined symbol: _Z23free_set_pool_put_entryP12Vector_BlockP11GC_Metadata
GC library cannot be loaded: libgc_gen_uncomp.so
HMYEXEL062E Internal VM error: Failed to create Java VM
FAILED to invoke JVM.
Test: interpreterClass: perf.ThrowMany_intExit code: 1 Err: Loading error /export/users.2/cc/cc-suites/build/checkouts/snapshot/hdk/jdk/jre/bin/default/libgc_gen_uncomp.so: undefined symbol: _Z23free_set_pool_put_entryP12Vector_BlockP11GC_Metadata
GC library cannot be loaded: libgc_gen_uncomp.so
HMYEXEL062E Internal VM error: Failed to create Java VM
FAILED to invoke JVM.
Test: jitrino.JETClass: perf.ThrowMany_jetExit code: 1 Err: Loading error /export/users.2/cc/cc-suites/build/checkouts/snapshot/hdk/jdk/jre/bin/default/libgc_gen_uncomp.so: undefined symbol: _Z23free_set_pool_put_entryP12Vector_BlockP11GC_Metadata
GC library cannot be loaded: libgc_gen_uncomp.so
HMYEXEL062E Internal VM error: Failed to create Java VM
FAILED to invoke JVM.
Test: Client mode JIT (default)Class: perf.ThrowMany_jitExit code: 1 Err: Loading error /export/users.2/cc/cc-suites/build/checkouts/snapshot/hdk/jdk/jre/bin/default/libgc_gen_uncomp.so: undefined symbol: _Z23free_set_pool_put_entryP12Vector_BlockP11GC_Metadata
GC library cannot be loaded: libgc_gen_uncomp.so
HMYEXEL062E Internal VM error: Failed to create Java VM
FAILED to invoke JVM.
Test: jitrino.OPTClass: perf.ThrowMany_optExit code: 1 Err: Loading error /export/users.2/cc/cc-suites/build/checkouts/snapshot/hdk/jdk/jre/bin/default/libgc_gen_uncomp.so: undefined symbol: _Z23free_set_pool_put_entryP12Vector_BlockP11GC_Metadata
GC library cannot be loaded: libgc_gen_uncomp.so
HMYEXEL062E Internal VM error: Failed to create Java VM
FAILED to invoke JVM.
Test: Server mode JITClass: perf.ThrowMany_srvExit code: 1 Err: Loading error /export/users.2/cc/cc-suites/build/checkouts/snapshot/hdk/jdk/jre/bin/default/libgc_gen_uncomp.so: undefined symbol: _Z23free_set_pool_put_entryP12Vector_BlockP11GC_Metadata
GC library cannot be loaded: libgc_gen_uncomp.so
HMYEXEL062E Internal VM error: Failed to create Java VM
FAILED to invoke JVM.
Test: interpreterClass: reflect.GetMethod_intExit code: 1 Err: Loading error /export/users.2/cc/cc-suites/build/checkouts/snapshot/hdk/jdk/jre/bin/default/libgc_gen_uncomp.so: undefined symbol: _Z23free_set_pool_put_entryP12Vector_BlockP11GC_Metadata
GC library cannot be loaded: libgc_gen_uncomp.so
HMYEXEL062E Internal VM error: Failed to create Java VM
FAILED to invoke JVM.
Test: jitrino.JETClass: reflect.GetMethod_jetExit code: 1 Err: Loading error /export/users.2/cc/cc-suites/build/checkouts/snapshot/hdk/jdk/jre/bin/default/libgc_gen_uncomp.so: undefined symbol: _Z23free_set_pool_put_entryP12Vector_BlockP11GC_Metadata
GC library cannot be loaded: libgc_gen_uncomp.so
HMYEXEL062E Internal VM error: Failed to create Java VM
FAILED to invoke JVM.
Test: Client mode JIT (default)Class: reflect.GetMethod_jitExit code: 1 Err: Loading error /export/users.2/cc/cc-suites/build/checkouts/snapshot/hdk/jdk/jre/bin/default/libgc_gen_uncomp.so: undefined symbol: _Z23free_set_pool_put_entryP12Vector_BlockP11GC_Metadata
GC library cannot be loaded: libgc_gen_uncomp.so
HMYEXEL062E Internal VM error: Failed to create Java VM
FAILED to invoke JVM.
Test: jitrino.OPTClass: reflect.GetMethod_optExit code: 1 Err: Loading error /export/users.2/cc/cc-suites/build/checkouts/snapshot/hdk/jdk/jre/bin/default/libgc_gen_uncomp.so: undefined symbol: _Z23free_set_pool_put_entryP12Vector_BlockP11GC_Metadata
GC library cannot be loaded: libgc_gen_uncomp.so
HMYEXEL062E Internal VM error: Failed to create Java VM
FAILED to invoke JVM.
Test: Server mode JITClass: reflect.GetMethod_srvExit code: 1 Err: Loading error /export/users.2/cc/cc-suites/build/checkouts/snapshot/hdk/jdk/jre/bin/default/libgc_gen_uncomp.so: undefined symbol: _Z23free_set_pool_put_entryP12Vector_BlockP11GC_Metadata
GC library cannot be loaded: libgc_gen_uncomp.so
HMYEXEL062E Internal VM error: Failed to create Java VM
FAILED to invoke JVM.
Test: interpreterClass: shutdown.TestDaemonOnWait_intExit code: 1 Err: Loading error /export/users.2/cc/cc-suites/build/checkouts/snapshot/hdk/jdk/jre/bin/default/libgc_gen_uncomp.so: undefined symbol: _Z23free_set_pool_put_entryP12Vector_BlockP11GC_Metadata
GC library cannot be loaded: libgc_gen_uncomp.so
HMYEXEL062E Internal VM error: Failed to create Java VM
FAILED to invoke JVM.
Test: jitrino.JETClass: shutdown.TestDaemonOnWait_jetExit code: 1 Err: Loading error /export/users.2/cc/cc-suites/build/checkouts/snapshot/hdk/jdk/jre/bin/default/libgc_gen_uncomp.so: undefined symbol: _Z23free_set_pool_put_entryP12Vector_BlockP11GC_Metadata
GC library cannot be loaded: libgc_gen_uncomp.so
HMYEXEL062E Internal VM error: Failed to create Java VM
FAILED to invoke JVM.
Test: Client mode JIT (default)Class: shutdown.TestDaemonOnWait_jitExit code: 1 Err: Loading error /export/users.2/cc/cc-suites/build/checkouts/snapshot/hdk/jdk/jre/bin/default/libgc_gen_uncomp.so: undefined symbol: _Z23free_set_pool_put_entryP12Vector_BlockP11GC_Metadata
GC library cannot be loaded: libgc_gen_uncomp.so
HMYEXEL062E Internal VM error: Failed to create Java VM
FAILED to invoke JVM.
Test: jitrino.OPTClass: shutdown.TestDaemonOnWait_optExit code: 1 Err: Loading error /export/users.2/cc/cc-suites/build/checkouts/snapshot/hdk/jdk/jre/bin/default/libgc_gen_uncomp.so: undefined symbol: _Z23free_set_pool_put_entryP12Vector_BlockP11GC_Metadata
GC library cannot be loaded: libgc_gen_uncomp.so
HMYEXEL062E Internal VM error: Failed to create Java VM
FAILED to invoke JVM.
Test: Server mode JITClass: shutdown.TestDaemonOnWait_srvExit code: 1 Err: Loading error /export/users.2/cc/cc-suites/build/checkouts/snapshot/hdk/jdk/jre/bin/default/libgc_gen_uncomp.so: undefined symbol: _Z23free_set_pool_put_entryP12Vector_BlockP11GC_Metadata
GC library cannot be loaded: libgc_gen_uncomp.so
HMYEXEL062E Internal VM error: Failed to create Java VM
FAILED to invoke JVM.
Test: interpreterClass: shutdown.TestFatalError_intExit code: 1 Err: Loading error /export/users.2/cc/cc-suites/build/checkouts/snapshot/hdk/jdk/jre/bin/default/libgc_gen_uncomp.so: undefined symbol: _Z23free_set_pool_put_entryP12Vector_BlockP11GC_Metadata
GC library cannot be loaded: libgc_gen_uncomp.so
HMYEXEL062E Internal VM error: Failed to create Java VM
FAILED to invoke JVM.
Test: jitrino.JETClass: shutdown.TestFatalError_jetExit code: 1 Err: Loading error /export/users.2/cc/cc-suites/build/checkouts/snapshot/hdk/jdk/jre/bin/default/libgc_gen_uncomp.so: undefined symbol: _Z23free_set_pool_put_entryP12Vector_BlockP11GC_Metadata
GC library cannot be loaded: libgc_gen_uncomp.so
HMYEXEL062E Internal VM error: Failed to create Java VM
FAILED to invoke JVM.
Test: Client mode JIT (default)Class: shutdown.TestFatalError_jitExit code: 1 Err: Loading error /export/users.2/cc/cc-suites/build/checkouts/snapshot/hdk/jdk/jre/bin/default/libgc_gen_uncomp.so: undefined symbol: _Z23free_set_pool_put_entryP12Vector_BlockP11GC_Metadata
GC library cannot be loaded: libgc_gen_uncomp.so
HMYEXEL062E Internal VM error: Failed to create Java VM
FAILED to invoke JVM.
Test: jitrino.OPTClass: shutdown.TestFatalError_optExit code: 1 Err: Loading error /export/users.2/cc/cc-suites/build/checkouts/snapshot/hdk/jdk/jre/bin/default/libgc_gen_uncomp.so: undefined symbol: _Z23free_set_pool_put_entryP12Vector_BlockP11GC_Metadata
GC library cannot be loaded: libgc_gen_uncomp.so
HMYEXEL062E Internal VM error: Failed to create Java VM
FAILED to invoke JVM.
Test: Server mode JITClass: shutdown.TestFatalError_srvExit code: 1 Err: Loading error /export/users.2/cc/cc-suites/build/checkouts/snapshot/hdk/jdk/jre/bin/default/libgc_gen_uncomp.so: undefined symbol: _Z23free_set_pool_put_entryP12Vector_BlockP11GC_Metadata
GC library cannot be loaded: libgc_gen_uncomp.so
HMYEXEL062E Internal VM error: Failed to create Java VM
FAILED to invoke JVM.
Test: interpreterClass: shutdown.TestInterrupt_intExit code: 1 Err: Loading error /export/users.2/cc/cc-suites/build/checkouts/snapshot/hdk/jdk/jre/bin/default/libgc_gen_uncomp.so: undefined symbol: _Z23free_set_pool_put_entryP12Vector_BlockP11GC_Metadata
GC library cannot be loaded: libgc_gen_uncomp.so
HMYEXEL062E Internal VM error: Failed to create Java VM
FAILED to invoke JVM.
Test: jitrino.JETClass: shutdown.TestInterrupt_jetExit code: 1 Err: Loading error /export/users.2/cc/cc-suites/build/checkouts/snapshot/hdk/jdk/jre/bin/default/libgc_gen_uncomp.so: undefined symbol: _Z23free_set_pool_put_entryP12Vector_BlockP11GC_Metadata
GC library cannot be loaded: libgc_gen_uncomp.so
HMYEXEL062E Internal VM error: Failed to create Java VM
FAILED to invoke JVM.
Test: Client mode JIT (default)Class: shutdown.TestInterrupt_jitExit code: 1 Err: Loading error /export/users.2/cc/cc-suites/build/checkouts/snapshot/hdk/jdk/jre/bin/default/libgc_gen_uncomp.so: undefined symbol: _Z23free_set_pool_put_entryP12Vector_BlockP11GC_Metadata
GC library cannot be loaded: libgc_gen_uncomp.so
HMYEXEL062E Internal VM error: Failed to create Java VM
FAILED to invoke JVM.
Test: jitrino.OPTClass: shutdown.TestInterrupt_optExit code: 1 Err: Loading error /export/users.2/cc/cc-suites/build/checkouts/snapshot/hdk/jdk/jre/bin/default/libgc_gen_uncomp.so: undefined symbol: _Z23free_set_pool_put_entryP12Vector_BlockP11GC_Metadata
GC library cannot be loaded: libgc_gen_uncomp.so
HMYEXEL062E Internal VM error: Failed to create Java VM
FAILED to invoke JVM.
Test: Server mode JITClass: shutdown.TestInterrupt_srvExit code: 1 Err: Loading error /export/users.2/cc/cc-suites/build/checkouts/snapshot/hdk/jdk/jre/bin/default/libgc_gen_uncomp.so: undefined symbol: _Z23free_set_pool_put_entryP12Vector_BlockP11GC_Metadata
GC library cannot be loaded: libgc_gen_uncomp.so
HMYEXEL062E Internal VM error: Failed to create Java VM
FAILED to invoke JVM.
Test: interpreterClass: shutdown.TestLock_intExit code: 1 Err: Loading error /export/users.2/cc/cc-suites/build/checkouts/snapshot/hdk/jdk/jre/bin/default/libgc_gen_uncomp.so: undefined symbol: _Z23free_set_pool_put_entryP12Vector_BlockP11GC_Metadata
GC library cannot be loaded: libgc_gen_uncomp.so
HMYEXEL062E Internal VM error: Failed to create Java VM
FAILED to invoke JVM.
Test: jitrino.JETClass: shutdown.TestLock_jetExit code: 1 Err: Loading error /export/users.2/cc/cc-suites/build/checkouts/snapshot/hdk/jdk/jre/bin/default/libgc_gen_uncomp.so: undefined symbol: _Z23free_set_pool_put_entryP12Vector_BlockP11GC_Metadata
GC library cannot be loaded: libgc_gen_uncomp.so
HMYEXEL062E Internal VM error: Failed to create Java VM
FAILED to invoke JVM.
Test: Client mode JIT (default)Class: shutdown.TestLock_jitExit code: 1 Err: Loading error /export/users.2/cc/cc-suites/build/checkouts/snapshot/hdk/jdk/jre/bin/default/libgc_gen_uncomp.so: undefined symbol: _Z23free_set_pool_put_entryP12Vector_BlockP11GC_Metadata
GC library cannot be loaded: libgc_gen_uncomp.so
HMYEXEL062E Internal VM error: Failed to create Java VM
FAILED to invoke JVM.
Test: jitrino.OPTClass: shutdown.TestLock_optExit code: 1 Err: Loading error /export/users.2/cc/cc-suites/build/checkouts/snapshot/hdk/jdk/jre/bin/default/libgc_gen_uncomp.so: undefined symbol: _Z23free_set_pool_put_entryP12Vector_BlockP11GC_Metadata
GC library cannot be loaded: libgc_gen_uncomp.so
HMYEXEL062E Internal VM error: Failed to create Java VM
FAILED to invoke JVM.
Test: Server mode JITClass: shutdown.TestLock_srvExit code: 1 Err: Loading error /export/users.2/cc/cc-suites/build/checkouts/snapshot/hdk/jdk/jre/bin/default/libgc_gen_uncomp.so: undefined symbol: _Z23free_set_pool_put_entryP12Vector_BlockP11GC_Metadata
GC library cannot be loaded: libgc_gen_uncomp.so
HMYEXEL062E Internal VM error: Failed to create Java VM
FAILED to invoke JVM.
Test: interpreterClass: stress.BigStringBuffer_intExit code: 1 Err: Loading error /export/users.2/cc/cc-suites/build/checkouts/snapshot/hdk/jdk/jre/bin/default/libgc_gen_uncomp.so: undefined symbol: _Z23free_set_pool_put_entryP12Vector_BlockP11GC_Metadata
GC library cannot be loaded: libgc_gen_uncomp.so
HMYEXEL062E Internal VM error: Failed to create Java VM
FAILED to invoke JVM.
Test: jitrino.JETClass: stress.BigStringBuffer_jetExit code: 1 Err: Loading error /export/users.2/cc/cc-suites/build/checkouts/snapshot/hdk/jdk/jre/bin/default/libgc_gen_uncomp.so: undefined symbol: _Z23free_set_pool_put_entryP12Vector_BlockP11GC_Metadata
GC library cannot be loaded: libgc_gen_uncomp.so
HMYEXEL062E Internal VM error: Failed to create Java VM
FAILED to invoke JVM.
Test: Client mode JIT (default)Class: stress.BigStringBuffer_jitExit code: 1 Err: Loading error /export/users.2/cc/cc-suites/build/checkouts/snapshot/hdk/jdk/jre/bin/default/libgc_gen_uncomp.so: undefined symbol: _Z23free_set_pool_put_entryP12Vector_BlockP11GC_Metadata
GC library cannot be loaded: libgc_gen_uncomp.so
HMYEXEL062E Internal VM error: Failed to create Java VM
FAILED to invoke JVM.
Test: jitrino.OPTClass: stress.BigStringBuffer_optExit code: 1 Err: Loading error /export/users.2/cc/cc-suites/build/checkouts/snapshot/hdk/jdk/jre/bin/default/libgc_gen_uncomp.so: undefined symbol: _Z23free_set_pool_put_entryP12Vector_BlockP11GC_Metadata
GC library cannot be loaded: libgc_gen_uncomp.so
HMYEXEL062E Internal VM error: Failed to create Java VM
FAILED to invoke JVM.
Test: Server mode JITClass: stress.BigStringBuffer_srvExit code: 1 Err: Loading error /export/users.2/cc/cc-suites/build/checkouts/snapshot/hdk/jdk/jre/bin/default/libgc_gen_uncomp.so: undefined symbol: _Z23free_set_pool_put_entryP12Vector_BlockP11GC_Metadata
GC library cannot be loaded: libgc_gen_uncomp.so
HMYEXEL062E Internal VM error: Failed to create Java VM
FAILED to invoke JVM.
Test: interpreterClass: stress.Finalizer_intExit code: 1 Err: Loading error /export/users.2/cc/cc-suites/build/checkouts/snapshot/hdk/jdk/jre/bin/default/libgc_gen_uncomp.so: undefined symbol: _Z23free_set_pool_put_entryP12Vector_BlockP11GC_Metadata
GC library cannot be loaded: libgc_gen_uncomp.so
HMYEXEL062E Internal VM error: Failed to create Java VM
FAILED to invoke JVM.
Test: jitrino.JETClass: stress.Finalizer_jetExit code: 1 Err: Loading error /export/users.2/cc/cc-suites/build/checkouts/snapshot/hdk/jdk/jre/bin/default/libgc_gen_uncomp.so: undefined symbol: _Z23free_set_pool_put_entryP12Vector_BlockP11GC_Metadata
GC library cannot be loaded: libgc_gen_uncomp.so
HMYEXEL062E Internal VM error: Failed to create Java VM
FAILED to invoke JVM.
Test: Client mode JIT (default)Class: stress.Finalizer_jitExit code: 1 Err: Loading error /export/users.2/cc/cc-suites/build/checkouts/snapshot/hdk/jdk/jre/bin/default/libgc_gen_uncomp.so: undefined symbol: _Z23free_set_pool_put_entryP12Vector_BlockP11GC_Metadata
GC library cannot be loaded: libgc_gen_uncomp.so
HMYEXEL062E Internal VM error: Failed to create Java VM
FAILED to invoke JVM.
Test: jitrino.OPTClass: stress.Finalizer_optExit code: 1 Err: Loading error /export/users.2/cc/cc-suites/build/checkouts/snapshot/hdk/jdk/jre/bin/default/libgc_gen_uncomp.so: undefined symbol: _Z23free_set_pool_put_entryP12Vector_BlockP11GC_Metadata
GC library cannot be loaded: libgc_gen_uncomp.so
HMYEXEL062E Internal VM error: Failed to create Java VM
FAILED to invoke JVM.
Test: Server mode JITClass: stress.Finalizer_srvExit code: 1 Err: Loading error /export/users.2/cc/cc-suites/build/checkouts/snapshot/hdk/jdk/jre/bin/default/libgc_gen_uncomp.so: undefined symbol: _Z23free_set_pool_put_entryP12Vector_BlockP11GC_Metadata
GC library cannot be loaded: libgc_gen_uncomp.so
HMYEXEL062E Internal VM error: Failed to create Java VM
FAILED to invoke JVM.
Test: jitrino.JETClass: stress.Intern_jetExit code: 1 Err: Loading error /export/users.2/cc/cc-suites/build/checkouts/snapshot/hdk/jdk/jre/bin/default/libgc_gen_uncomp.so: undefined symbol: _Z23free_set_pool_put_entryP12Vector_BlockP11GC_Metadata
GC library cannot be loaded: libgc_gen_uncomp.so
HMYEXEL062E Internal VM error: Failed to create Java VM
FAILED to invoke JVM.
Test: Client mode JIT (default)Class: stress.Intern_jitExit code: 1 Err: Loading error /export/users.2/cc/cc-suites/build/checkouts/snapshot/hdk/jdk/jre/bin/default/libgc_gen_uncomp.so: undefined symbol: _Z23free_set_pool_put_entryP12Vector_BlockP11GC_Metadata
GC library cannot be loaded: libgc_gen_uncomp.so
HMYEXEL062E Internal VM error: Failed to create Java VM
FAILED to invoke JVM.
Test: jitrino.OPTClass: stress.Intern_optExit code: 1 Err: Loading error /export/users.2/cc/cc-suites/build/checkouts/snapshot/hdk/jdk/jre/bin/default/libgc_gen_uncomp.so: undefined symbol: _Z23free_set_pool_put_entryP12Vector_BlockP11GC_Metadata
GC library cannot be loaded: libgc_gen_uncomp.so
HMYEXEL062E Internal VM error: Failed to create Java VM
FAILED to invoke JVM.
Test: Server mode JITClass: stress.Intern_srvExit code: 1 Err: Loading error /export/users.2/cc/cc-suites/build/checkouts/snapshot/hdk/jdk/jre/bin/default/libgc_gen_uncomp.so: undefined symbol: _Z23free_set_pool_put_entryP12Vector_BlockP11GC_Metadata
GC library cannot be loaded: libgc_gen_uncomp.so
HMYEXEL062E Internal VM error: Failed to create Java VM
FAILED to invoke JVM.
Test: interpreterClass: stress.Mix_intExit code: 1 Err: Loading error /export/users.2/cc/cc-suites/build/checkouts/snapshot/hdk/jdk/jre/bin/default/libgc_gen_uncomp.so: undefined symbol: _Z23free_set_pool_put_entryP12Vector_BlockP11GC_Metadata
GC library cannot be loaded: libgc_gen_uncomp.so
HMYEXEL062E Internal VM error: Failed to create Java VM
FAILED to invoke JVM.
Test: jitrino.JETClass: stress.Mix_jetExit code: 1 Err: Loading error /export/users.2/cc/cc-suites/build/checkouts/snapshot/hdk/jdk/jre/bin/default/libgc_gen_uncomp.so: undefined symbol: _Z23free_set_pool_put_entryP12Vector_BlockP11GC_Metadata
GC library cannot be loaded: libgc_gen_uncomp.so
HMYEXEL062E Internal VM error: Failed to create Java VM
FAILED to invoke JVM.
Test: Client mode JIT (default)Class: stress.Mix_jitExit code: 1 Err: Loading error /export/users.2/cc/cc-suites/build/checkouts/snapshot/hdk/jdk/jre/bin/default/libgc_gen_uncomp.so: undefined symbol: _Z23free_set_pool_put_entryP12Vector_BlockP11GC_Metadata
GC library cannot be loaded: libgc_gen_uncomp.so
HMYEXEL062E Internal VM error: Failed to create Java VM
FAILED to invoke JVM.
Test: jitrino.OPTClass: stress.Mix_optExit code: 1 Err: Loading error /export/users.2/cc/cc-suites/build/checkouts/snapshot/hdk/jdk/jre/bin/default/libgc_gen_uncomp.so: undefined symbol: _Z23free_set_pool_put_entryP12Vector_BlockP11GC_Metadata
GC library cannot be loaded: libgc_gen_uncomp.so
HMYEXEL062E Internal VM error: Failed to create Java VM
FAILED to invoke JVM.
Test: Server mode JITClass: stress.Mix_srvExit code: 1 Err: Loading error /export/users.2/cc/cc-suites/build/checkouts/snapshot/hdk/jdk/jre/bin/default/libgc_gen_uncomp.so: undefined symbol: _Z23free_set_pool_put_entryP12Vector_BlockP11GC_Metadata
GC library cannot be loaded: libgc_gen_uncomp.so
HMYEXEL062E Internal VM error: Failed to create Java VM
FAILED to invoke JVM.
Test: interpreterClass: stress.Stack_intExit code: 1 Err: Loading error /export/users.2/cc/cc-suites/build/checkouts/snapshot/hdk/jdk/jre/bin/default/libgc_gen_uncomp.so: undefined symbol: _Z23free_set_pool_put_entryP12Vector_BlockP11GC_Metadata
GC library cannot be loaded: libgc_gen_uncomp.so
HMYEXEL062E Internal VM error: Failed to create Java VM
FAILED to invoke JVM.
Test: interpreterClass: stress.Sync_intExit code: 1 Err: Loading error /export/users.2/cc/cc-suites/build/checkouts/snapshot/hdk/jdk/jre/bin/default/libgc_gen_uncomp.so: undefined symbol: _Z23free_set_pool_put_entryP12Vector_BlockP11GC_Metadata
GC library cannot be loaded: libgc_gen_uncomp.so
HMYEXEL062E Internal VM error: Failed to create Java VM
FAILED to invoke JVM.
Test: jitrino.JETClass: stress.Sync_jetExit code: 1 Err: Loading error /export/users.2/cc/cc-suites/build/checkouts/snapshot/hdk/jdk/jre/bin/default/libgc_gen_uncomp.so: undefined symbol: _Z23free_set_pool_put_entryP12Vector_BlockP11GC_Metadata
GC library cannot be loaded: libgc_gen_uncomp.so
HMYEXEL062E Internal VM error: Failed to create Java VM
FAILED to invoke JVM.
Test: Client mode JIT (default)Class: stress.Sync_jitExit code: 1 Err: Loading error /export/users.2/cc/cc-suites/build/checkouts/snapshot/hdk/jdk/jre/bin/default/libgc_gen_uncomp.so: undefined symbol: _Z23free_set_pool_put_entryP12Vector_BlockP11GC_Metadata
GC library cannot be loaded: libgc_gen_uncomp.so
HMYEXEL062E Internal VM error: Failed to create Java VM
FAILED to invoke JVM.
Test: jitrino.OPTClass: stress.Sync_optExit code: 1 Err: Loading error /export/users.2/cc/cc-suites/build/checkouts/snapshot/hdk/jdk/jre/bin/default/libgc_gen_uncomp.so: undefined symbol: _Z23free_set_pool_put_entryP12Vector_BlockP11GC_Metadata
GC library cannot be loaded: libgc_gen_uncomp.so
HMYEXEL062E Internal VM error: Failed to create Java VM
FAILED to invoke JVM.
Test: Server mode JITClass: stress.Sync_srvExit code: 1 Err: Loading error /export/users.2/cc/cc-suites/build/checkouts/snapshot/hdk/jdk/jre/bin/default/libgc_gen_uncomp.so: undefined symbol: _Z23free_set_pool_put_entryP12Vector_BlockP11GC_Metadata
GC library cannot be loaded: libgc_gen_uncomp.so
HMYEXEL062E Internal VM error: Failed to create Java VM
FAILED to invoke JVM.
Test: interpreterClass: stress.Vector_intExit code: 1 Err: Loading error /export/users.2/cc/cc-suites/build/checkouts/snapshot/hdk/jdk/jre/bin/default/libgc_gen_uncomp.so: undefined symbol: _Z23free_set_pool_put_entryP12Vector_BlockP11GC_Metadata
GC library cannot be loaded: libgc_gen_uncomp.so
HMYEXEL062E Internal VM error: Failed to create Java VM
FAILED to invoke JVM.
Test: jitrino.JETClass: stress.Vector_jetExit code: 1 Err: Loading error /export/users.2/cc/cc-suites/build/checkouts/snapshot/hdk/jdk/jre/bin/default/libgc_gen_uncomp.so: undefined symbol: _Z23free_set_pool_put_entryP12Vector_BlockP11GC_Metadata
GC library cannot be loaded: libgc_gen_uncomp.so
HMYEXEL062E Internal VM error: Failed to create Java VM
FAILED to invoke JVM.
Test: Client mode JIT (default)Class: stress.Vector_jitExit code: 1 Err: Loading error /export/users.2/cc/cc-suites/build/checkouts/snapshot/hdk/jdk/jre/bin/default/libgc_gen_uncomp.so: undefined symbol: _Z23free_set_pool_put_entryP12Vector_BlockP11GC_Metadata
GC library cannot be loaded: libgc_gen_uncomp.so
HMYEXEL062E Internal VM error: Failed to create Java VM
FAILED to invoke JVM.
Test: jitrino.OPTClass: stress.Vector_optExit code: 1 Err: Loading error /export/users.2/cc/cc-suites/build/checkouts/snapshot/hdk/jdk/jre/bin/default/libgc_gen_uncomp.so: undefined symbol: _Z23free_set_pool_put_entryP12Vector_BlockP11GC_Metadata
GC library cannot be loaded: libgc_gen_uncomp.so
HMYEXEL062E Internal VM error: Failed to create Java VM
FAILED to invoke JVM.
Test: Server mode JITClass: stress.Vector_srvExit code: 1 Err: Loading error /export/users.2/cc/cc-suites/build/checkouts/snapshot/hdk/jdk/jre/bin/default/libgc_gen_uncomp.so: undefined symbol: _Z23free_set_pool_put_entryP12Vector_BlockP11GC_Metadata
GC library cannot be loaded: libgc_gen_uncomp.so
HMYEXEL062E Internal VM error: Failed to create Java VM
FAILED to invoke JVM.
Test: interpreterClass: stress.WeakHashmapTest_intExit code: 1 Err: Loading error /export/users.2/cc/cc-suites/build/checkouts/snapshot/hdk/jdk/jre/bin/default/libgc_gen_uncomp.so: undefined symbol: _Z23free_set_pool_put_entryP12Vector_BlockP11GC_Metadata
GC library cannot be loaded: libgc_gen_uncomp.so
HMYEXEL062E Internal VM error: Failed to create Java VM
FAILED to invoke JVM.
Test: jitrino.JETClass: stress.WeakHashmapTest_jetExit code: 1 Err: Loading error /export/users.2/cc/cc-suites/build/checkouts/snapshot/hdk/jdk/jre/bin/default/libgc_gen_uncomp.so: undefined symbol: _Z23free_set_pool_put_entryP12Vector_BlockP11GC_Metadata
GC library cannot be loaded: libgc_gen_uncomp.so
HMYEXEL062E Internal VM error: Failed to create Java VM
FAILED to invoke JVM.
Test: Client mode JIT (default)Class: stress.WeakHashmapTest_jitExit code: 1 Err: Loading error /export/users.2/cc/cc-suites/build/checkouts/snapshot/hdk/jdk/jre/bin/default/libgc_gen_uncomp.so: undefined symbol: _Z23free_set_pool_put_entryP12Vector_BlockP11GC_Metadata
GC library cannot be loaded: libgc_gen_uncomp.so
HMYEXEL062E Internal VM error: Failed to create Java VM
FAILED to invoke JVM.
Test: jitrino.OPTClass: stress.WeakHashmapTest_optExit code: 1 Err: Loading error /export/users.2/cc/cc-suites/build/checkouts/snapshot/hdk/jdk/jre/bin/default/libgc_gen_uncomp.so: undefined symbol: _Z23free_set_pool_put_entryP12Vector_BlockP11GC_Metadata
GC library cannot be loaded: libgc_gen_uncomp.so
HMYEXEL062E Internal VM error: Failed to create Java VM
FAILED to invoke JVM.
Test: Server mode JITClass: stress.WeakHashmapTest_srvExit code: 1 Err: Loading error /export/users.2/cc/cc-suites/build/checkouts/snapshot/hdk/jdk/jre/bin/default/libgc_gen_uncomp.so: undefined symbol: _Z23free_set_pool_put_entryP12Vector_BlockP11GC_Metadata
GC library cannot be loaded: libgc_gen_uncomp.so
HMYEXEL062E Internal VM error: Failed to create Java VM
FAILED to invoke JVM.
Test: interpreterClass: thread.ExitShutdownHook_intExit code: 1 Err: Loading error /export/users.2/cc/cc-suites/build/checkouts/snapshot/hdk/jdk/jre/bin/default/libgc_gen_uncomp.so: undefined symbol: _Z23free_set_pool_put_entryP12Vector_BlockP11GC_Metadata
GC library cannot be loaded: libgc_gen_uncomp.so
HMYEXEL062E Internal VM error: Failed to create Java VM
FAILED to invoke JVM.
Test: jitrino.JETClass: thread.ExitShutdownHook_jetExit code: 1 Err: Loading error /export/users.2/cc/cc-suites/build/checkouts/snapshot/hdk/jdk/jre/bin/default/libgc_gen_uncomp.so: undefined symbol: _Z23free_set_pool_put_entryP12Vector_BlockP11GC_Metadata
GC library cannot be loaded: libgc_gen_uncomp.so
HMYEXEL062E Internal VM error: Failed to create Java VM
FAILED to invoke JVM.
Test: Client mode JIT (default)Class: thread.ExitShutdownHook_jitExit code: 1 Err: Loading error /export/users.2/cc/cc-suites/build/checkouts/snapshot/hdk/jdk/jre/bin/default/libgc_gen_uncomp.so: undefined symbol: _Z23free_set_pool_put_entryP12Vector_BlockP11GC_Metadata
GC library cannot be loaded: libgc_gen_uncomp.so
HMYEXEL062E Internal VM error: Failed to create Java VM
FAILED to invoke JVM.
Test: jitrino.OPTClass: thread.ExitShutdownHook_optExit code: 1 Err: Loading error /export/users.2/cc/cc-suites/build/checkouts/snapshot/hdk/jdk/jre/bin/default/libgc_gen_uncomp.so: undefined symbol: _Z23free_set_pool_put_entryP12Vector_BlockP11GC_Metadata
GC library cannot be loaded: libgc_gen_uncomp.so
HMYEXEL062E Internal VM error: Failed to create Java VM
FAILED to invoke JVM.
Test: Server mode JITClass: thread.ExitShutdownHook_srvExit code: 1 Err: Loading error /export/users.2/cc/cc-suites/build/checkouts/snapshot/hdk/jdk/jre/bin/default/libgc_gen_uncomp.so: undefined symbol: _Z23free_set_pool_put_entryP12Vector_BlockP11GC_Metadata
GC library cannot be loaded: libgc_gen_uncomp.so
HMYEXEL062E Internal VM error: Failed to create Java VM
FAILED to invoke JVM.
Test: interpreterClass: thread.InfiniteFinalizer_intExit code: 1 Err: Loading error /export/users.2/cc/cc-suites/build/checkouts/snapshot/hdk/jdk/jre/bin/default/libgc_gen_uncomp.so: undefined symbol: _Z23free_set_pool_put_entryP12Vector_BlockP11GC_Metadata
GC library cannot be loaded: libgc_gen_uncomp.so
HMYEXEL062E Internal VM error: Failed to create Java VM
FAILED to invoke JVM.
Test: jitrino.JETClass: thread.InfiniteFinalizer_jetExit code: 1 Err: Loading error /export/users.2/cc/cc-suites/build/checkouts/snapshot/hdk/jdk/jre/bin/default/libgc_gen_uncomp.so: undefined symbol: _Z23free_set_pool_put_entryP12Vector_BlockP11GC_Metadata
GC library cannot be loaded: libgc_gen_uncomp.so
HMYEXEL062E Internal VM error: Failed to create Java VM
FAILED to invoke JVM.
Test: Client mode JIT (default)Class: thread.InfiniteFinalizer_jitExit code: 1 Err: Loading error /export/users.2/cc/cc-suites/build/checkouts/snapshot/hdk/jdk/jre/bin/default/libgc_gen_uncomp.so: undefined symbol: _Z23free_set_pool_put_entryP12Vector_BlockP11GC_Metadata
GC library cannot be loaded: libgc_gen_uncomp.so
HMYEXEL062E Internal VM error: Failed to create Java VM
FAILED to invoke JVM.
Test: jitrino.OPTClass: thread.InfiniteFinalizer_optExit code: 1 Err: Loading error /export/users.2/cc/cc-suites/build/checkouts/snapshot/hdk/jdk/jre/bin/default/libgc_gen_uncomp.so: undefined symbol: _Z23free_set_pool_put_entryP12Vector_BlockP11GC_Metadata
GC library cannot be loaded: libgc_gen_uncomp.so
HMYEXEL062E Internal VM error: Failed to create Java VM
FAILED to invoke JVM.
Test: Server mode JITClass: thread.InfiniteFinalizer_srvExit code: 1 Err: Loading error /export/users.2/cc/cc-suites/build/checkouts/snapshot/hdk/jdk/jre/bin/default/libgc_gen_uncomp.so: undefined symbol: _Z23free_set_pool_put_entryP12Vector_BlockP11GC_Metadata
GC library cannot be loaded: libgc_gen_uncomp.so
HMYEXEL062E Internal VM error: Failed to create Java VM
FAILED to invoke JVM.
Test: interpreterClass: thread.InterruptWait_intExit code: 1 Err: Loading error /export/users.2/cc/cc-suites/build/checkouts/snapshot/hdk/jdk/jre/bin/default/libgc_gen_uncomp.so: undefined symbol: _Z23free_set_pool_put_entryP12Vector_BlockP11GC_Metadata
GC library cannot be loaded: libgc_gen_uncomp.so
HMYEXEL062E Internal VM error: Failed to create Java VM
FAILED to invoke JVM.
Test: jitrino.JETClass: thread.InterruptWait_jetExit code: 1 Err: Loading error /export/users.2/cc/cc-suites/build/checkouts/snapshot/hdk/jdk/jre/bin/default/libgc_gen_uncomp.so: undefined symbol: _Z23free_set_pool_put_entryP12Vector_BlockP11GC_Metadata
GC library cannot be loaded: libgc_gen_uncomp.so
HMYEXEL062E Internal VM error: Failed to create Java VM
FAILED to invoke JVM.
Test: Client mode JIT (default)Class: thread.InterruptWait_jitExit code: 1 Err: Loading error /export/users.2/cc/cc-suites/build/checkouts/snapshot/hdk/jdk/jre/bin/default/libgc_gen_uncomp.so: undefined symbol: _Z23free_set_pool_put_entryP12Vector_BlockP11GC_Metadata
GC library cannot be loaded: libgc_gen_uncomp.so
HMYEXEL062E Internal VM error: Failed to create Java VM
FAILED to invoke JVM.
Test: jitrino.OPTClass: thread.InterruptWait_optExit code: 1 Err: Loading error /export/users.2/cc/cc-suites/build/checkouts/snapshot/hdk/jdk/jre/bin/default/libgc_gen_uncomp.so: undefined symbol: _Z23free_set_pool_put_entryP12Vector_BlockP11GC_Metadata
GC library cannot be loaded: libgc_gen_uncomp.so
HMYEXEL062E Internal VM error: Failed to create Java VM
FAILED to invoke JVM.
Test: Server mode JITClass: thread.InterruptWait_srvExit code: 1 Err: Loading error /export/users.2/cc/cc-suites/build/checkouts/snapshot/hdk/jdk/jre/bin/default/libgc_gen_uncomp.so: undefined symbol: _Z23free_set_pool_put_entryP12Vector_BlockP11GC_Metadata
GC library cannot be loaded: libgc_gen_uncomp.so
HMYEXEL062E Internal VM error: Failed to create Java VM
FAILED to invoke JVM.
Test: interpreterClass: thread.Sleep_intExit code: 1 Err: Loading error /export/users.2/cc/cc-suites/build/checkouts/snapshot/hdk/jdk/jre/bin/default/libgc_gen_uncomp.so: undefined symbol: _Z23free_set_pool_put_entryP12Vector_BlockP11GC_Metadata
GC library cannot be loaded: libgc_gen_uncomp.so
HMYEXEL062E Internal VM error: Failed to create Java VM
FAILED to invoke JVM.
Test: jitrino.JETClass: thread.Sleep_jetExit code: 1 Err: Loading error /export/users.2/cc/cc-suites/build/checkouts/snapshot/hdk/jdk/jre/bin/default/libgc_gen_uncomp.so: undefined symbol: _Z23free_set_pool_put_entryP12Vector_BlockP11GC_Metadata
GC library cannot be loaded: libgc_gen_uncomp.so
HMYEXEL062E Internal VM error: Failed to create Java VM
FAILED to invoke JVM.
Test: Client mode JIT (default)Class: thread.Sleep_jitExit code: 1 Err: Loading error /export/users.2/cc/cc-suites/build/checkouts/snapshot/hdk/jdk/jre/bin/default/libgc_gen_uncomp.so: undefined symbol: _Z23free_set_pool_put_entryP12Vector_BlockP11GC_Metadata
GC library cannot be loaded: libgc_gen_uncomp.so
HMYEXEL062E Internal VM error: Failed to create Java VM
FAILED to invoke JVM.
Test: jitrino.OPTClass: thread.Sleep_optExit code: 1 Err: Loading error /export/users.2/cc/cc-suites/build/checkouts/snapshot/hdk/jdk/jre/bin/default/libgc_gen_uncomp.so: undefined symbol: _Z23free_set_pool_put_entryP12Vector_BlockP11GC_Metadata
GC library cannot be loaded: libgc_gen_uncomp.so
HMYEXEL062E Internal VM error: Failed to create Java VM
FAILED to invoke JVM.
Test: Server mode JITClass: thread.Sleep_srvExit code: 1 Err: Loading error /export/users.2/cc/cc-suites/build/checkouts/snapshot/hdk/jdk/jre/bin/default/libgc_gen_uncomp.so: undefined symbol: _Z23free_set_pool_put_entryP12Vector_BlockP11GC_Metadata
GC library cannot be loaded: libgc_gen_uncomp.so
HMYEXEL062E Internal VM error: Failed to create Java VM
FAILED to invoke JVM.
Test: interpreterClass: thread.SmallStackThreadTest_intExit code: 1 Err: Loading error /export/users.2/cc/cc-suites/build/checkouts/snapshot/hdk/jdk/jre/bin/default/libgc_gen_uncomp.so: undefined symbol: _Z23free_set_pool_put_entryP12Vector_BlockP11GC_Metadata
GC library cannot be loaded: libgc_gen_uncomp.so
HMYEXEL062E Internal VM error: Failed to create Java VM
FAILED to invoke JVM.
Test: jitrino.JETClass: thread.SmallStackThreadTest_jetExit code: 1 Err: Loading error /export/users.2/cc/cc-suites/build/checkouts/snapshot/hdk/jdk/jre/bin/default/libgc_gen_uncomp.so: undefined symbol: _Z23free_set_pool_put_entryP12Vector_BlockP11GC_Metadata
GC library cannot be loaded: libgc_gen_uncomp.so
HMYEXEL062E Internal VM error: Failed to create Java VM
FAILED to invoke JVM.
Test: Client mode JIT (default)Class: thread.SmallStackThreadTest_jitExit code: 1 Err: Loading error /export/users.2/cc/cc-suites/build/checkouts/snapshot/hdk/jdk/jre/bin/default/libgc_gen_uncomp.so: undefined symbol: _Z23free_set_pool_put_entryP12Vector_BlockP11GC_Metadata
GC library cannot be loaded: libgc_gen_uncomp.so
HMYEXEL062E Internal VM error: Failed to create Java VM
FAILED to invoke JVM.
Test: jitrino.OPTClass: thread.SmallStackThreadTest_optExit code: 1 Err: Loading error /export/users.2/cc/cc-suites/build/checkouts/snapshot/hdk/jdk/jre/bin/default/libgc_gen_uncomp.so: undefined symbol: _Z23free_set_pool_put_entryP12Vector_BlockP11GC_Metadata
GC library cannot be loaded: libgc_gen_uncomp.so
HMYEXEL062E Internal VM error: Failed to create Java VM
FAILED to invoke JVM.
Test: Server mode JITClass: thread.SmallStackThreadTest_srvExit code: 1 Err: Loading error /export/users.2/cc/cc-suites/build/checkouts/snapshot/hdk/jdk/jre/bin/default/libgc_gen_uncomp.so: undefined symbol: _Z23free_set_pool_put_entryP12Vector_BlockP11GC_Metadata
GC library cannot be loaded: libgc_gen_uncomp.so
HMYEXEL062E Internal VM error: Failed to create Java VM
FAILED to invoke JVM.
Test: interpreterClass: thread.ThreadInterrupt_intExit code: 1 Err: Loading error /export/users.2/cc/cc-suites/build/checkouts/snapshot/hdk/jdk/jre/bin/default/libgc_gen_uncomp.so: undefined symbol: _Z23free_set_pool_put_entryP12Vector_BlockP11GC_Metadata
GC library cannot be loaded: libgc_gen_uncomp.so
HMYEXEL062E Internal VM error: Failed to create Java VM
FAILED to invoke JVM.
Test: jitrino.JETClass: thread.ThreadInterrupt_jetExit code: 1 Err: Loading error /export/users.2/cc/cc-suites/build/checkouts/snapshot/hdk/jdk/jre/bin/default/libgc_gen_uncomp.so: undefined symbol: _Z23free_set_pool_put_entryP12Vector_BlockP11GC_Metadata
GC library cannot be loaded: libgc_gen_uncomp.so
HMYEXEL062E Internal VM error: Failed to create Java VM
FAILED to invoke JVM.
Test: Client mode JIT (default)Class: thread.ThreadInterrupt_jitExit code: 1 Err: Loading error /export/users.2/cc/cc-suites/build/checkouts/snapshot/hdk/jdk/jre/bin/default/libgc_gen_uncomp.so: undefined symbol: _Z23free_set_pool_put_entryP12Vector_BlockP11GC_Metadata
GC library cannot be loaded: libgc_gen_uncomp.so
HMYEXEL062E Internal VM error: Failed to create Java VM
FAILED to invoke JVM.
Test: jitrino.OPTClass: thread.ThreadInterrupt_optExit code: 1 Err: Loading error /export/users.2/cc/cc-suites/build/checkouts/snapshot/hdk/jdk/jre/bin/default/libgc_gen_uncomp.so: undefined symbol: _Z23free_set_pool_put_entryP12Vector_BlockP11GC_Metadata
GC library cannot be loaded: libgc_gen_uncomp.so
HMYEXEL062E Internal VM error: Failed to create Java VM
FAILED to invoke JVM.
Test: Server mode JITClass: thread.ThreadInterrupt_srvExit code: 1 Err: Loading error /export/users.2/cc/cc-suites/build/checkouts/snapshot/hdk/jdk/jre/bin/default/libgc_gen_uncomp.so: undefined symbol: _Z23free_set_pool_put_entryP12Vector_BlockP11GC_Metadata
GC library cannot be loaded: libgc_gen_uncomp.so
HMYEXEL062E Internal VM error: Failed to create Java VM
FAILED to invoke JVM.
Test: interpreterClass: thread.ThreadOOM_intExit code: 1 Err: Loading error /export/users.2/cc/cc-suites/build/checkouts/snapshot/hdk/jdk/jre/bin/default/libgc_gen_uncomp.so: undefined symbol: _Z23free_set_pool_put_entryP12Vector_BlockP11GC_Metadata
GC library cannot be loaded: libgc_gen_uncomp.so
HMYEXEL062E Internal VM error: Failed to create Java VM
FAILED to invoke JVM.
Test: jitrino.JETClass: thread.ThreadOOM_jetExit code: 1 Err: Loading error /export/users.2/cc/cc-suites/build/checkouts/snapshot/hdk/jdk/jre/bin/default/libgc_gen_uncomp.so: undefined symbol: _Z23free_set_pool_put_entryP12Vector_BlockP11GC_Metadata
GC library cannot be loaded: libgc_gen_uncomp.so
HMYEXEL062E Internal VM error: Failed to create Java VM
FAILED to invoke JVM.
Test: Client mode JIT (default)Class: thread.ThreadOOM_jitExit code: 1 Err: Loading error /export/users.2/cc/cc-suites/build/checkouts/snapshot/hdk/jdk/jre/bin/default/libgc_gen_uncomp.so: undefined symbol: _Z23free_set_pool_put_entryP12Vector_BlockP11GC_Metadata
GC library cannot be loaded: libgc_gen_uncomp.so
HMYEXEL062E Internal VM error: Failed to create Java VM
FAILED to invoke JVM.
Test: jitrino.OPTClass: thread.ThreadOOM_optExit code: 1 Err: Loading error /export/users.2/cc/cc-suites/build/checkouts/snapshot/hdk/jdk/jre/bin/default/libgc_gen_uncomp.so: undefined symbol: _Z23free_set_pool_put_entryP12Vector_BlockP11GC_Metadata
GC library cannot be loaded: libgc_gen_uncomp.so
HMYEXEL062E Internal VM error: Failed to create Java VM
FAILED to invoke JVM.
Test: Server mode JITClass: thread.ThreadOOM_srvExit code: 1 Err: Loading error /export/users.2/cc/cc-suites/build/checkouts/snapshot/hdk/jdk/jre/bin/default/libgc_gen_uncomp.so: undefined symbol: _Z23free_set_pool_put_entryP12Vector_BlockP11GC_Metadata
GC library cannot be loaded: libgc_gen_uncomp.so
HMYEXEL062E Internal VM error: Failed to create Java VM
FAILED to invoke JVM.
Test: interpreterClass: util.Date_intExit code: 1 Err: Loading error /export/users.2/cc/cc-suites/build/checkouts/snapshot/hdk/jdk/jre/bin/default/libgc_gen_uncomp.so: undefined symbol: _Z23free_set_pool_put_entryP12Vector_BlockP11GC_Metadata
GC library cannot be loaded: libgc_gen_uncomp.so
HMYEXEL062E Internal VM error: Failed to create Java VM
FAILED to invoke JVM.
Test: jitrino.JETClass: util.Date_jetExit code: 1 Err: Loading error /export/users.2/cc/cc-suites/build/checkouts/snapshot/hdk/jdk/jre/bin/default/libgc_gen_uncomp.so: undefined symbol: _Z23free_set_pool_put_entryP12Vector_BlockP11GC_Metadata
GC library cannot be loaded: libgc_gen_uncomp.so
HMYEXEL062E Internal VM error: Failed to create Java VM
FAILED to invoke JVM.
Test: Client mode JIT (default)Class: util.Date_jitExit code: 1 Err: Loading error /export/users.2/cc/cc-suites/build/checkouts/snapshot/hdk/jdk/jre/bin/default/libgc_gen_uncomp.so: undefined symbol: _Z23free_set_pool_put_entryP12Vector_BlockP11GC_Metadata
GC library cannot be loaded: libgc_gen_uncomp.so
HMYEXEL062E Internal VM error: Failed to create Java VM
FAILED to invoke JVM.
Test: jitrino.OPTClass: util.Date_optExit code: 1 Err: Loading error /export/users.2/cc/cc-suites/build/checkouts/snapshot/hdk/jdk/jre/bin/default/libgc_gen_uncomp.so: undefined symbol: _Z23free_set_pool_put_entryP12Vector_BlockP11GC_Metadata
GC library cannot be loaded: libgc_gen_uncomp.so
HMYEXEL062E Internal VM error: Failed to create Java VM
FAILED to invoke JVM.
Test: Server mode JITClass: util.Date_srvExit code: 1 Err: Loading error /export/users.2/cc/cc-suites/build/checkouts/snapshot/hdk/jdk/jre/bin/default/libgc_gen_uncomp.so: undefined symbol: _Z23free_set_pool_put_entryP12Vector_BlockP11GC_Metadata
GC library cannot be loaded: libgc_gen_uncomp.so
HMYEXEL062E Internal VM error: Failed to create Java VM
FAILED to invoke JVM.
Test: interpreterClass: util.DoPriveleged_intExit code: 1 Err: Loading error /export/users.2/cc/cc-suites/build/checkouts/snapshot/hdk/jdk/jre/bin/default/libgc_gen_uncomp.so: undefined symbol: _Z23free_set_pool_put_entryP12Vector_BlockP11GC_Metadata
GC library cannot be loaded: libgc_gen_uncomp.so
HMYEXEL062E Internal VM error: Failed to create Java VM
FAILED to invoke JVM.
Test: jitrino.JETClass: util.DoPriveleged_jetExit code: 1 Err: Loading error /export/users.2/cc/cc-suites/build/checkouts/snapshot/hdk/jdk/jre/bin/default/libgc_gen_uncomp.so: undefined symbol: _Z23free_set_pool_put_entryP12Vector_BlockP11GC_Metadata
GC library cannot be loaded: libgc_gen_uncomp.so
HMYEXEL062E Internal VM error: Failed to create Java VM
FAILED to invoke JVM.
Test: Client mode JIT (default)Class: util.DoPriveleged_jitExit code: 1 Err: Loading error /export/users.2/cc/cc-suites/build/checkouts/snapshot/hdk/jdk/jre/bin/default/libgc_gen_uncomp.so: undefined symbol: _Z23free_set_pool_put_entryP12Vector_BlockP11GC_Metadata
GC library cannot be loaded: libgc_gen_uncomp.so
HMYEXEL062E Internal VM error: Failed to create Java VM
FAILED to invoke JVM.
Test: jitrino.OPTClass: util.DoPriveleged_optExit code: 1 Err: Loading error /export/users.2/cc/cc-suites/build/checkouts/snapshot/hdk/jdk/jre/bin/default/libgc_gen_uncomp.so: undefined symbol: _Z23free_set_pool_put_entryP12Vector_BlockP11GC_Metadata
GC library cannot be loaded: libgc_gen_uncomp.so
HMYEXEL062E Internal VM error: Failed to create Java VM
FAILED to invoke JVM.
Test: Server mode JITClass: util.DoPriveleged_srvExit code: 1 Err: Loading error /export/users.2/cc/cc-suites/build/checkouts/snapshot/hdk/jdk/jre/bin/default/libgc_gen_uncomp.so: undefined symbol: _Z23free_set_pool_put_entryP12Vector_BlockP11GC_Metadata
GC library cannot be loaded: libgc_gen_uncomp.so
HMYEXEL062E Internal VM error: Failed to create Java VM
FAILED to invoke JVM.
Test: interpreterClass: util.Prop_intExit code: 1 Err: Loading error /export/users.2/cc/cc-suites/build/checkouts/snapshot/hdk/jdk/jre/bin/default/libgc_gen_uncomp.so: undefined symbol: _Z23free_set_pool_put_entryP12Vector_BlockP11GC_Metadata
GC library cannot be loaded: libgc_gen_uncomp.so
HMYEXEL062E Internal VM error: Failed to create Java VM
FAILED to invoke JVM.
Test: jitrino.JETClass: util.Prop_jetExit code: 1 Err: Loading error /export/users.2/cc/cc-suites/build/checkouts/snapshot/hdk/jdk/jre/bin/default/libgc_gen_uncomp.so: undefined symbol: _Z23free_set_pool_put_entryP12Vector_BlockP11GC_Metadata
GC library cannot be loaded: libgc_gen_uncomp.so
HMYEXEL062E Internal VM error: Failed to create Java VM
FAILED to invoke JVM.
Test: Client mode JIT (default)Class: util.Prop_jitExit code: 1 Err: Loading error /export/users.2/cc/cc-suites/build/checkouts/snapshot/hdk/jdk/jre/bin/default/libgc_gen_uncomp.so: undefined symbol: _Z23free_set_pool_put_entryP12Vector_BlockP11GC_Metadata
GC library cannot be loaded: libgc_gen_uncomp.so
HMYEXEL062E Internal VM error: Failed to create Java VM
FAILED to invoke JVM.
Test: jitrino.OPTClass: util.Prop_optExit code: 1 Err: Loading error /export/users.2/cc/cc-suites/build/checkouts/snapshot/hdk/jdk/jre/bin/default/libgc_gen_uncomp.so: undefined symbol: _Z23free_set_pool_put_entryP12Vector_BlockP11GC_Metadata
GC library cannot be loaded: libgc_gen_uncomp.so
HMYEXEL062E Internal VM error: Failed to create Java VM
FAILED to invoke JVM.
Test: Server mode JITClass: util.Prop_srvExit code: 1 Err: Loading error /export/users.2/cc/cc-suites/build/checkouts/snapshot/hdk/jdk/jre/bin/default/libgc_gen_uncomp.so: undefined symbol: _Z23free_set_pool_put_entryP12Vector_BlockP11GC_Metadata
GC library cannot be loaded: libgc_gen_uncomp.so
HMYEXEL062E Internal VM error: Failed to create Java VM
FAILED to invoke JVM.
Test: interpreterClass: util.StringIntern_intExit code: 1 Err: Loading error /export/users.2/cc/cc-suites/build/checkouts/snapshot/hdk/jdk/jre/bin/default/libgc_gen_uncomp.so: undefined symbol: _Z23free_set_pool_put_entryP12Vector_BlockP11GC_Metadata
GC library cannot be loaded: libgc_gen_uncomp.so
HMYEXEL062E Internal VM error: Failed to create Java VM
FAILED to invoke JVM.
Test: jitrino.JETClass: util.StringIntern_jetExit code: 1 Err: Loading error /export/users.2/cc/cc-suites/build/checkouts/snapshot/hdk/jdk/jre/bin/default/libgc_gen_uncomp.so: undefined symbol: _Z23free_set_pool_put_entryP12Vector_BlockP11GC_Metadata
GC library cannot be loaded: libgc_gen_uncomp.so
HMYEXEL062E Internal VM error: Failed to create Java VM
FAILED to invoke JVM.
Test: Client mode JIT (default)Class: util.StringIntern_jitExit code: 1 Err: Loading error /export/users.2/cc/cc-suites/build/checkouts/snapshot/hdk/jdk/jre/bin/default/libgc_gen_uncomp.so: undefined symbol: _Z23free_set_pool_put_entryP12Vector_BlockP11GC_Metadata
GC library cannot be loaded: libgc_gen_uncomp.so
HMYEXEL062E Internal VM error: Failed to create Java VM
FAILED to invoke JVM.
Test: jitrino.OPTClass: util.StringIntern_optExit code: 1 Err: Loading error /export/users.2/cc/cc-suites/build/checkouts/snapshot/hdk/jdk/jre/bin/default/libgc_gen_uncomp.so: undefined symbol: _Z23free_set_pool_put_entryP12Vector_BlockP11GC_Metadata
GC library cannot be loaded: libgc_gen_uncomp.so
HMYEXEL062E Internal VM error: Failed to create Java VM
FAILED to invoke JVM.
Test: Server mode JITClass: util.StringIntern_srvExit code: 1 Err: Loading error /export/users.2/cc/cc-suites/build/checkouts/snapshot/hdk/jdk/jre/bin/default/libgc_gen_uncomp.so: undefined symbol: _Z23free_set_pool_put_entryP12Vector_BlockP11GC_Metadata
GC library cannot be loaded: libgc_gen_uncomp.so
HMYEXEL062E Internal VM error: Failed to create Java VM
FAILED to invoke JVM.

***********************************************************
Modifications since last successful build:	(1)
            
add cc-snapshot log20071227141238Lbuild.73 12/27/2007 14:12:38snapshot

begin 644 execution_log.zip
M4$L#! H    ( %>-FS?)5\,8>14  #BG 0 2    97AE8W5T:6]N7VQO9RYH
M=&UL[9U];]LXMH?_[Z<@4%SL; '+<=(FC6^G0)ND;;K))+=.NSM;%(8LT383
M210H*8W[Z>\A);_%HJ3H)59F3C"3VC')\_#M\%#B3WXS#5WG[9L1MV=OW_B"
MOGUCDB"<.?3W?XRY%W8"]HOVR>N=__G??[Q]%OFV&=).<.OUGSWKQ._ZSXC\
M^4[OJ/6#'$VI=4-MPJ.0"'K+ L8]LK^S?[B[;R0)K\U;\P=Y'S'''C,'"G?-
M&]H=R??&G>NLI5I[8].06J'! \,4UM2P[NX,:SSIZS,PCX5&Y+&[O#0_F9>1
MQ'*H>>]S^<JF#@#](,?R7^9-B,T$\'$Q(UUZYW,1=J. BL#8[5H6_-<)(A;2
M(*YIUY(-!:T4=*?V3?<G%S=0Q/#633YVO+LA,_=VAQ/+&@JP8 943_C^Z^G9
M,1E\/3HZ&0P^?#U;^_"*AZ9#0N9"4^^1@%K<LX.J?4'O0BJ\H4W]C8:18\&:
M<GC]-9#-<G3V;C X.WU/?B_?+I9C!H'#1G4/CNR.+S)^ AH: 7598$#W!YN-
M\=V]@0]@8@@*D\66@Z3?T/CH*@X]ZOI\U=17WYW7)M2/A"+*&(@3: W3"V&(
MA8*-,DSY3C1A7K&TJBED4N,6F@L<2G9W1+XA:, C8=$@-V5<MAS[^6E]P7TJ
M0G8_Z6HC16K(0\J[F<PE_0(TFGIO,#<PF!=2Q["X2^0 Z!_V>AE#FO_T'&[:
M4!V7AS27,O)^L6)UCVNMTOO4-N+);#J96;@_,SP:!/"?*6:&&@U9 \&C D:;
MJK LV[@U!3-'V34P?=^9&;X9 F!J(TL*F$OP6S9SC\@F(2&O84+!TM>!TAE5
M<ZO[[O)+U_1%IV?L&OMY4VK1@(4:O["SWETXZV<BB@?]YJ)S<+"G6B$@8P&C
MJD!# &/D0#/8PKEU._#WL.IB /% )_:_67,($LD9E)'D+[*H5(\X5!)P$C H
M8<+9ALOM++^=M09M)"PRV1_BG9.TEN^'9G"35:IN>;D+G/ 'N10<YHWJW.JS
M68U<&$<.G\FA6X^+T*^Y*Z:T]3L#3RXKIX+K8$II6%<] T"1<:<!AK3SYHA[
M8S:)P"=O+*!KTTO^?.*!\BV?X6.88#WCE;$SW-DGOPTBCYPS2_!@%H34#<BI
M9QG_S"QL/LF(X#RL?;9NH"]_> #6SI@7W17+(6<XY) =7- $N /( (.A:/KQ
M!-*G!?,;><!9+K=/OR<;J#PSTF%PCWJAK'D\(G/)IK"H<R-@DFP,3B&;"U([
MW()U[I?LT;0<:V^N;]V0&7*%R0PL7!]6FXY*K):CH",_V6XHK3BZRPH$737^
MZ'IX3;Y/921T:\J=KZJ'G#8O21P$).MR<[ZG&&1N:WO@$VYIV]H[IM(.Q^?/
M5UK\\[?SJU,2YPA(G[P'XAN?0^S9:V6MNEF \IT% VH71HX,!A>C:$3GW6<;
MVER#T!3*>4/#W.C'08>Z(VIW7--CXXWY6;B=+[G_09@N;6DKZ_&>4!L/X(\.
M'834;VDK9P$^H7;^=GX*\6E+VU@'-V^IWM;:=WTO(%97EK:M*()*.QF+8Z%X
M!;;BJZMG2RO9O6:A=A[D1H6_Y_[D%O$%M@KQ%%-<R86Q(X=!?$KD?I9\/KTB
MO]ET;$9.F+V'J E)FP!8/4F7&39<P[9^91M'A>#B8=T:>*8?3'FH^O=:_B]H
M=\2\;M((70BJ)]9P0KUAY,G9:P2\3R(//F8>#*1@YHZXTR?#_^[NC06E0]C.
M#WW.G:$?A4-H5S&[[.U^4WO!X7L(U&\N>[V/1\-S&IJV&9K:.GT\ @\P$J:8
M$<OT/-BG@?N05QZIW2<I4-J"/IW_>?*?D[.=_=T3V!K&UQG L<:-U2<?3.F/
MI'NRU-R(-YC?SK7E?7AW>G9R+#,P[Y;?4#FB-MW9//45#+35/C167B=%Y0Z!
MC(@&!\"3& "+'C06KXIV?F:HA=W_)+I_I0^-E==%AX V"L3N?Q+=G_2?D?R;
MUNU/,IJC;8SF(,84S./&YY,KC-]P F/\A@, XS?L?HS?L/LQ?EN+W[C?YOCM
MXG*[\5MFSOB\#[VSG,B.;ZE6.46P?G(B*368OS#4F:AAW(../#M@W+W>-Z#W
M2,Z1B;PJKH0RJS?_U,UC;:85_[=ZER4[4S)SYK<,LA,OEMCEO;+L#$5/7V2W
M1I& O7AD]Y PH,AZ\10=##1A"QV,.OSI"PJ_<8.($0)N$'$ X 81NQ\WB-C]
MN$%<B]\"<=O"^&U Q2T5B^,:N$G,V"1"#^(F\6^Z2;2D@RIPT-WE'@RNK#2R
MH$YR<J\-OFI9LZ#+1]<M(X+%5=MYRY.>L4<S/9N,Y=B0Q@Q#?RIR=^]AARD3
M>V?,NU&F^NKW4*88FF$H JVEG9I/;>;BC,R I:A5MH7#; AJV#A%I;(U(AG4
MB"CM:NVVD,!G, CX6C2*?%.DY-@:32B&%O=2PJ=M$051X%//;@50?'Z\11,_
M 1J;X7QDMPFKA5T73IG7JJ8*&;C)(!21VQ8<I4D<!M! YB1%,;8=J*3+H*W&
MFQOJ+3'Y$$F#LXS2;A9LATB8/]NUP@%3$$(HVQ:8D+F0[=%H4G8C\V=/M"CN
M3U/RK+;C?..F4J?&^NL)"X3LR?.MOJB'9_1);^]06^B+%R_F5[9>R->%2M?A
M:%;NFG"TI>MP]"%[3419!K10^JB]+JHL"SHLO5^KB2K+@ XJ/7BO"4A7N!9&
M&[O7!91A0 >EC0%K8LHH/P4I.X!/D*Z82\&I]LD-<]05^"DE0322S]N1SU3)
MK\K+O8=6)8]+7Y7,T']^H?#RW6  %A^>,]5D7I=NK_U*#8;L+<'6ZY2'EU*Q
MK#U%]6F777HZ3LZ>HA:H7!OI:-D[BUK(\DRD@V5M+](G=K%,&X:R=PW;FP %
MT-(KI-ERU-*7VK+3470;#FT'IF1(VT6HD'U](Q'?V(T_@?X2IA>,N7"3Q]\=
M]%Z[^B:\5'L#V/=X]LH%_N39=L2LX^%:Q38C.17/NRL4N/R&YMXZVGP"[?KG
M\8[/6!9FM.>A/DNH^>,L-GNU%53=8!J%\J&;VD&WO*>T-;:N/ 5Q;%+P,1?>
MO\VTISR0;3\3I(U-]L&$MCB1YU2PP0HUV&GNK;"6/'1FT_FUS>L5?W3<ZYW'
M?79<'N7:&[5[5:N^RM:V5LZ[**@/:9*?&DXOR8D#%?_\[?R!%=>>'92V'H.\
M<+</?[)P.KQFX5#M#Q8'_/4>[3'P!Q(M"02YU]+G#&7FW,(1MGCV+(^P0:=6
M/<*FOO\AYS@9%>,"R;0?/"<C>2),]7,T@GUC1/;)SRZYN#@_T6:"W3_L^;I7
M4\AJ!Z4M?WKWY?SBCS\[>R\/7Y&IZ4V"6./BLC"$ >?H+UM/K.X?ER?5#>_T
M=A9O7NX>ZI]5F]08EML*+;TP>]@[R*K:);1%R-TO=$P%]2PJ_6"V4<CT;^C%
M!^0H@KF?L4,.5=]WSTUOE@R#"C;3?O+VV,H]P<;Y$TM)&;_^#+^7V_T';/8_
M,?);3VY_(1RRJ=[-W4-1HT,V0_U$BZ)+@<5/>Y9'U(5Q)%_+DC[2\)C")P(2
MJC_63UW,;N4JG=Q9U)=/XC[UY-%29CKL%Q7-=$0QNY6K=,8G9^I5LS58F*D,
M_ <//_ H]=I[C;QS*Y5Q!\J?/T83KUHJA4WGHVPYWAIT-%G6*N)_8)Z:(8]"
MOV&L(CR$&TWB0O&E ">6K.D[Q^%I]PTKXJT47@$N]HI-T<6EE\;CPDJ[FE\#
MFBRY-)8P)RY-O8=3 UE2>'DXVE"30<%EH<XN!HTP0;FED5@3'BXIN"S4>?J9
MDNI0LN#24&"0);N(9N!6#)2%O+\I^[^(1K2952S+6EE\*.D+=7GJ=T!4QUV4
M7AHO\A;./+CP3NY8V%C;:FR518\#/&B!1F 7I9?&FWG65' /:FLOJ]U8X^K-
ME:U /&\'ZFB/_ :?1K#O&RD%J[YH3-T56]L0U@^L,50>^B*<-L:IRBZ'QHUW
M0IBS9E;2U=++XLG;>A.:>C:E.MV\\%)PUQXSY*;S+'Y40?V ]PR4@N11R,<N
M+!QB9ASS:.0TL#IMVJB,>MI$9'[/0&7(2\=,U?/6B*E,5 9M9.6\9Z R)*P/
M_&>SF,I$9=#X@2;-DL8V:D)]C'F_:JDF[,9]P,),3<"-3[.%F5+ /A5C(S[J
M(.\I+2X^-K"T:DW5"RZ_>3></B)^;+!\)59WR0/F^DW,2HVA\M #>DN%Z31V
M]2#%2 58M9D[XL*C8@ 1>U.X]\S4!SQ,N[G;!/+0+ ^M%E(Y-1IB791? V+C
M?B[%4JW8C7HYK;T:JO XX!5P!1W+;Z(V/M+PG(93WL"MU0T3I4#G!UV-_,/4
M58&UIJJ#9QUIKA5[::@Z=,:QXEJ9%W:J(Y]QJX$[$!LFRH&J5<AXSR8#^2SW
MR?MH/&[BNEBZG2K(#=YGO6^A"F;\F,O&&./BJP">L[0ON*^'#LJN@B:OK#?&
M)@NO M?498>UXJL RN.1G\Q@ZII^,_<^TNV40H[/5AKRQM0@\6N?.&_ :VH,
M58$^]<;RJC]MT"'I+%7#3A:X9N*6-"M5< <.I7YCF*KT2GBNZ3CQR2OUAV9F
M7(:Q*O!Q*0U&5NEVJB-?7&P^&[I>6+!0"C,*F6,<IPNG*_(MBJX QB\%NZ4.
MG= &]E@;)LJ#7@K>P*1?%%T>+(YBFPKN-DP4 [VO:2>)).]1I>UYDKJU-_+W
M4].&M>5;2S-SMD$-1E$-EFT9U6#I54,U&$$U&*K!"E<)U6"H!GL@+JK!-.BH
M!D,UV,HI:52#E45#-1BJP5 -5@P*U6"H!D,U6"HLJL%0#;8!C&JP.N!0#58%
M$-5@S7&B&JQ.3%2#U4R*:C!4@^F 40V&:K \>%2#H1H,U6"H!BL#CVJP&EE1
M#89JL$+,J :KEQ;58(TPHAH,U6"H!BO.C&HP5(.A&@S58$5A40V&:C!4@Z$:
M+$4-=G&):K L-1CW40V6;1G58.E50S480348JL$*5PG58*@&>R NJL$TZ*@&
M0S78RBEI5(.514,U&*K!4 U6# K58*@&0S58*BRJP5 -M@&,:K ZX% -5@40
MU6#-<:(:K$Y,5(/53(IJ,%2#Z8!1#89JL#QX5(.A&@S58*@&*P./:K :65$-
MAFJP0LRH!JN7%M5@C3"B&@S58*@&*\Z,:C!4@Z$:#-5@16%1#89J,%2#H1IL
M10VVPO48ULM5O05J,&BG)Z$&"YS4^YSQQQ.K*\_Y5586[1X>Z 50C'?G)Q]*
M&QJ;S%F3M#V\D+HU;JCYNF_S:LJ"I)EC!PUO;ZF8J3%8U+<DW10O#"@_0_D9
MRL]0?M84+\K/4'Y6C![E9]7Q4'Z&\C.4G_VUY&=/0>G5B*^-RT7Q60.X*#Y#
M\5F>.12?U0:,XK,ZX*J*SU#?E7"BOJLQ3-1WU8F)^JZ&@5'?]0C J.]"?5<>
M/.J[4-^%^B[4=Y6!1WU7C:RH[T)]5R%FU'?52_MWU7>U63XE[\0W!J=*1W47
MJKORD5'=580:U5U-8:*Z"]5=J;"H[D)U%ZJ[4-VUHNX:4'$+2Z\+74$^G^+W
M?64IO )Q^R047OA]7_A]7^F8^'U?*+BJ1(V"*Q1<U<J+@BL47!6C1\%5=3P4
M7*'@"@57?RW!%7[?%TJNZL=%R15*KO+,H>2J-F"47-4!A]_W5040]6#-<:(>
MK$Y,U(/53(IZ,-2#Z8!1#X9ZL#QXU(.A'@SU8*@'*P./>K :65$/AGJP0LRH
M!ZN7]N^J!\/O^T)%&"K"\I!1$5:$&A5A36&B(@P58:FPJ A#11@JPAI3A*G2
MAG&R=>70]^L(EKKXDQ_D2IA>,.;")2%S:9\<[O7VW;0+2'%#7$UC!1>)\\NO
MU6%>BZJ]3-S7)[J!?J=.7BJ+NSYS:"=.W=E,K5ZZ-S83/TA\#=TF\*;?;'.L
MP ?=9!BN8WV?SI1VQ@(L50<YQ7K[KTC (WF05"K8 A+R;7-NO_E@YJHF*=* 
M+[?8?!I.>&5#II#^(,?R7XD)+:CV-[/'[]VNQ\/QAFYC[8V(O%;/IS3_LNK^
MM!_,?VH0J<J8$VK^^=OY VL>>*8?3'FHFN!:_B]H=\2\KK3U&.3Z?N_<Z_C.
MR RM:5N[OWO-0D/JDK<Z#B X2E:J1#,=*1WRD</D@?NY;)K\9M.Q"?''/Q\%
MJER+;$%!G?3K4D(-?5I50OU<?J\@#>8:=E/ *\ZSO]92_J7KF-ZD"_TI0ZQW
MMLWDW2?3D1/]15EE[7/I)U9)(B\(37DF18:D4@!-^#BD:2%T(;!>+YLL)_O>
MRVK9#RME?[E3+7NUNK_<+2V7/HG'L$U&U#)A8D ?+C7EKPY?%T>2($5K,9C!
MBN.>W(7Q>>7\K!DU6.K27^T5,+U0\A[3 "(7^QT$$B(1"H91V<<!I/ULKC5J
M'[3<A'(Q,4S?!)]C3$WA<F]F2$1C0CTJF!7$JN-8?)EZ$6I>H$RB_)VZ+U?/
M$IXX^:[#1A-K"$C#R),;%"/@L*GUX&/FP; )9NZ(.WTR_._NWEA0.@QH./0Y
M=X9^% YAW1"SR]YN? 5\^-[AULUEK_?Q:'A.0],VP\VFGM?IXQ%QDL.YENE!
MH <CE"A5JMTG*5#:@CZ=_WGRGY.SG?W=$Q+OP$V'?#N/&ZM//IBP.-@RNK94
M"!#O]+]M7HR:EY=L[R$#\V[E\T4@;C*TJ:^4NXSS_'6B%=K>: 567<$\;GP^
MN<+X)#L^H1B?/  ,XQ.,3S ^P?@$XY/6QR?<;W]\<G&)\4EV? *]B/%)<3",
M3S ^P?@$XQ.,3UH?GS"OO?')RL-[,3[)C$^@I3 ^*0Z&\0G&)QB?8'R"\4GK
MXY- W+8V/KGW$'^,43)CE!H>XX\Q2N'L&*-@C((Q"L8H3S)&B1=__6'I;!7'
MZX-[&H[LY =[#TO>>U#R5Z\?E'S_OOYD[8T:I]EGR)<S\(7^)SL7^==JJ!,H
M/T!R<Q6RE>,P],=[4T;,9O;5\S8/RB!O@!7*L'I%JE"&^R%BWLA?+6%5=V6#
M?U 3<ZZWDB[G@;ZMCGA\*;$P])4(>61-.V, C@"W(\/-M(%J<7\F12;^3&ET
MXK"T86F)'KJ8+BKGX_=?3\^.TSJYIEA;O33N7*?_:F>_3P;<G4>@8S4\]&17
M/ 0_'SN9WNXN<2$NAYSD98\$U.+>O4=^*:]_7V.XWF%[!Z\?) =*1FY7;0^4
M]WJ6#(1?S(>FDXEDN?"NT$9SL[SA[L[. 53N8-A[!1$H%/3LF=3LT3MJ13*F
MF2]6\AOB2 B?C+D#>X=D;Q0_&*FOLJQ\H(((;EF1@/"(_)S*49J4*-6;4Q; 
M^NO!",]DAM7=AVFSBCO_F^K/ ^A., S[B)_RUS(5F<^C9V^ZYMLW7? ^\'O$
M[1G\,PU=Y^W_ U!+ 0(4 PH    ( %>-FS?)5\,8>14  #BG 0 2        
M      "D@0    !E>&5C=71I;VY?;&]G+FAT;6Q02P4&      $  0!     
&J14      
end


Mime
View raw message