harmony-alerts mailing list archives

Site index · List index
Message view « Date » · « Thread »
Top « Date » · « Thread »
From nom...@intel.com
Subject [build-test alert] FAILED Windows 2003 x86_64: jdktools-test debug
Date Thu, 27 Dec 2007 09:58:00 GMT

BUILD FAILED:
	Ant Error Message:
C:\cc\cc-common\scripts\cc-exec-adaptor.xml:104: The following error occurred while executing
this line: C:\cc\cc-common\adaptors\jdktools-test\adaptor.xml:23: The following error occurred
while executing this line: C:\cc\cc-common\build\checkouts\hdk\working_jdktools\build.xml:242:
The following error occurred while executing this line: C:\cc\cc-common\build\checkouts\hdk\working_jdktools\make\build-test.xml:97:
There were test errors.

Date of build:	2007-12-27 15:32:02 +0600
Time to build:	25 minutes 50 seconds
Last changed:	12/27/2007 07:52:30
Last log entry:	hdk

***********************************************************
Errors/Warnings:	(226)
            
Result: 1
========================================
Testing jdktools binaries...
========================================
Compiling JPDA tests
Since fork is false, ignoring memoryMaximumSize setting
----------
1. WARNING in C:\cc\cc-common\build\checkouts\hdk\working_jdktools\modules\jpda\test\common\unit\org\apache\harmony\jpda\tests\framework\DebuggeeRegister.java
(at line 58)
registered.add(debuggee);
^^^^^^^^^^^^^^^^^^^^^^^^
Type safety: The method add(Object) belongs to the raw type LinkedList. References to generic
type LinkedList<E> should be parameterized
----------
----------
2. WARNING in C:\cc\cc-common\build\checkouts\hdk\working_jdktools\modules\jpda\test\common\unit\org\apache\harmony\jpda\tests\framework\TestOptions.java
(at line 505)
internalProperties.put(name, value);
^^^^^^^^^^^^^^^^^^^^^^^^^^^^^^^^^^^
Type safety: The method put(Object, Object) belongs to the raw type HashMap. References to
generic type HashMap<K,V> should be parameterized
----------
----------
3. WARNING in C:\cc\cc-common\build\checkouts\hdk\working_jdktools\modules\jpda\test\common\unit\org\apache\harmony\jpda\tests\framework\jdwp\PacketDispatcher.java
(at line 114)
eventQueue.add(eventPacket);
^^^^^^^^^^^^^^^^^^^^^^^^^^^
Type safety: The method add(Object) belongs to the raw type List. References to generic type
List<E> should be parameterized
----------
4. WARNING in C:\cc\cc-common\build\checkouts\hdk\working_jdktools\modules\jpda\test\common\unit\org\apache\harmony\jpda\tests\framework\jdwp\PacketDispatcher.java
(at line 249)
replies.put(new Integer(replyPacket.getId()),
replyPacket);
^^^^^^^^^^^^^^^^^^^^^^^^^^^^^^^^^^^^^^^^^^^^^^^^^^^^^^^^^^^^^^^^^^^^^^^^^^^^^^^^^^^^^^^^^^^
Type safety: The method put(Object, Object) belongs to the raw type Hashtable. References
to generic type Hashtable<K,V> should be parameterized
----------
5. WARNING in C:\cc\cc-common\build\checkouts\hdk\working_jdktools\modules\jpda\test\common\unit\org\apache\harmony\jpda\tests\framework\jdwp\PacketDispatcher.java
(at line 284)
commands.put(Id, command);
^^^^^^^^^^^^^^^^^^^^^^^^^
Type safety: The method put(Object, Object) belongs to the raw type Hashtable. References
to generic type Hashtable<K,V> should be parameterized
----------
6. WARNING in C:\cc\cc-common\build\checkouts\hdk\working_jdktools\modules\jpda\test\common\unit\org\apache\harmony\jpda\tests\framework\jdwp\PacketDispatcher.java
(at line 355)
commands.put(Id, command);
^^^^^^^^^^^^^^^^^^^^^^^^^
Type safety: The method put(Object, Object) belongs to the raw type Hashtable. References
to generic type Hashtable<K,V> should be parameterized
----------
----------
7. WARNING in C:\cc\cc-common\build\checkouts\hdk\working_jdktools\modules\jpda\test\common\unit\org\apache\harmony\jpda\tests\framework\jdwp\VmMirror.java
(at line 1834)
frames.add(frame);
^^^^^^^^^^^^^^^^^
Type safety: The method add(Object) belongs to the raw type ArrayList. References to generic
type ArrayList<E> should be parameterized
----------
8. WARNING in C:\cc\cc-common\build\checkouts\hdk\working_jdktools\modules\jpda\test\common\unit\org\apache\harmony\jpda\tests\framework\jdwp\VmMirror.java
(at line 1902)
vars.add(var);
^^^^^^^^^^^^^
Type safety: The method add(Object) belongs to the raw type ArrayList. References to generic
type ArrayList<E> should be parameterized
----------
9. WARNING in C:\cc\cc-common\build\checkouts\hdk\working_jdktools\modules\jpda\test\common\unit\org\apache\harmony\jpda\tests\framework\jdwp\VmMirror.java
(at line 2122)
fields.add(superClassFields.toArray()[i]);
^^^^^^^^^^^^^^^^^^^^^^^^^^^^^^^^^^^^^^^^^
Type safety: The method add(Object) belongs to the raw type ArrayList. References to generic
type ArrayList<E> should be parameterized
----------
10. WARNING in C:\cc\cc-common\build\checkouts\hdk\working_jdktools\modules\jpda\test\common\unit\org\apache\harmony\jpda\tests\framework\jdwp\VmMirror.java
(at line 2132)
fields.add(field);
^^^^^^^^^^^^^^^^^
Type safety: The method add(Object) belongs to the raw type ArrayList. References to generic
type ArrayList<E> should be parameterized
----------
----------
11. WARNING in C:\cc\cc-common\build\checkouts\hdk\working_jdktools\modules\jpda\test\common\unit\org\apache\harmony\jpda\tests\jdwp\DebuggerOnDemand\OnthowDebuggerLaunchDebuggee.java
(at line 94)
class ExceptionForDebugger extends Exception {
^^^^^^^^^^^^^^^^^^^^
The serializable class ExceptionForDebugger does not declare a static final serialVersionUID
field of type long
----------
----------
12. WARNING in C:\cc\cc-common\build\checkouts\hdk\working_jdktools\modules\jpda\test\common\unit\org\apache\harmony\jpda\tests\jdwp\Events\ClassUnloadDebuggee.java
(at line 32)
import java.util.LinkedList;
^^^^^^^^^^^^^^^^^^^^
The import java.util.LinkedList is never used
----------
13. WARNING in C:\cc\cc-common\build\checkouts\hdk\working_jdktools\modules\jpda\test\common\unit\org\apache\harmony\jpda\tests\jdwp\Events\ClassUnloadDebuggee.java
(at line 97)
boolean isOutOfMemory = false;
^^^^^^^^^^^^^
The local variable isOutOfMemory is never read
----------
14. WARNING in C:\cc\cc-common\build\checkouts\hdk\working_jdktools\modules\jpda\test\common\unit\org\apache\harmony\jpda\tests\jdwp\Events\ClassUnloadDebuggee.java
(at line 171)
public Class loadClass(String name) throws ClassNotFoundException {
^^^^^
Type safety: The return type Class for loadClass(String) from the type ClassUnloadDebuggee.CustomLoader
needs unchecked conversion to conform to Class<?> from the type ClassLoader
----------
15. WARNING in C:\cc\cc-common\build\checkouts\hdk\working_jdktools\modules\jpda\test\common\unit\org\apache\harmony\jpda\tests\jdwp\Events\ClassUnloadDebuggee.java
(at line 179)
public Class findClass(String name) throws ClassNotFoundException {
^^^^^
Type safety: The return type Class for findClass(String) from the type ClassUnloadDebuggee.CustomLoader
needs unchecked conversion to conform to Class<?> from the type ClassLoader
----------
----------
16. WARNING in C:\cc\cc-common\build\checkouts\hdk\working_jdktools\modules\jpda\test\common\unit\org\apache\harmony\jpda\tests\jdwp\Events\CombinedEvents002Test.java
(at line 100)
boolean expectColocatedEvents = (testedMethodStartCodeIndex == testedMethodEndCodeIndex);
^^^^^^^^^^^^^^^^^^^^^
The local variable expectColocatedEvents is never read
----------
----------
17. WARNING in C:\cc\cc-common\build\checkouts\hdk\working_jdktools\modules\jpda\test\common\unit\org\apache\harmony\jpda\tests\jdwp\Events\CombinedEvents003Test.java
(at line 53)
private boolean eventMethodExitReceived = false;
^^^^^^^^^^^^^^^^^^^^^^^
The field CombinedEvents003Test.eventMethodExitReceived is never read locally
----------
18. WARNING in C:\cc\cc-common\build\checkouts\hdk\working_jdktools\modules\jpda\test\common\unit\org\apache\harmony\jpda\tests\jdwp\Events\CombinedEvents003Test.java
(at line 76)
int EXPECTED_EVENTS_COUNT = EXPECTED_EVENTS_ARRAY.length;
^^^^^^^^^^^^^^^^^^^^^
The local variable EXPECTED_EVENTS_COUNT is never read
----------
----------
19. WARNING in C:\cc\cc-common\build\checkouts\hdk\working_jdktools\modules\jpda\test\common\unit\org\apache\harmony\jpda\tests\jdwp\Events\CombinedEventsTest.java
(at line 84)
int EXPECTED_EVENTS_COUNT = EXPECTED_EVENTS_ARRAY.length;
^^^^^^^^^^^^^^^^^^^^^
The local variable EXPECTED_EVENTS_COUNT is never read
----------
20. WARNING in C:\cc\cc-common\build\checkouts\hdk\working_jdktools\modules\jpda\test\common\unit\org\apache\harmony\jpda\tests\jdwp\Events\CombinedEventsTest.java
(at line 212)
int EXPECTED_EVENTS_COUNT = EXPECTED_EVENTS_ARRAY.length;
^^^^^^^^^^^^^^^^^^^^^
The local variable EXPECTED_EVENTS_COUNT is never read
----------
21. WARNING in C:\cc\cc-common\build\checkouts\hdk\working_jdktools\modules\jpda\test\common\unit\org\apache\harmony\jpda\tests\jdwp\Events\CombinedEventsTest.java
(at line 348)
int EXPECTED_EVENTS_COUNT = EXPECTED_EVENTS_ARRAY.length;
^^^^^^^^^^^^^^^^^^^^^
The local variable EXPECTED_EVENTS_COUNT is never read
----------
22. WARNING in C:\cc\cc-common\build\checkouts\hdk\working_jdktools\modules\jpda\test\common\unit\org\apache\harmony\jpda\tests\jdwp\Events\CombinedEventsTest.java
(at line 732)
String failureMessage = "## FAILURE during checking events! !";
^^^^^^^^^^^^^^
The local variable failureMessage is never read
----------
23. WARNING in C:\cc\cc-common\build\checkouts\hdk\working_jdktools\modules\jpda\test\common\unit\org\apache\harmony\jpda\tests\jdwp\Events\CombinedEventsTest.java
(at line 894)
String failureMessage = "## FAILURE during checking events !";
^^^^^^^^^^^^^^
The local variable failureMessage is never read
----------
----------
24. WARNING in C:\cc\cc-common\build\checkouts\hdk\working_jdktools\modules\jpda\test\common\unit\org\apache\harmony\jpda\tests\jdwp\Events\CombinedEventsTestCase.java
(at line 135)
long methodStartCodeIndex = lineTableReply.getNextValueAsLong();
^^^^^^^^^^^^^^^^^^^^
The local variable methodStartCodeIndex is never read
----------
25. WARNING in C:\cc\cc-common\build\checkouts\hdk\working_jdktools\modules\jpda\test\common\unit\org\apache\harmony\jpda\tests\jdwp\Events\CombinedEventsTestCase.java
(at line 187)
long methodStartCodeIndex = reply.getNextValueAsLong();
^^^^^^^^^^^^^^^^^^^^
The local variable methodStartCodeIndex is never read
----------
----------
26. WARNING in C:\cc\cc-common\build\checkouts\hdk\working_jdktools\modules\jpda\test\common\unit\org\apache\harmony\jpda\tests\jdwp\Events\ExceptionTest.java
(at line 188)
long frameID = reply.getNextValueAsFrameID();
^^^^^^^
The local variable frameID is never read
----------
----------
27. WARNING in C:\cc\cc-common\build\checkouts\hdk\working_jdktools\modules\jpda\test\common\unit\org\apache\harmony\jpda\tests\jdwp\ThreadReference\FramesTest.java
(at line 450)
frames.add(new FrameStruct(frameID, loc));
^^^^^^^^^^^^^^^^^^^^^^^^^^^^^^^^^^^^^^^^^
Type safety: The method add(Object) belongs to the raw type Vector. References to generic
type Vector<E> should be parameterized
----------
----------
28. WARNING in C:\cc\cc-common\build\checkouts\hdk\working_jdktools\modules\jpda\test\common\unit\org\apache\harmony\jpda\tests\jdwp\share\JDWPUnitDebuggeeProcessWrapper.java
(at line 233)
argv.add(val);
^^^^^^^^^^^^^
Type safety: The method add(Object) belongs to the raw type Vector. References to generic
type Vector<E> should be parameterized
----------
29. WARNING in C:\cc\cc-common\build\checkouts\hdk\working_jdktools\modules\jpda\test\common\unit\org\apache\harmony\jpda\tests\jdwp\share\JDWPUnitDebuggeeProcessWrapper.java
(at line 253)
return (String[])argv.toArray(args);
^^^^^^^^^^^^^^^^^^
Type safety: The method toArray(Object[]) belongs to the raw type Vector. References to generic
type Vector<E> should be parameterized
----------
29 problems (29 warnings)
JPDA exclude list: C:\cc\cc-common\build\checkouts\hdk\working_classlib\deploy\build\jdktools.jpda.exclude
Running JPDA tests
Debugger JVM=C:\cc\cc-common\build\checkouts\hdk\target\hdk\jdk\jre/bin/java
Debuggee JVM=C:\cc\cc-common\build\checkouts\hdk\target\hdk\jdk\jre/bin/java
SAMSA exclude list: C:\cc\cc-common\build\checkouts\hdk\working_classlib\deploy\build\jdktools.samsa.exclude
Running SAMSA tests
test.jre.home=C:\cc\cc-common\build\checkouts\hdk\target\hdk\jdk\jre
Run jdk/bin/java -version in C:\cc\cc-common\build\checkouts\hdk\working_jdktools\build\test_report
java version "1.5.0"
pre-alpha : not complete or compatible
svn = r606993, (Dec 27 2007), Windows/em64t/msvc 1400, debug build
http://harmony.apache.org
Run jdk/bin/javac -version in C:\cc\cc-common\build\checkouts\hdk\working_jdktools\build\test_report
Run jdk/bin/javah in C:\cc\cc-common\build\checkouts\hdk\working_jdktools\build\test_report
Run jdk/bin/javadoc in C:\cc\cc-common\build\checkouts\hdk\working_jdktools\build\test_report
Run jdk/bin/jarsigner in C:\cc\cc-common\build\checkouts\hdk\working_jdktools\build\test_report
Run jdk/bin/keytool -help in C:\cc\cc-common\build\checkouts\hdk\working_jdktools\build\test_report
Compiling TOOLS tests
Since fork is false, ignoring memoryMaximumSize setting
----------
1. WARNING in C:\cc\cc-common\build\checkouts\hdk\working_jdktools\modules\tools\src\test\java\org\apache\harmony\tests\tools\javah\Test\Test01.java
(at line 24)
private static final long xxx2 = 1;
^^^^
The field Test01.xxx2 is never read locally
----------
1 problem (1 warning)
TOOLS exclude list: C:\cc\cc-common\build\checkouts\hdk\working_classlib\deploy\build\jdktools.tools.exclude
Running TOOLS tests
test.jre.home=C:\cc\cc-common\build\checkouts\hdk\target\hdk\jdk\jre
The test report is in C:\cc\cc-common\build\checkouts\hdk\working_jdktools\build\test_report\html\index.html
The execution FAILED with the following exception:
The following error occurred while executing this line:
C:\cc\cc-common\adaptors\jdktools-test\adaptor.xml:23: The following error occurred while
executing this line:
C:\cc\cc-common\build\checkouts\hdk\working_jdktools\build.xml:242: The following error occurred
while executing this line:
C:\cc\cc-common\build\checkouts\hdk\working_jdktools\make\build-test.xml:97: There were test
errors.

***********************************************************
Unit Tests: (160)
        
error: testExceptionEventLocation org.apache.harmony.jpda.tests.jdwp.Events.ExceptionTest
error: testSingleStep1 org.apache.harmony.jpda.tests.jdwp.Events.SingleStepTest
error: testSingleStep2 org.apache.harmony.jpda.tests.jdwp.Events.SingleStepTest
error: testSingleStep3 org.apache.harmony.jpda.tests.jdwp.Events.SingleStepTest
error: testPopFramesWithInvokeMethods org.apache.harmony.jpda.tests.jdwp.StackFrame.PopFrames002Test
error: testFrameCount001 org.apache.harmony.jpda.tests.jdwp.ThreadReference.FrameCountTest
failure: testDebuggerLaunch002 org.apache.harmony.jpda.tests.jdwp.DebuggerOnDemand.OnthrowDebuggerLaunchTest
failure: testDebuggerLaunch004 org.apache.harmony.jpda.tests.jdwp.DebuggerOnDemand.OnthrowDebuggerLaunchTest
failure: testGetValues001 org.apache.harmony.jpda.tests.jdwp.StackFrame.GetValuesTest
failure: testPopSeveralFrames org.apache.harmony.jpda.tests.jdwp.StackFrame.PopFrames002Test
failure: testPopSeveralTimes org.apache.harmony.jpda.tests.jdwp.StackFrame.PopFrames002Test
failure: testPopFramesTest001 org.apache.harmony.jpda.tests.jdwp.StackFrame.PopFramesTest
failure: testSetValues001 org.apache.harmony.jpda.tests.jdwp.StackFrame.SetValuesTest
failure: testThisObjectTest001 org.apache.harmony.jpda.tests.jdwp.StackFrame.ThisObjectTest
failure: testFrames005 org.apache.harmony.jpda.tests.jdwp.ThreadReference.FramesTest
failure: testFrames004 org.apache.harmony.jpda.tests.jdwp.ThreadReference.FramesTest
failure: testFrames003 org.apache.harmony.jpda.tests.jdwp.ThreadReference.FramesTest
failure: testFrames002 org.apache.harmony.jpda.tests.jdwp.ThreadReference.FramesTest
failure: testFrames001 org.apache.harmony.jpda.tests.jdwp.ThreadReference.FramesTest
Unit Test Error Details:	(19)
                
Test: testExceptionEventLocationClass: org.apache.harmony.jpda.tests.jdwp.Events.ExceptionTestorg.apache.harmony.jpda.tests.framework.TestErrorException:
org.apache.harmony.jpda.tests.framework.jdwp.exceptions.TimeoutException: Connection was closed
	at org.apache.harmony.jpda.tests.framework.jdwp.VmMirror.performCommand(VmMirror.java:1590)
	at org.apache.harmony.jpda.tests.framework.jdwp.VmMirror.resume(VmMirror.java:444)
	at org.apache.harmony.jpda.tests.jdwp.Events.ExceptionTest.testExceptionEventLocation(ExceptionTest.java:169)
	at java.lang.reflect.VMReflection.invokeMethod(VMReflection.java)
Caused by: org.apache.harmony.jpda.tests.framework.jdwp.exceptions.TimeoutException: Connection
was closed
	at org.apache.harmony.jpda.tests.framework.jdwp.PacketDispatcher.run(PacketDispatcher.java:600)
Test: testSingleStep1Class: org.apache.harmony.jpda.tests.jdwp.Events.SingleStepTestorg.apache.harmony.jpda.tests.framework.TestErrorException:
org.apache.harmony.jpda.tests.framework.jdwp.exceptions.TimeoutException: Connection was closed
	at org.apache.harmony.jpda.tests.framework.jdwp.VmMirror.performCommand(VmMirror.java:1590)
	at org.apache.harmony.jpda.tests.jdwp.share.JDWPTestCase.resumeDebuggee(JDWPTestCase.java:341)
	at org.apache.harmony.jpda.tests.jdwp.Events.SingleStepTest.stepFunction(SingleStepTest.java:152)
	at org.apache.harmony.jpda.tests.jdwp.Events.SingleStepTest.testSingleStep1(SingleStepTest.java:60)
	at java.lang.reflect.VMReflection.invokeMethod(VMReflection.java)
Caused by: org.apache.harmony.jpda.tests.framework.jdwp.exceptions.TimeoutException: Connection
was closed
	at org.apache.harmony.jpda.tests.framework.jdwp.PacketDispatcher.run(PacketDispatcher.java:600)
Test: testSingleStep2Class: org.apache.harmony.jpda.tests.jdwp.Events.SingleStepTestorg.apache.harmony.jpda.tests.framework.TestErrorException:
org.apache.harmony.jpda.tests.framework.jdwp.exceptions.TimeoutException: Connection was closed
	at org.apache.harmony.jpda.tests.framework.jdwp.VmMirror.performCommand(VmMirror.java:1590)
	at org.apache.harmony.jpda.tests.jdwp.share.JDWPTestCase.resumeDebuggee(JDWPTestCase.java:341)
	at org.apache.harmony.jpda.tests.jdwp.Events.SingleStepTest.stepFunction(SingleStepTest.java:152)
	at org.apache.harmony.jpda.tests.jdwp.Events.SingleStepTest.testSingleStep2(SingleStepTest.java:71)
	at java.lang.reflect.VMReflection.invokeMethod(VMReflection.java)
Caused by: org.apache.harmony.jpda.tests.framework.jdwp.exceptions.TimeoutException: Connection
was closed
	at org.apache.harmony.jpda.tests.framework.jdwp.PacketDispatcher.run(PacketDispatcher.java:600)
Test: testSingleStep3Class: org.apache.harmony.jpda.tests.jdwp.Events.SingleStepTestorg.apache.harmony.jpda.tests.framework.TestErrorException:
org.apache.harmony.jpda.tests.framework.jdwp.exceptions.TimeoutException: Connection was closed
	at org.apache.harmony.jpda.tests.framework.jdwp.VmMirror.performCommand(VmMirror.java:1590)
	at org.apache.harmony.jpda.tests.jdwp.share.JDWPTestCase.resumeDebuggee(JDWPTestCase.java:341)
	at org.apache.harmony.jpda.tests.jdwp.Events.SingleStepTest.stepFunction(SingleStepTest.java:152)
	at org.apache.harmony.jpda.tests.jdwp.Events.SingleStepTest.testSingleStep3(SingleStepTest.java:81)
	at java.lang.reflect.VMReflection.invokeMethod(VMReflection.java)
Caused by: org.apache.harmony.jpda.tests.framework.jdwp.exceptions.TimeoutException: Connection
was closed
	at org.apache.harmony.jpda.tests.framework.jdwp.PacketDispatcher.run(PacketDispatcher.java:600)
Test: testPopFramesWithInvokeMethodsClass: org.apache.harmony.jpda.tests.jdwp.StackFrame.PopFrames002Testorg.apache.harmony.jpda.tests.framework.TestErrorException:
org.apache.harmony.jpda.tests.framework.jdwp.exceptions.TimeoutException: Connection was closed
	at org.apache.harmony.jpda.tests.framework.jdwp.VmMirror.performCommand(VmMirror.java:1590)
	at org.apache.harmony.jpda.tests.jdwp.StackFrame.PopFrames002Test.testPopFramesWithInvokeMethods(PopFrames002Test.java:410)
	at java.lang.reflect.VMReflection.invokeMethod(VMReflection.java)
Caused by: org.apache.harmony.jpda.tests.framework.jdwp.exceptions.TimeoutException: Connection
was closed
	at org.apache.harmony.jpda.tests.framework.jdwp.PacketDispatcher.run(PacketDispatcher.java:600)
Test: testFrameCount001Class: org.apache.harmony.jpda.tests.jdwp.ThreadReference.FrameCountTestorg.apache.harmony.jpda.tests.framework.TestErrorException:
org.apache.harmony.jpda.tests.framework.jdwp.exceptions.TimeoutException: Connection was closed
	at org.apache.harmony.jpda.tests.framework.jdwp.VmMirror.performCommand(VmMirror.java:1590)
	at org.apache.harmony.jpda.tests.jdwp.ThreadReference.FrameCountTest.getFramesCount(FrameCountTest.java:101)
	at org.apache.harmony.jpda.tests.jdwp.ThreadReference.FrameCountTest.testFrameCount001(FrameCountTest.java:65)
	at java.lang.reflect.VMReflection.invokeMethod(VMReflection.java)
Caused by: org.apache.harmony.jpda.tests.framework.jdwp.exceptions.TimeoutException: Connection
was closed
	at org.apache.harmony.jpda.tests.framework.jdwp.PacketDispatcher.run(PacketDispatcher.java:600)
Test: testDebuggerLaunch002Class: org.apache.harmony.jpda.tests.jdwp.DebuggerOnDemand.OnthrowDebuggerLaunchTestjunit.framework.AssertionFailedError:
Null message received from debugger
	at org.apache.harmony.jpda.tests.jdwp.DebuggerOnDemand.OnthrowDebuggerLaunchTest.performTest(OnthrowDebuggerLaunchTest.java:189)
	at org.apache.harmony.jpda.tests.jdwp.DebuggerOnDemand.OnthrowDebuggerLaunchTest.testDebuggerLaunch002(OnthrowDebuggerLaunchTest.java:84)
	at java.lang.reflect.VMReflection.invokeMethod(VMReflection.java)
Test: testDebuggerLaunch004Class: org.apache.harmony.jpda.tests.jdwp.DebuggerOnDemand.OnthrowDebuggerLaunchTestjunit.framework.AssertionFailedError:
Null message received from debugger
	at org.apache.harmony.jpda.tests.jdwp.DebuggerOnDemand.OnthrowDebuggerLaunchTest.performTest(OnthrowDebuggerLaunchTest.java:189)
	at org.apache.harmony.jpda.tests.jdwp.DebuggerOnDemand.OnthrowDebuggerLaunchTest.testDebuggerLaunch004(OnthrowDebuggerLaunchTest.java:123)
	at java.lang.reflect.VMReflection.invokeMethod(VMReflection.java)
Test: testGetValues001Class: org.apache.harmony.jpda.tests.jdwp.StackFrame.GetValuesTestjunit.framework.AssertionFailedError:
ThreadReference::FramesCommand command, Error Code:<13(THREAD_NOT_SUSPENDED)>
	at org.apache.harmony.jpda.tests.jdwp.share.JDWPTestCase.printErrorAndFail(JDWPTestCase.java:753)
	at org.apache.harmony.jpda.tests.jdwp.share.JDWPTestCase.checkReplyPacket(JDWPTestCase.java:662)
	at org.apache.harmony.jpda.tests.jdwp.share.JDWPTestCase.checkReplyPacket(JDWPTestCase.java:591)
	at org.apache.harmony.jpda.tests.jdwp.share.JDWPTestCase.checkReplyPacket(JDWPTestCase.java:562)
	at org.apache.harmony.jpda.tests.jdwp.share.JDWPTestCase.checkReplyPacket(JDWPTestCase.java:575)
	at org.apache.harmony.jpda.tests.jdwp.StackFrame.JDWPStackFrameTestCase.jdwpGetFrames(JDWPStackFrameTestCase.java:113)
	at org.apache.harmony.jpda.tests.jdwp.StackFrame.GetValuesTest.examineGetValues(GetValuesTest.java:113)
	at org.apache.harmony.jpda.tests.jdwp.StackFrame.GetValuesTest.testGetValues001(GetValuesTest.java:81)
	at java.lang.reflect.VMReflection.invokeMethod(VMReflection.java)
Test: testPopSeveralFramesClass: org.apache.harmony.jpda.tests.jdwp.StackFrame.PopFrames002Testjunit.framework.AssertionFailedError:
StackFrame::PopFramesCommand command, Error Code:<13(THREAD_NOT_SUSPENDED)>
	at org.apache.harmony.jpda.tests.jdwp.share.JDWPTestCase.printErrorAndFail(JDWPTestCase.java:753)
	at org.apache.harmony.jpda.tests.jdwp.share.JDWPTestCase.checkReplyPacket(JDWPTestCase.java:662)
	at org.apache.harmony.jpda.tests.jdwp.share.JDWPTestCase.checkReplyPacket(JDWPTestCase.java:591)
	at org.apache.harmony.jpda.tests.jdwp.share.JDWPTestCase.checkReplyPacket(JDWPTestCase.java:562)
	at org.apache.harmony.jpda.tests.jdwp.share.JDWPTestCase.checkReplyPacket(JDWPTestCase.java:575)
	at org.apache.harmony.jpda.tests.jdwp.StackFrame.JDWPStackFrameTestCase.jdwpPopFrames(JDWPStackFrameTestCase.java:211)
	at org.apache.harmony.jpda.tests.jdwp.StackFrame.PopFrames002Test.testPopSeveralFrames(PopFrames002Test.java:139)
	at java.lang.reflect.VMReflection.invokeMethod(VMReflection.java)
Test: testPopSeveralTimesClass: org.apache.harmony.jpda.tests.jdwp.StackFrame.PopFrames002Testjunit.framework.AssertionFailedError:
ThreadReference::FramesCommand command, Error Code:<13(THREAD_NOT_SUSPENDED)>
	at org.apache.harmony.jpda.tests.jdwp.share.JDWPTestCase.printErrorAndFail(JDWPTestCase.java:753)
	at org.apache.harmony.jpda.tests.jdwp.share.JDWPTestCase.checkReplyPacket(JDWPTestCase.java:662)
	at org.apache.harmony.jpda.tests.jdwp.share.JDWPTestCase.checkReplyPacket(JDWPTestCase.java:591)
	at org.apache.harmony.jpda.tests.jdwp.share.JDWPTestCase.checkReplyPacket(JDWPTestCase.java:562)
	at org.apache.harmony.jpda.tests.jdwp.share.JDWPTestCase.checkReplyPacket(JDWPTestCase.java:575)
	at org.apache.harmony.jpda.tests.jdwp.StackFrame.JDWPStackFrameTestCase.jdwpGetFrames(JDWPStackFrameTestCase.java:113)
	at org.apache.harmony.jpda.tests.jdwp.StackFrame.PopFrames002Test.testPopSeveralTimes(PopFrames002Test.java:241)
	at java.lang.reflect.VMReflection.invokeMethod(VMReflection.java)
Test: testPopFramesTest001Class: org.apache.harmony.jpda.tests.jdwp.StackFrame.PopFramesTestjunit.framework.AssertionFailedError:
StackFrame::PopFrames command, Error Code:<13(THREAD_NOT_SUSPENDED)>
	at org.apache.harmony.jpda.tests.jdwp.share.JDWPTestCase.printErrorAndFail(JDWPTestCase.java:753)
	at org.apache.harmony.jpda.tests.jdwp.share.JDWPTestCase.checkReplyPacket(JDWPTestCase.java:662)
	at org.apache.harmony.jpda.tests.jdwp.share.JDWPTestCase.checkReplyPacket(JDWPTestCase.java:591)
	at org.apache.harmony.jpda.tests.jdwp.share.JDWPTestCase.checkReplyPacket(JDWPTestCase.java:562)
	at org.apache.harmony.jpda.tests.jdwp.share.JDWPTestCase.checkReplyPacket(JDWPTestCase.java:575)
	at org.apache.harmony.jpda.tests.jdwp.StackFrame.PopFramesTest.testPopFramesTest001(PopFramesTest.java:134)
	at java.lang.reflect.VMReflection.invokeMethod(VMReflection.java)
Test: testSetValues001Class: org.apache.harmony.jpda.tests.jdwp.StackFrame.SetValuesTestjunit.framework.AssertionFailedError:
ThreadReference::FramesCommand command, Error Code:<13(THREAD_NOT_SUSPENDED)>
	at org.apache.harmony.jpda.tests.jdwp.share.JDWPTestCase.printErrorAndFail(JDWPTestCase.java:753)
	at org.apache.harmony.jpda.tests.jdwp.share.JDWPTestCase.checkReplyPacket(JDWPTestCase.java:662)
	at org.apache.harmony.jpda.tests.jdwp.share.JDWPTestCase.checkReplyPacket(JDWPTestCase.java:591)
	at org.apache.harmony.jpda.tests.jdwp.share.JDWPTestCase.checkReplyPacket(JDWPTestCase.java:562)
	at org.apache.harmony.jpda.tests.jdwp.share.JDWPTestCase.checkReplyPacket(JDWPTestCase.java:575)
	at org.apache.harmony.jpda.tests.jdwp.StackFrame.JDWPStackFrameTestCase.jdwpGetFrames(JDWPStackFrameTestCase.java:113)
	at org.apache.harmony.jpda.tests.jdwp.StackFrame.SetValuesTest.examineGetValues(SetValuesTest.java:114)
	at org.apache.harmony.jpda.tests.jdwp.StackFrame.SetValuesTest.testSetValues001(SetValuesTest.java:82)
	at java.lang.reflect.VMReflection.invokeMethod(VMReflection.java)
Test: testThisObjectTest001Class: org.apache.harmony.jpda.tests.jdwp.StackFrame.ThisObjectTestjunit.framework.AssertionFailedError:
ThreadReference::FramesCommand command, Error Code:<13(THREAD_NOT_SUSPENDED)>
	at org.apache.harmony.jpda.tests.jdwp.share.JDWPTestCase.printErrorAndFail(JDWPTestCase.java:753)
	at org.apache.harmony.jpda.tests.jdwp.share.JDWPTestCase.checkReplyPacket(JDWPTestCase.java:662)
	at org.apache.harmony.jpda.tests.jdwp.share.JDWPTestCase.checkReplyPacket(JDWPTestCase.java:591)
	at org.apache.harmony.jpda.tests.jdwp.share.JDWPTestCase.checkReplyPacket(JDWPTestCase.java:562)
	at org.apache.harmony.jpda.tests.jdwp.share.JDWPTestCase.checkReplyPacket(JDWPTestCase.java:575)
	at org.apache.harmony.jpda.tests.jdwp.StackFrame.JDWPStackFrameTestCase.jdwpGetFrames(JDWPStackFrameTestCase.java:113)
	at org.apache.harmony.jpda.tests.jdwp.StackFrame.ThisObjectTest.testThisObjectTest001(ThisObjectTest.java:97)
	at java.lang.reflect.VMReflection.invokeMethod(VMReflection.java)
Test: testFrames005Class: org.apache.harmony.jpda.tests.jdwp.ThreadReference.FramesTestjunit.framework.AssertionFailedError:
unexpected behaviour: error is THREAD_NOT_SUSPENDED(13) but  must be INVALID_LENGTH(504)
	at org.apache.harmony.jpda.tests.jdwp.share.JDWPTestCase.printErrorAndFail(JDWPTestCase.java:753)
	at org.apache.harmony.jpda.tests.jdwp.ThreadReference.FramesTest.testFrames005(FramesTest.java:103)
	at java.lang.reflect.VMReflection.invokeMethod(VMReflection.java)
Test: testFrames004Class: org.apache.harmony.jpda.tests.jdwp.ThreadReference.FramesTestjunit.framework.AssertionFailedError:
unexpected behaviour: error is THREAD_NOT_SUSPENDED(13) but  must be INVALID_INDEX(503)
	at org.apache.harmony.jpda.tests.jdwp.share.JDWPTestCase.printErrorAndFail(JDWPTestCase.java:753)
	at org.apache.harmony.jpda.tests.jdwp.ThreadReference.FramesTest.testFrames004(FramesTest.java:157)
	at java.lang.reflect.VMReflection.invokeMethod(VMReflection.java)
Test: testFrames003Class: org.apache.harmony.jpda.tests.jdwp.ThreadReference.FramesTestjunit.framework.AssertionFailedError:
Unexpected ERROR = 13(THREAD_NOT_SUSPENDED)
	at org.apache.harmony.jpda.tests.jdwp.share.JDWPTestCase.printErrorAndFail(JDWPTestCase.java:753)
	at org.apache.harmony.jpda.tests.jdwp.ThreadReference.FramesTest.testFrames003(FramesTest.java:209)
	at java.lang.reflect.VMReflection.invokeMethod(VMReflection.java)
Test: testFrames002Class: org.apache.harmony.jpda.tests.jdwp.ThreadReference.FramesTestjunit.framework.AssertionFailedError:
Unexpected ERROR = 13(THREAD_NOT_SUSPENDED)
	at org.apache.harmony.jpda.tests.jdwp.share.JDWPTestCase.printErrorAndFail(JDWPTestCase.java:753)
	at org.apache.harmony.jpda.tests.jdwp.ThreadReference.FramesTest.testFrames002(FramesTest.java:277)
	at java.lang.reflect.VMReflection.invokeMethod(VMReflection.java)
Test: testFrames001Class: org.apache.harmony.jpda.tests.jdwp.ThreadReference.FramesTestjunit.framework.AssertionFailedError:
Unexpected ERROR = 13(THREAD_NOT_SUSPENDED)
	at org.apache.harmony.jpda.tests.jdwp.share.JDWPTestCase.printErrorAndFail(JDWPTestCase.java:753)
	at org.apache.harmony.jpda.tests.jdwp.ThreadReference.FramesTest.testFrames001(FramesTest.java:373)
	at java.lang.reflect.VMReflection.invokeMethod(VMReflection.java)

***********************************************************
Modifications since last successful build:	(1)
            
add cc-hdk log20071227075230Lbuild.400 12/27/2007 07:52:30hdk

begin 644 execution_log.zip
M4$L#! H    ( #Q_FS?$7'/?JA(  *>!   2    97AE8W5T:6]N7VQO9RYH
M=&UL[5W_4]L\TO^9SO1_T#TW[QS,$#=?">%2;GB!/J5/*1RA?>ZFZ76$K20N
MCN63;"#7>?[WVY7L)+83)P%10N<RST,365JM]K.[6JUEN3T(A]Y^^XH[H_UV
M(-A^FQ(9CCSV^B\][H<EZ?Z'[9'=\O_]]2_[+U]$@4-#5I(W_M[+%R]?E"0+
MHZ#TS;D..?=DZ5;JXKA:MEQ$V.PH"CS7ANL."03_QNR0^'3(B.L3=QAP$5KD
M/"Z_Y$'I/;MA'M8,F A'Q&$]UW=#E_M2?P<R/5?($-L?[G5M&_XKV7PXY'Y7
MVL(-0MF-6[M,6G=#CU#?(;1/L<-\FZO(]9RN/6#V-8^@[<"Y[MYR<>WZ_:_)
M@+I#>LTR5'& (9,AC)#@YS.S!_P+>?%ZR<^+2V@,G9"D$W+E^E0@=<M:G@JR
M87N,^B5D1I9@#$$4*O';/!B5O@E6ZKD>TXC8@R%WLF5QM;UD1"6H$^FK:F##
M:\<57\BA8 I$^+%W/RGJ2MC%5\$0^<?K0.)@U$\MEPQ*AWP8N!Y*_]WYT0&)
M6SP:,UW;HU*RI(MO](;:TTQ4FQ4B>21L1A0N).2/U&?'];$3:$=<27K4DVR;
MN'V?"^1CR(9<C$[IG3N,AAWP! 0,'I4T3:0T_J3+*Q;Y_>#BP\F'7^]O:%KU
MNM_ HZAQ=./6$3B!+A?]+@THT.@.J(#BT:2B[/8$N!6DV#UB5U&_S]@%Z[LR
M9,)"!M.\DDT:$A ^(XW=K?2E#1$W8XY%'6?3B:EM_95D*OYKSB==[7(4@"!I
MCX6C/7(Y8"#F<,#!)0'MLRMT?%ODBGG<[RO@0Z@AZ"T)L=E[U[]FSGM@QR(7
MK <\ 7ZJ6I_Y3+AVMEK[>)_( 8\\!VB2@*),8"B I;,<B//*J^L"+OK-LT#-
M",6XEAM98%T?1.%3[WSBR<%9;N)TM$UNJ!<!QDM"O#+:V)%&>YLL0OTME8-3
M&A1"'M=I_[;]Z9$0KZT+XM^<VZ![3NUK%AZY,J AM"BVZ4JEGL4>P@H__'O$
M(J:,6OW4-%?!W*1E+[1I ]9<?[X85NNMO&.&4#(Q6G9+3L">^TQL8OE($[?Z
M+#QQ-K>VMC-T%WRF2-S'!]SW\SB^(Z17'EOH/50M _ZC\8QU;#?G)[!C6#!H
M)3MQMDE<L+Q6_ R8[CQ?3&N-W+S_/TR+RIMKA?6GX:DK!%\PO^_6<H:KZ$@U
MN:NOB\$U-YD?"$%'"V?T<:T'3^N[SQ"R5KF:A>R&"@T8?"F&Z_E"U7I^4%4K
MU1Q4/9=YC@9+1K!X.L3LPAM=&'(EKLVMS^Z7^P=/SQ?B2ODY8EPKPEA]_9D]
MZ%PLGSB)I1",\U?BS#]B&*=TSWP0Y&U2_)Y&OCU(DER%,+?R\2T:+CF^LYG*
MH;SA(B%+V%W(($J:7"3?,XWU6FD)ZQU@ZE"XU'/_@]$+*>C5X0"TST/B,*@E
M&,$;$C0$R'NN3[V8SB<F)#3\>')$E&X2WM,J@>KT0,B?.+6E(#_&?(3L*K?Z
MT?<X=9;"-V_$^IX*P9]6%+J>-<D-9LV9K )G 5U,)?OL!K",Y-(^\XFS2P\1
M>JN9%?H5\,.H#X(XB\*SWJG*HY/7.L$^1^QD@< ];H/V0V3D*@M*DQY+7#"Z
MK,2?.!?T$(E7FI6LR(/HR@,?H2@1)*2^;79"=2<#4[I;,,,(?BMUG0\\?,,C
MWUGDW,@R$YM@821\[8 T!STN<EQLD9[@0S7/36IF1GT8R9 /WT,1@.DS!NX7
MG3N@P!Q8IOHWVN_A3 B_H)>ANCF$E-I_VY_5@::UI$X\<>[F83J1RP^F= )F
MCS70B2P7ZZ\3<W7EB7-"*5WAPRO<"J!_ELM5O"E4K"WE\CRGS>X""$T/.3K<
M,*$)SGL3^V7.J0IB.R$54,=A)[[#[LCKUV3ZZC& G%S+1<TS_?W2?G\V=_?P
M_W-Q?>+\3Q&NM86X-FHY)R#<&Y 4&<.+M&*8[MSP@MG,O0%#6C [%Z(V"S<=
MELX>P3P>4C!JY+W1DK ]<0[H8; U=V;<FR7'_S@_/KP\/OIZ_.GXPV7GZ^'9
MQP^7 %2V_.#BXN"?EL?\?CB8A=_]+&UV[R8M[8ES0?,A6XA7_C[)3X17]8GS
M-P_ I5K)+P!_(F#6(1ES/V!J]=RVHI\)F'5*F:P&3#.?,HG7!SWJ>I%@ITQ*
MVF< RB]__C-Y<W#R_N/%,7$B54>-";^H&5W^B?SIEZ6R*@NAR71^'TS6*:.R
MXNR23U/>'Y,U@F0N5.N4BLE!=4CE@I5W+7>'';.P<;H_NU)2;2Y1HA>XQP8W
MZ'Q@=^$GW&YW "M3O[\Y>\ET+Q<WDX?[6-,Z94;N =%N+D=9!)%X1LC,16R-
M\A/CA-+BO,1N+DY00*E[>B='<[!YHZ\6P[/8P<5]F 1A'9()EP,<R/@V8E=)
M:_$L5&_D4D13>TIPOZ$B!#-39(>;L?"V4:A;ZW#7^Q-<Y:+P]JFN\GA;Q-<A
M)2'A NN^._K]_".T2'*JYX*#0.3O@@;!HCV!M5Q*B8K^3;Q/Q?M1^U1^')S5
M=4A+/!RV?"8PSLC'F??/7[84CLEN%?@AY^9JQY_[6FS2BX89^EX+H/&Y.O#\
M0TDVX<<M%3X(1F[APU(!S#, 08G=V5[DL,P#4^HQJ?@2R%N&JST4I6[_>^Y5
MUX')C(_BNHGV6*@,5DP]?G!PYF-;%Y'OSWIH*[E.R'A7P;M/IZ^7X1#"$9A:
MU==O^+]@KR#6>C71M!QM9H[VYV]H'I-Q@9U8VDZLV$ZT:-10+;03ZY,KPHAZ
MIU )M-Z*MT7@W)8FB262X!.8I+)-WNBEC-PCY6URC)N#]-=+=\@(\V@@F;-'
M=JWFS@Z1S'XXJ1UKMU4Q0ZIIE5MU4URU=EKK2*JV:XQ4HV9*[)5Z,8*U94E5
M*PLAK"Y+JU*WRCN&A@C2JE:-*6FS&,/EI56V&JU&(:WZ-*UJ :U&U:KLSE+3
MX\[E,MXFNQ'-PHUH(KL3#3E329GCH[5287!"#4,VVK1V#/F@IM6H-PM)[2Q+
MJEZW&@O8FF=7E9Q=56&$L^Q]24W1"U\KM? UJ!,&9Y-&V1 IX*IN;&*J[!J:
M II6K5D\B=?GD*KE/%'-:NW.\D2KZ40'0AL/ELTL,*T4YJR[TC 6^,P6V5/K
METE2!D6UADP9DU33:AK3A%;9G- ;/TRI5HGJ%D6;3R)V8Q[&*"F# 9+)18Q!
MK@Q&@%5C2ZM=@WI5-:=7YAR?P?&9(@7KJ@71\BJ3O+F,A"FFUG+B,K@N-FJ 
M)MV"25LVYV$,DJJLWR)Z-66OW"/*7G)AT@FI?:UNYEF_,GU/52ZS-DGE<*;R
M+KG5=+4R9Y6_.H/G/-#W+^-=[BNMGQ;(L&R81=/\S?1"J_/7607C%?B;;1BK
M\W<Y<*6^3V1X@=QL&9NF9NO*DWNYIU]AY6R_834K#]"+S.8%2ZG((8_\I92C
M,<UEHV# M;I5FYE3>PB;JQO8LUP'&(K8FG,0N >IBL$,0<5@MM4P7\;NDRW,
M$2R?N:A9.PUC*Q1CN6G0+7/)T6KMA]U_747NB^+2E6@5*^GR-^]J5JV^CDL+
M@Z& 25=J,"MMD"M3IE.SJ@U#!MU8>-OPF6>RP,T85%&# US'_$R!-<^*ONZ_
MO^@M]Z:VG1N8Q"M6S9BA[EK-LB&<=ZV=IJ%8$[BJ&>.J86JO"W"U:^Z^M[&,
M$&XY,V3U *&I>^C E2F_O8-L&916RQ M@_K0-#CWXMHC3OJ\?!'RR!Z4XL>P
MI'IEP=ZDG"DB4Z5L_.J"O<4;6CL'IYU'W-$JZ5!.;6G%?FWNVQ3D\H%#MZY^
M]X,^[1_?3^%SXC,\4(*$["[<)@Y71Y;P<*".WU^\)U8/2-5(5\ BZYL E\^'
M[)[[5G-=XELKQIM922DYD>2^V\?GO!D".KQC]A=RH.8L\E;/643O.F."[)%-
M>XL<\F DW/X@))56"U2M6BXWU5;LN%F']\);/%A,G?5"U3DO7! 7M--S;>9+
M4*-M0@&'0+VI!,]D3?>O!IF,\9>*U;#*OY!T%="V$O6" 06F\# S&'W@L9!A
M3_@=N@6ZZ3;RQL?G>W;*.ZT6K# VCYA-JDW%_]8V^=WU'7XK7['A3CU\-90W
M-JG4RV RZGT$1(DL36\0AL'>JU?)U![/]##I%\-G/SI^Q[;G@H&3=RA'_=H+
M0*]L-9L %ZR8+!C5!,63_S^%7R) 090UG!8Y\#RB+H-+89*)&^98Q<,:/-9H
MWGTX*:E7YI !4T?T:"M6._8I;N5/5T__^HC/DN[-BL3BK?#(N76*+ZOYS/5;
M#KZ0MCX^#P\PDOM%U,=-TL6$E*XX#Q45T,0!:>/??64D?1?".Z)*;UT0,CY:
M *-FOH.^B&<)S?[@ PT.Z]'("^.C_I!@H2" IQP_^)G#$SX \@-8XJ2-:.ZG
M2*'N(3G];ITQ2X(YKF V^FS77X4M&3#;[;GJ348Y7Y-CR2%MW0\7HS%?"4LI
M#4P8L^-WUX .I;I;CL-Q9^1VX-J#/-4>N$[]S" ^FT/%:-$(7!\L(]O-B2J,
M7U(SI7KJ@1_HAD8A'X+75$?B+.H!_-<5!P>3A0U/^A+Q!(D> !8RB_A-V=HT
M-14DJ&,G\;"?"+@B_X:5D@9RJM%R4I88G"AY7HWPQ$OP!5E-N& 2E!>BIV(_
MYW#[T3P=D#]"\OJ 3A>G-)0A<#UB81%;,)WT$=]'8TQT= <#Y@76+!>[,6'B
M>^P5_R#O#BY4P$@ -YI!:JH!ZI/;&\UH6*0Y<:L-^)"8  "+%!UL3_+M2]=L
M),'4&&DGW[XJ3[BA'M75D8I6N.1ZAH J4\^(32C@3Z"@2I=H':#F3O<O)<#A
M (4Q=TE9GOMQXZEV&R0Y@@O*QVW))C@.Q^WU(-301]3-Z',KRZ"2'@"CW?)7
M-##L0+U +AY;L83AJ@)\=GNK\T9%W]81Q,[*B>8A58YE0XV*W[BP6*".HUY(
M1[UX1LAUZ8&-I)O D-EM,H' KX!+F0\(2S83$. H#7)<&7AT1+ (? P>_B;)
M9@2\W+HP+R8JBMPG7&:E%TI*VI>=@Z\?+][O(\V44L'""Q2 #@-TM0,NW'"4
M;X^]:QKX[:LRFVG-4 4)$E!MFMT,-9#%W8BT!QQL&D0(49S<_[[71N/>_T.)
M"BZKR ZL&BJ1N)(:(M;:)LSJ6[JBI2M:X%/V*M5:?59?VBSP[QCW:9M(=;CY
M]O+R'&/USMGA;YVL(&,8A?;R>H9 <A.OCT1M,0I"WA<T@'E3$8;51:("8@Y)
MU;B=\)>4*II9:Y.SV5B)"W4FY9#ZM(]3XARW,.DIS=W$'Q2P"09GBD^<%;2V
MHXW3$+, \WM+\SIN4<@L:JMY;J=-MJ##:8:GVQ1R/'3,\SN,3[AQW'XJ?9#M
M,2WA=*LY3.=" ] AG.%)"2?NQPH/TK]^B[N,5%R0OI:P\[W4CM\)HWW%'],E
M.@K LK;^^E6]*V[_#\NR2.E=&Z.PI%(A(SZ_]9-WS\@,)QM*-P3[]\;&KWHE
MR5)* 5>B<0I^JA$*RA;>QL8A?DM/%X+=)!X?CU2/LA%/21\F&T)C_65BXB$'
MO\O#@586",2S31V&Z0V852[8D-\P E,>+!G4Q#[;K6R4V!U"!4V.U9?4\+ _
M-0.C$Y:AP[/3ZD8)%MA &9IW&*Q%%*]860<9KD@6X##:;$O4-6B'^ZQ4P#C6
M7:X#2 ("H@DPV<;ZX'-H?J)/0*<IOC?M :S5MY 2)8>="WU<2Y8&\&A[W =Q
MC=^&"]61<R6V&=552.0@JM3OIR.I;&V(MOS05C">XU>4I99@AE<%3CY&VBA)
MYO4T@;'J0>0*A7$ EJ*B7,8X@PF,Y:@E466:_Z)0<F,2.W]*(N?I/I60BTSK
M+:)89.#:WWS/6'DF307AQ=Y&IHG6NFS?^73S,B^;O3P[>]])O6TV/IEA4J7Q
MOQ?!I@X4T;^DL/6I(MC!K.-$]$AU995"4Z\)57_*E06O&9QW@'#J+13J4*:[
MN[LJ>4TJ"T\-&7]FG\.DCPJ.F5-$'W(0<'*H!]FL)$=Z+'&BA];%1[L!HO_^
MR!L@.>,R?P-DB?OID]'C2S)D?&L=0I .NC]]#GN' M*%]].7WKK4L&JF=A7L
M6O4%V^N6YJH\>4#FH7?Q=(!3 D=58L,@'.G".$TX590OP11=24>'\%L/1_^$
M00GJ2WUP/C .8FSL5(<9M4%#16Z(;H0F:BQ<[0["H==U\0@\"[\BOQ+6X.&$
MX9<O8.:9_JD%H>0C=&;PY8L7R"3.29$*\O3>#SU#JRPEQQ2H.AHS>2Y_3S69
MNH#R)]RV(R' ]FX'KC>F")=##)G03T)GV:%3A\(:0\BQT2OFDF+K;NCM56OZ
M4"0C_2TO:MUWO?JC.Q_2:]:=! **C593<0&ASRW^41JEE=X"4-NOZ'[[%7AJ
M^'O%G1'\@_JP_U]02P$"% ,*    "  \?YLWQ%QSWZH2  "G@0  $@      
M        I($     97AE8W5T:6]N7VQO9RYH=&UL4$L%!@     !  $ 0   
' -H2      $! 
end


Mime
View raw message