harmony-alerts mailing list archives

Site index · List index
Message view « Date » · « Thread »
Top « Date » · « Thread »
From nom...@intel.com
Subject [build-test alert] FAILED Linux x86: drlvm-reg-test
Date Thu, 27 Dec 2007 09:04:51 GMT
svn.revision=606926
BUILD FAILED:
	Ant Error Message:
/export/users.2/cc/cc-suites/scripts/cc-exec-adaptor.xml:104: The following error occurred
while executing this line: /export/users.2/cc/cc-suites/adaptors/drlvm-reg-test/adaptor.xml:74:
There were drlvm-reg-test failures

Date of build:	2007-12-27 15:02:53 +0600
Time to build:	1 minute 52 seconds
Last changed:	12/27/2007 14:12:38
Last log entry:	snapshot

***********************************************************
Errors/Warnings:	(135)
            
[junit] Test org.apache.harmony.drlvm.tests.regression.h0000.DirectByteBufferTest FAILED
[junit] Test org.apache.harmony.drlvm.tests.regression.h1578.NaNTest FAILED
[junit] Test org.apache.harmony.drlvm.tests.regression.h1654.H1654Test FAILED
[junit] Test org.apache.harmony.drlvm.tests.regression.h1748.IntfAccessTest FAILED
[junit] Test org.apache.harmony.drlvm.tests.regression.h1788.abcdTest FAILED
[junit] Test org.apache.harmony.drlvm.tests.regression.h1800.ExecTest FAILED
[junit] Test org.apache.harmony.drlvm.tests.regression.h1802.UnresolvedParamTest FAILED
[junit] Test org.apache.harmony.drlvm.tests.regression.h1802.UnresolvedHandlerTest FAILED
[junit] Test org.apache.harmony.drlvm.tests.regression.h1840.SimplestTest FAILED
[junit] Test org.apache.harmony.drlvm.tests.regression.h1840.SimplestTest FAILED
[junit] Test org.apache.harmony.drlvm.tests.regression.h1852.DivIntTest FAILED
[junit] Test org.apache.harmony.drlvm.tests.regression.h1857.Test FAILED
[junit] Test org.apache.harmony.drlvm.tests.regression.h1859.Test FAILED
[junit] Test org.apache.harmony.drlvm.tests.regression.h1859.Test FAILED
[junit] Test org.apache.harmony.drlvm.tests.regression.h1861.Test FAILED
[junit] Test org.apache.harmony.drlvm.tests.regression.h1863.H1863Test FAILED
[junit] Test org.apache.harmony.drlvm.tests.regression.h2057.SyncTest FAILED
[junit] Test org.apache.harmony.drlvm.tests.regression.h2083.Test FAILED
[junit] Test org.apache.harmony.drlvm.tests.regression.h2083.Test FAILED
[junit] Test org.apache.harmony.drlvm.tests.regression.h2083.Test FAILED
[junit] Test org.apache.harmony.drlvm.tests.regression.h2084.Test FAILED
[junit] Test org.apache.harmony.drlvm.tests.regression.h2086.Test FAILED
[junit] Test org.apache.harmony.drlvm.tests.regression.h2092.Test FAILED
[junit] Test org.apache.harmony.drlvm.tests.regression.h2092.Test FAILED
[junit] Test org.apache.harmony.drlvm.tests.regression.h2103.Test FAILED
[junit] Test org.apache.harmony.drlvm.tests.regression.h2113.Test FAILED
[junit] Test org.apache.harmony.drlvm.tests.regression.h2151.VMInit1Test FAILED
[java] Java Result: 1
[junit] Test org.apache.harmony.drlvm.tests.regression.h2259.H2259 FAILED
[junit] Test org.apache.harmony.drlvm.tests.regression.h2261.RCETest FAILED
[junit] Test org.apache.harmony.drlvm.tests.regression.h2335.SimplestLibraryPathTest FAILED
[junit] Test org.apache.harmony.drlvm.tests.regression.h2644.BootDelegationTest FAILED
[junit] Test org.apache.harmony.drlvm.tests.regression.h2679.DupTest FAILED
[junit] Test org.apache.harmony.drlvm.tests.regression.h2748.Test FAILED
[junit] Test org.apache.harmony.drlvm.tests.regression.h2773.InfinityTest FAILED
[junit] Test org.apache.harmony.drlvm.tests.regression.h2808.finTest FAILED
[junit] Test org.apache.harmony.drlvm.tests.regression.h2846.NoVerifyTest FAILED
[junit] Test org.apache.harmony.drlvm.tests.regression.h2873.RemTest FAILED
[junit] Test org.apache.harmony.drlvm.tests.regression.h2874.Test FAILED
[junit] Test org.apache.harmony.drlvm.tests.regression.h2899.ManyArgsTest FAILED
[junit] Test org.apache.harmony.drlvm.tests.regression.h2926.Test FAILED
[junit] Test org.apache.harmony.drlvm.tests.regression.h2926.Test FAILED
[junit] Test org.apache.harmony.drlvm.tests.regression.h3027.AgentLibTest FAILED
[junit] Test org.apache.harmony.drlvm.tests.regression.h3048.H3048 FAILED
[junit] Test org.apache.harmony.drlvm.tests.regression.h3067.Test FAILED
[junit] Test org.apache.harmony.drlvm.tests.regression.h3074.Test FAILED
[junit] Test org.apache.harmony.drlvm.tests.regression.h3098.JsrNoRetTest FAILED
[junit] Test org.apache.harmony.drlvm.tests.regression.h3098.JsrNoRetTest FAILED
[junit] Test org.apache.harmony.drlvm.tests.regression.h3110.FieldTest FAILED
[junit] Test org.apache.harmony.drlvm.tests.regression.h3121.H3121 FAILED
[junit] Test org.apache.harmony.drlvm.tests.regression.h3130.CallNativeTest FAILED
[junit] Test org.apache.harmony.drlvm.tests.regression.h3150.Test FAILED
[junit] Test org.apache.harmony.drlvm.tests.regression.h3175.Test FAILED
[junit] Test org.apache.harmony.drlvm.tests.regression.h3216.ASETest FAILED
[junit] Test org.apache.harmony.drlvm.tests.regression.h3225.PositiveJsrTest FAILED
[junit] Test org.apache.harmony.drlvm.tests.regression.h3225.NegativeJsrTest FAILED
[junit] Test org.apache.harmony.drlvm.tests.regression.h3225.J9CompatibleJsrTest FAILED
[junit] Test org.apache.harmony.drlvm.tests.regression.h3228.H3228 FAILED
[java] Java Result: 1
[junit] Test org.apache.harmony.drlvm.tests.regression.h3283.JavaLibraryPathTest FAILED
[junit] Test org.apache.harmony.drlvm.tests.regression.h3285.Test FAILED
[junit] Test org.apache.harmony.drlvm.tests.regression.h3317.GetFieldDeclaringClassTest FAILED
[junit] Test org.apache.harmony.drlvm.tests.regression.h3341.StopThreadInWait FAILED
[junit] Test org.apache.harmony.drlvm.tests.regression.h3380.LongToBitsTest FAILED
[junit] Test org.apache.harmony.drlvm.tests.regression.h3382.Test FAILED
[java] Java Result: 1
[junit] Test org.apache.harmony.drlvm.tests.regression.h3404.H3404 FAILED
[junit] Test org.apache.harmony.drlvm.tests.regression.h3446.SubSubTest FAILED
[junit] Test org.apache.harmony.drlvm.tests.regression.h3505.GetFieldModifiersTest FAILED
[junit] Test org.apache.harmony.drlvm.tests.regression.h3582.Test FAILED
[junit] Test org.apache.harmony.drlvm.tests.regression.h3619.ObjectLongWaitTest FAILED
[junit] Test org.apache.harmony.drlvm.tests.regression.h3652.Test FAILED
[junit] Test org.apache.harmony.drlvm.tests.regression.h3658.Test FAILED
[junit] Test org.apache.harmony.drlvm.tests.regression.h3658.Test FAILED
[junit] Test org.apache.harmony.drlvm.tests.regression.h3691.Test FAILED
[junit] Test org.apache.harmony.drlvm.tests.regression.h3698.ExceptionLocation FAILED
[junit] Test org.apache.harmony.drlvm.tests.regression.h3716.Test FAILED
[junit] Test org.apache.harmony.drlvm.tests.regression.h3730.StepM2N FAILED
[junit] Test org.apache.harmony.drlvm.tests.regression.h3738.Test FAILED
[junit] Test org.apache.harmony.drlvm.tests.regression.h3751.Test FAILED
[junit] Test org.apache.harmony.drlvm.tests.regression.h3784.Test FAILED
[junit] Test org.apache.harmony.drlvm.tests.regression.h3816.Test FAILED
[junit] Test org.apache.harmony.drlvm.tests.regression.h3822.Test FAILED
[junit] Test org.apache.harmony.drlvm.tests.regression.h3862.SubrBounds FAILED
[junit] Test org.apache.harmony.drlvm.tests.regression.h3894.ThreadGroupChildren FAILED
[junit] Test org.apache.harmony.drlvm.tests.regression.h3908.InvokeTest FAILED
[junit] Test org.apache.harmony.drlvm.tests.regression.h3909.FinalizerThreadGroup FAILED
[junit] Test org.apache.harmony.drlvm.tests.regression.h3954.Test FAILED
[junit] Test org.apache.harmony.drlvm.tests.regression.h3982.EmptyStackTrace FAILED
[junit] Test org.apache.harmony.drlvm.tests.regression.h4073.Test FAILED
[junit] Test org.apache.harmony.drlvm.tests.regression.h4073.Test FAILED
[junit] Test org.apache.harmony.drlvm.tests.regression.h4265.Test FAILED
[junit] Test org.apache.harmony.drlvm.tests.regression.h4265.Test FAILED
[junit] Test org.apache.harmony.drlvm.tests.regression.h4267.UnresolvedArrayElem FAILED
[junit] Test org.apache.harmony.drlvm.tests.regression.h4292.Test FAILED
[junit] Test org.apache.harmony.drlvm.tests.regression.h4292.Test FAILED
[junit] Test org.apache.harmony.drlvm.tests.regression.h4511.GCTagged FAILED
[junit] Test org.apache.harmony.drlvm.tests.regression.h4512.GetCurrentThreadCpuTime FAILED
[junit] Test org.apache.harmony.drlvm.tests.regression.h4514.Test FAILED
[junit] Test org.apache.harmony.drlvm.tests.regression.h4514.Test FAILED
[junit] Test org.apache.harmony.drlvm.tests.regression.h4579.test FAILED
[junit] Test org.apache.harmony.drlvm.tests.regression.h4595.Test FAILED
[junit] Test org.apache.harmony.drlvm.tests.regression.h4596.Test FAILED
[junit] Test org.apache.harmony.drlvm.tests.regression.h4654.Test FAILED
[junit] Test org.apache.harmony.drlvm.tests.regression.h4675.DivLongTest FAILED
[junit] Test org.apache.harmony.drlvm.tests.regression.h4706.Test FAILED
[junit] Test org.apache.harmony.drlvm.tests.regression.h4751.Test FAILED
[junit] Test org.apache.harmony.drlvm.tests.regression.h4866.Test FAILED
[junit] Test org.apache.harmony.drlvm.tests.regression.h4874.Test FAILED
[junit] Test org.apache.harmony.drlvm.tests.regression.h4874.Test FAILED
[junit] Test org.apache.harmony.drlvm.tests.regression.h4979.AttachCurrentThread FAILED
[junit] Test org.apache.harmony.drlvm.tests.regression.h5021.Test FAILED
[junit] Test org.apache.harmony.drlvm.tests.regression.h5067.Test FAILED
[junit] Test org.apache.harmony.drlvm.tests.regression.h5078.Test FAILED
[junit] Test org.apache.harmony.drlvm.tests.regression.h5094.InlinedStackTest FAILED
[junit] Test org.apache.harmony.drlvm.tests.regression.h5094.InlinedStackTest FAILED
[junit] Test org.apache.harmony.drlvm.tests.regression.h5094.InlinedStackTest FAILED
[junit] Test org.apache.harmony.drlvm.tests.regression.h5094.InlinedStackTest FAILED
[java] Java Result: 1
[java] Java Result: 1
[java] Java Result: 1
[java] Java Result: 1
[java] Java Result: 1
[java] Java Result: 1
[java] Java Result: 1
[junit] Test org.apache.harmony.drlvm.tests.regression.h5206.VolatileLongTest FAILED
[junit] Test org.apache.harmony.drlvm.tests.regression.h5206.VolatileLongTest FAILED
[junit] Test org.apache.harmony.drlvm.tests.regression.h5257.ProtectedInnerAccessTest FAILED
[junit] Test org.apache.harmony.drlvm.tests.regression.h788.Test FAILED
BUILD FAILED
/export/users.2/cc/cc-suites/build/checkouts/hdk/working_vm/build/make/build.xml:578: The
following error occurred while executing this line:
/export/users.2/cc/cc-suites/build/checkouts/hdk/working_vm/build/make/targets/reg.test.run.xml:108:
There were test failures
Total time: 53 seconds
The execution FAILED with the following exception:
The following error occurred while executing this line:
/export/users.2/cc/cc-suites/adaptors/drlvm-reg-test/adaptor.xml:74: There were drlvm-reg-test
failures

***********************************************************
Unit Tests: (10)
        
failure: test org.apache.harmony.drlvm.tests.regression.h2196.LoopExcTest
failure: test org.apache.harmony.drlvm.tests.regression.h3256.InterruptTimedWaitingTest
failure: test org.apache.harmony.drlvm.tests.regression.h3382.TestX
failure: test org.apache.harmony.drlvm.tests.regression.h5201-0
failure: test org.apache.harmony.drlvm.tests.regression.h5201-1
failure: test org.apache.harmony.drlvm.tests.regression.h5201-2
failure: test org.apache.harmony.drlvm.tests.regression.h5201-6
Unit Test Error Details:	(7)
                
Test: testClass: org.apache.harmony.drlvm.tests.regression.h2196.LoopExcTestExit code: 1 Err:
Loading error /export/users.2/cc/cc-suites/build/checkouts/snapshot/hdk/jdk/jre/bin/default/libgc_gen_uncomp.so:
undefined symbol: _Z23free_set_pool_put_entryP12Vector_BlockP11GC_Metadata
GC library cannot be loaded: libgc_gen_uncomp.so
HMYEXEL062E Internal VM error: Failed to create Java VM
FAILED to invoke JVM.
Test: testClass: org.apache.harmony.drlvm.tests.regression.h3256.InterruptTimedWaitingTestExit
code: 1 Err: Loading error /export/users.2/cc/cc-suites/build/checkouts/snapshot/hdk/jdk/jre/bin/default/libgc_gen_uncomp.so:
undefined symbol: _Z23free_set_pool_put_entryP12Vector_BlockP11GC_Metadata
GC library cannot be loaded: libgc_gen_uncomp.so
HMYEXEL062E Internal VM error: Failed to create Java VM
FAILED to invoke JVM.
Test: testClass: org.apache.harmony.drlvm.tests.regression.h3382.TestXExit code: 1 Err: Loading
error /export/users.2/cc/cc-suites/build/checkouts/snapshot/hdk/jdk/jre/bin/default/libgc_gen_uncomp.so:
undefined symbol: _Z23free_set_pool_put_entryP12Vector_BlockP11GC_Metadata
GC library cannot be loaded: libgc_gen_uncomp.so
HMYEXEL062E Internal VM error: Failed to create Java VM
FAILED to invoke JVM.
Test: testClass: org.apache.harmony.drlvm.tests.regression.h5201-0Exit code: 1 Err: Loading
error /export/users.2/cc/cc-suites/build/checkouts/snapshot/hdk/jdk/jre/bin/default/libgc_gen_uncomp.so:
undefined symbol: _Z23free_set_pool_put_entryP12Vector_BlockP11GC_Metadata
GC library cannot be loaded: libgc_gen_uncomp.so
HMYEXEL062E Internal VM error: Failed to create Java VM
FAILED to invoke JVM.
Test: testClass: org.apache.harmony.drlvm.tests.regression.h5201-1Exit code: 1 Err: Loading
error /export/users.2/cc/cc-suites/build/checkouts/snapshot/hdk/jdk/jre/bin/default/libgc_gen_uncomp.so:
undefined symbol: _Z23free_set_pool_put_entryP12Vector_BlockP11GC_Metadata
GC library cannot be loaded: libgc_gen_uncomp.so
HMYEXEL062E Internal VM error: Failed to create Java VM
FAILED to invoke JVM.
Test: testClass: org.apache.harmony.drlvm.tests.regression.h5201-2Exit code: 1 Err: Loading
error /export/users.2/cc/cc-suites/build/checkouts/snapshot/hdk/jdk/jre/bin/default/libgc_gen_uncomp.so:
undefined symbol: _Z23free_set_pool_put_entryP12Vector_BlockP11GC_Metadata
GC library cannot be loaded: libgc_gen_uncomp.so
HMYEXEL062E Internal VM error: Failed to create Java VM
FAILED to invoke JVM.
Test: testClass: org.apache.harmony.drlvm.tests.regression.h5201-6Exit code: 1 Err: Loading
error /export/users.2/cc/cc-suites/build/checkouts/snapshot/hdk/jdk/jre/bin/default/libgc_gen_uncomp.so:
undefined symbol: _Z23free_set_pool_put_entryP12Vector_BlockP11GC_Metadata
GC library cannot be loaded: libgc_gen_uncomp.so
HMYEXEL062E Internal VM error: Failed to create Java VM
FAILED to invoke JVM.

***********************************************************
Modifications since last successful build:	(1)
            
add cc-snapshot log20071227141238Lbuild.73 12/27/2007 14:12:38snapshot

begin 644 execution_log.zip
M4$L#! H    ( )=XFS>9AE@*W@\  ,!H 0 2    97AE8W5T:6]N7VQO9RYH
M=&UL[9W[<]JX%L=_SU_AF3MW=C<S$;;!+V[;F;S:I)-T,R'M?70ZC+$%N#&6
M1[83Z%]_CVQ(0L! &XRSJ\.T%-</2>?[.4>2)<MOANDH?/>FQ_S)NS<QI^_>
MN$J23D+Z]K<^B]*#)/A!VXJM_O-?O[W;RV+?3>E!<A>U]_8.BJWVGB(^7^F8
M>M^4XR'U;JFOL"Q5.+T+DH!%BJF:CFZ2Z8'?W3OWFW*4!:'?#T*X^,B]I8V>
MV";C43AWU-R&3U/JI80EQ.7>D'CC,?'Z@W;Y"4$4I"2+@O&Z8^Z#:,4A7DC=
M9_O%+Y^&D*%ORHGX-X@&BA]PR!_C$Z5!QS'C:2-+*$^(WO \^'.09$%*DZ*D
M#4\8"JR4-(;^;>.>\5NX1/=N--T=1N-NX#;U[L#SNAQ2<!.ZVQSX- [9I-PJ
M1Y_/+TZ4SN?CX]-.Y_WGB[F=-RQU0R4-1B"OI2348Y&?O%1_.DXIC[J0L04Q
M!'_>D,'OSXDPQ/'%8:=S<7ZDO/UU2WBAFR1AT-LVD*MAVX39A*8DH:,@(2!X
MLFB,KZ-;V '.R"DXJ"^P:%?$9"//1WE6YV-$27G+Y?SN0OF4E&>T_ H#L(8;
MI8!8RH/>BJ3B,!L$T6;'YJ80AY([,!<$L=5R9#'A-&$9]VBR]LCBVH+]]<?&
MG,64I\'S0Y\:*<N1AR/'$W&6B 1@M'R;!*.$!%%*0^*QD2( :#N:M@)I=A^%
MS/6A.".6TK6YS*(?P69E+TJ='Q]3GQ3.[(8K3V'QA$0T2>"/RR<DIV$5"!'E
M0%M>8'%M<N?RP.VM+H$;Q^&$Q&X*&5QJ9)$+\"7X%F;6%&$2)65;<"BH;@_@
MZ@'-?:MQ>'7=<&-^H!&=F.M<ZL& &QE_XV"M/P3K/9X5T"]6,YIFY%9(E#X'
MJC8P!.0Q"\$,/@_O1@><#@Y@7_K2"@':(0=%#%[E1W"0\*(5A_Q-*I:7MW3R
M0R!0 )C@=#X9,7]5[%Y5#RT<N(G#_TR$GA[KQ7'J)K>KKEI6Q8R3,/VF7'$&
MOI.+^W*/SLDM6DX"W>V$B?)Z]TE2I>6[@&@N"I<WZI,AI>FVRIE 5D1KDT!"
MI7YSS*)^,,@@+B]4HG/N)3YG+,GCRT?8#0ZF$8.H7=54?N]DD7(9>)PEDR2E
MHT0YCSSRQ\J+S9Q,X8RE6_?6A:P_?E@"J5T$43;>[ SAX7"&$'C#)" <P D 
MPZ;']P=P?$DG8OX<"):/W;:WTX[;NF1$P& 1C5)1\B7=AF4Y&T+%SD@2B)SU
M(2BLSA<<'3(/ZKH?0M%E9\QM0/U"1/VRLFDQBJ&N>:B*$J@C:.QR6F]K.L]*
M8Y;_I)'#1Y-7E:<(7/ENA?473?M]A1#K3H7_?R;)UZ%H"=ZYXFY#?GS>)%&A
MFYDW@Z8MD^HB[R8:K2E58<+7A5J1I\:9"I]&E_6^+WJD: R#U34PKF@Q/ABZ
M1V=E]$GI69W4Y7ET![UNRXUU0$<]ZA^,W"CH+[CP:[&1KAD:VFB-C6S'01NM
ML1'4KFBCU39JJKJ%-EIG(ZN%-EIC(ZV)]=HZ&S4U]+6U-FIAW;_.1BT5X]$Z
M&QFJ@39:8R/3L=%&:VQD8;VVWD8VQJ-U-K(=M-$Z&SDJ]FG7VLC6T4:K;=0R
M-&Q#KK<1<K3.1HZ%\6B-C0Q51U];:R/KU;:SYS9"-XN\83&*\KI,R:E(97&D
M;C:,6;IC]GF[R6?M56X@,U#RCU\N?[+D2>3&R9"EN0F^B[^<-GI!U!!I[2CS
MOV:\8F(.'7MAYA>C?R\9[@?5$^[E\@IUQ428@$6-Z>63V0\2BA%^,K9-9<VD
MAG5E^T<Q9QJ\B4-B,8ORV1H?SZ\/E3[C8BJ0&X3E7)VU+-OX=>I*LSBWP;/H
M8'% O?B914'Z3;G.HDCDF_$!<6,7;$N&+A^Q:$+R.5^%EY!'BY*A&&@D)_F,
MY:-)2H^R?I_RF^?3PIXF,IO*0CD'RVP';Y_VW2Q,&V'0&WC= 8VZ$&$@L)&$
MM94L@MU!! Z53$8]%K:5[O_T9I]3VDUHVHT9"[MQEG9IE/+)E:9_R>?#=(]"
MYMU>:=J'X^XER.>[Z:('S<KTX1B"8X^[?*)X;A2Q5$16,0.3^FUE2:9*+W1V
M^=_3_YQ>J*9^JIQ/)T J7RX+8[65]ZX(U2)R>WET+";9?+DLO=[[P_.+TQ-Q
M0A#=L5LJ8LIBI)\=+73;BOC3='?,HF98-OGD?D+\Y,#OJ=[+B'LI3J;1(F?B
M&X&2!*@YQ6L*8E;+)F"J_J$G9K0B>I*@MRA[7?S9-G%[GH_DR4+>$\&KJ$9M
M:"2>CJF'0$D"U%/!?SV(+3RQM.OYV@TH<Z,H<V-:YN+1I\<39C<61)GUQF60
M/V^3G[YE#]+)YT@\(A;>4?_*Y>X(G4D:9UJJ?4F@_JLZS<V0LWOQD&?EWG/F
M1GZ(MZ@D]9\GZM?4O+9;*ND$HSB$70BA+! ^$[V29C:"A6#5%=0,G9P$=V P
M)$\6\N8DEZ:;9UB[:+$:%D%'DL:1"K%K"]T.LB8/:TXI:P@2@K05D'81M$P-
M69.&M:G8E00MLTG.Q#?2) U-3Q2O)WSI*C3Y.I,(1T0E@6Y.<$FZRKIJ-U>/
MB,YF,3]X4*1\/+W9KJ/936PG2.-D4['+V@E+>/OS"GE#WG;'6[ZF<<PAB'/D
M#KG;/G>[:+S:+61-'M9:5?6]X=HF@B0/2&:M0<O1D35I6)N*74G00I 0I&V 
MI*G89)<&I)G8-=5^FH:LR<.:5B]KAD:^7)[#^1HB)PMR\YJ_@+R%>V8_DPO'
M)!>,Q:?CY0-KL]^YL:[S=UFU%:TT"_O[^S.[[8O?[9=D1OE=4^@X2!6/^?2/
M7?ND;CCD3'RC-TK@C0]JUU0#Z*9&KH]/,?K+PMNCWC41UVP:#T]!7!027+GI
M$ F4A, 5^LLRV\)LM1J=+*;\6)R\_6<21 +DB+%46&.0OP<0W4L2]UHN?4VQ
MWK0<<I+%")\L\#WJ71-Q8F4FQ$T2W&9BU\6:U23G45^\['B"S,G"W#/1JQAN
MLE6;0 K(E"1,/=&[$IQ:)OG$OE >]#%.2</4,]%KJB-M")?7%%= DP:[1[UK
M(PZGO$J$6_F4UUVPYCCDTHTFAWR BS]+P]PST;<Y@AXI'\^W^Y23H^/$;6G0
MG(G]"IYR0NZ0NQU5PTU5M\@A&%:,)R)S<C"W(+HD@\=-M64W+B>G8X_&8G1O
M^Z/'(@5R)K[1CV3PHYG:%=QZ;*HF+HXH#TEFG8LC-E6\\2,1:[7>^&FJCDT^
M)OP3NZ:XBK(TS#T3O9(*$\%"L&H*:IJFDO<!#?%M<K* -Z=X7=3I&O0_X!N)
MDX&XF=IUT=94R;$;AI_<-+BC&.ADP6Y!=EEN%VJ&6IQWP_+\EKT"H_H%%T56
ML(,NC<=-Q=[NZ/C6D;0,1%(:)*=BU]3TT#63'';P46M9<'NB=UW$Z0:Y8DD@
MVCP?$WR-JC3D+>I>Q;U*D<RG_"%3Q$LVO)[I7A5>'YUCL!VDU L1,<D06Z)]
M;?6HF"(!W\B>%.Q-U:YG:;2F;I@D-Q//XO0F&%'_WVX@[C,MC7ZSW[G1*EXH
M;776:ETVK:G;32)L@$L*2>BQR[6OJ[:P\9Z21.C5>D^IJ5GD TWS,=P3ZH4N
MARODJTHA@9(0N!J!NKAL::23LOAF"#;RSR/13$ :9:!QB?!U,6BKY()!VY0=
M!2G&0VD(7)"]-O[P[2,24;?Z[2,ON2$PN_9_ZNW\/V2CWHY^2VV1,_&-?B6!
M7SVH75,0;[5,TLEZ\ =#N2S(S4E>$W>&:CSTZBZ9'_0#0 D1E 3!4O6K&&<U
ML)TJ$5EKVJDO <G4'/)G[SN((?I?HN>/6$F"U7+I:ZH[30,#VNLA[^=9,C8+
M4>N1W@EKN-[\ZV&MZBAGE*\WCR A2%L!:1=!R]&0-6E8FXI=&VLV>5BL[()Y
M^2N)$#PIP%NB?$T46AJN1BH->#.QZV*MJ9).2N-+_1/B)@-NCWK71ASV'23"
MK=:^@V5@WT$>UHQ:^PZ6C2MZRL.:7>N*GC;V$.1AS5[10W@Q2#J./LD#DEX^
M5K6+H&7J8JH2/V*@<?E+ )"XOQ%Q<Y+7Q9T#=77^A,<'SK+X> C0<(JW=:4 
M<+GV552ECFJ3\[P,6*%*0M>\Y#6%-T=UR/L #!7\H/P)ZTB@% 0N%[\N%@V\
M!R(/>T:M]T <6R>GHSB==%+7N[WAKD<1.QFP6]2]'@);JM7$:"<)=@]B5]!U
M0) 0I)T%+=W$!9^D86TF=A5!"T%"D'XB:/VE7D0"Y;4:UW3$[NAEV3M(7N8[
M%OD<P38+[ZA_R+D[.0WI"%U)"E=:JGU=S0$'!X#E0<^I['EJ! E!VEG0,C2-
M?#B^<0<#ZB-O$O#V5/#:F-/%*B?'&><@8#'4<AQG8EUQ1% *!$OUKXU('&R3
M"+_RP38$"4':"DB["%J6D_\WLB8#:U.QZV+-P3O4\K#FU/EN"T@>G\B1B+7*
MGLAIF3B%3AZ0S%JGT+5,RR GP5W^ @)$3A+DYC6O(H19*M:%TO T$[NF$(8K
M/,C$6JTK/+1L$^.:-*S-Q*Z+-0N[ ?*P9E5W<Q]!0I!V%;0<RR&':0H'SPV3
M(GH2H%>B?04AS5!U;//+PM6#V/6$-$,U+61-&M:F8M?%FH4KH\K#FE7GRJB&
MZK3(>10*;8OGJ)$[2;A;(GPEC30$# %#P! P! P!^WL"MF$S+=_@WY0CH;M@
M!+9V_O"SV#)T53M0"22_F,>OU!NR7_.3_*I+KEC\SK6\I@F W%:TTH3W]_=G
MLNZ+W^V?SX+RNZ;0<9 J'O/I'Z]<!JT2&9;9=\<R:'\I&?1*9-#KET'_2\G0
MK$2&YDMEN#KL=$""G[?^DI1?E;U;E=B[59N]EZ3\JNQM5&)OHS9[+TGY5=G;
MK,3>9OUAW5P=UI<MLI..XL;(C8(^7/% 7&37MQIUU21?6.BFT,K'J<82]:.6
M"5]%1QT!0\"J!<RPR!5G*2A#_?,HHOS0\V O@B8+:"L J  XR\:!8%G8FFF]
M]@;CR+VE!YP*I>?;9T7*Q1Y(G[M1TF=\I*3!B+85HZ6.%A<OG+5(WV[X*6]+
M/Q1%$6434!8Y4>[=1$D  K!U$"VY*[JM'.RHCU&4"JZ0CL+M%F9N(\\JR"RZ
M$DF[_+BCS^<7)\N8>;DY!&C%3S(>A6W#LMO*S9 J?1:&[/XQ[##/$S/]?.5^
M"!X%O1+J93D Z3!(%''[O%U%SE*7#^@3:0CT6O*,:FJ144Z5>_$E=BI]\/8,
MS%ENR1N60GR8.DM32:C'GK^>;&GWSF/QY)MR#-^BS)JJ],$*B0@3&Q1T*G"Q
M "G(/<C[77M3F'X$\9.>-&QMU)->?LVNKJJ6INM65S/4)H&+[>T)-:=R/;SD
M7KD/TB%(-Z?SV*.Q.*:]]ZL K,PW5 @Q1(CG69[]?ZZJU9H3=?[(1WG?--QW
M;QHQI_#=8_X$_A&>^N[_4$L! A0#"@    @ EWB;-YF&6 K>#P  P&@! !( 
M             *2!     &5X96-U=&EO;E]L;V<N:'1M;%!+!08      0 !
+ $     .$      ! 
end


Mime
View raw message