harmony-alerts mailing list archives

Site index · List index
Message view « Date » · « Thread »
Top « Date » · « Thread »
From nom...@intel.com
Subject [build-test alert] FAILED Linux x86: dacapo
Date Thu, 27 Dec 2007 09:02:49 GMT
svn.revision=606926
BUILD FAILED:
	Ant Error Message:
/export/users.2/cc/cc-suites/scripts/cc-exec-adaptor.xml:104: The following error occurred
while executing this line: /export/users.2/cc/cc-suites/adaptors/dacapo/adaptor.xml:112: Not
all workloads completed successfully

Date of build:	2007-12-27 15:02:44 +0600
Time to build:	1 second
Last changed:	12/27/2007 14:12:38
Last log entry:	snapshot

***********************************************************
Errors/Warnings:	(12)
            
java version "1.5.0"
pre-alpha : not complete or compatible
svn = r606926, (Dec 27 2007), Linux/ia32/gcc 4.1.0, release build
http://harmony.apache.org
Loading error /export/users.2/cc/cc-suites/build/checkouts/snapshot/hdk/jdk/jre/bin/default/libgc_gen_uncomp.so:
undefined symbol: _Z23free_set_pool_put_entryP12Vector_BlockP11GC_Metadata
GC library cannot be loaded: libgc_gen_uncomp.so
HMYEXEL062E Internal VM error: Failed to create Java VM
FAILED to invoke JVM.
Number of tests: (...........)
N of runned tests(${number.of.runned.tests})
The execution FAILED with the following exception:
The following error occurred while executing this line:
/export/users.2/cc/cc-suites/adaptors/dacapo/adaptor.xml:112: Not all workloads completed
successfully

***********************************************************
Unit Tests: (0)
        
No Tests Run: This project doesn't have any tests

***********************************************************
Modifications since last successful build:	(1)
            
add cc-snapshot log20071227141238Lbuild.73 12/27/2007 14:12:38snapshot

begin 644 execution_log.zip
M4$L#! H    ( %=XFS=[4X07JP(  *<$   2    97AE8W5T:6]N7VQO9RYH
M=&ULC53[:]LP$/X]?\51-MI"8L7NEJY>&NCZ'DDIVRA[4(PLGV,UBF0DN4DV
M]K_OY#XVPQ@S=HA]WSV^^^XTKOQ23<:Y*3:3<6UQ,N;@_$;AX79IM!\X^1U3
M>#-\^79[TFOJ@GL<N'N=]GJVH5\(US=<H[B%HYJ+"N&"VZ71&YCR1M.[A11V
MQ"X<FWICY;SR$!\<Q'U(AL-]^$3X1[>/IO0K;A'.3*,IC30:C 7I'2@I4#MC
M71^X U[7]('G"J-.^CM^S^$>K0N>6W'T.AIN00=!] 9<U16GDK3Q(,RR5N@Q
MY G_*2E%[;@053@$.QJ.#I)1'W9.4$"RWQ:_VX>IU,V:2;Z7L+D0\"J*HV$?
M+"KD#B%OI"HZT2KOZY2QZJ%#$6^91\;..ZBIX874<T!KJ3"&Z]I8SQI'U**$
M"4'WP#72HV-M"D9!Q,(TWC&G>>TJXUE5+-A=>"RR7&I68,D;Y9F2^5QD<]09
MB4.4(V=2H'YC*346X#;+W*@4LJ_)7FD1,X<^JXU16=WX#+6WF^LXN4'AC<W>
M*2,6UW%\?IS-T'/2C'=XG!^3<KGE=@."Z]#P'$$1.2Q2^$LA'>>+V9?3SZ?3
MX2@YA4OMT6JNX&;VT)04SKA45*\W("S23,+[H/[-K!/C[.AR>GH20%+?FP6!
M;F;=F?F CKJ20OSX5="0WK:C&@2(H:0LP?\_1+!M*,<*+GC]S$54YA:NFF5.
M>V!*(+AWM _1[VNW"PTHVJP@1@O>>?%#M^Z1*:,'0]0:?N[V>F%] I&FW99'
MNBOI*_!D*8U29M5.TEI@'3!IZ_*'H1TQ(T1C+65<58'O8T0R^TJ&[=.8]O[9
M =*^IHEX(O_T'JV7*HWC)(4K$I\K!2MC%V$"W//NT<PU0J!S9:/4IC=F?#)F
M[3G$'LXDUAY0OP!02P$"% ,*    " !7>)LW>U.$%ZL"  "G!   $@      
M        I($     97AE8W5T:6]N7VQO9RYH=&UL4$L%!@     !  $ 0   
' -L"      $! 
end


Mime
View raw message