harmony-alerts mailing list archives

Site index · List index
Message view « Date » · « Thread »
Top « Date » · « Thread »
From nom...@intel.com
Subject [build-test alert] FAILED Linux x86: axis2_app
Date Thu, 27 Dec 2007 08:52:44 GMT
Axis-2 client log:


***********************************************************
Axis-2 server log:


============== Starting /export/users.2/cc/cc-suites/build/libs/axis2-1.1.1/bin/axis2server.R.sh
in the next test run =====

JAVA_HOME=/export/users.2/cc/cc-suites/build/checkouts/snapshot/hdk/jdk/jre
JAVA_OPTS=
AXIS2_HOME=/export/users.2/cc/cc-suites/build/libs/axis2-1.1.1
Loading error /export/users.2/cc/cc-suites/build/checkouts/snapshot/hdk/jdk/jre/bin/default/libgc_gen_uncomp.so:
undefined symbol: _Z23free_set_pool_put_entryP12Vector_BlockP11GC_Metadata
GC library cannot be loaded: libgc_gen_uncomp.so
HMYEXEL062E Internal VM error: Failed to create Java VM
FAILED to invoke JVM.

***********************************************************

BUILD FAILED:
	Ant Error Message:
/export/users.2/cc/cc-suites/scripts/cc-exec-adaptor.xml:104: The following error occurred
while executing this line: /export/users.2/cc/cc-suites/adaptors/axis2_app/adaptor.xml:90:
The following error occurred while executing this line: /export/users.2/cc/cc-suites/adaptors/axis2_app/adaptor.xml:184:
Axis2 server startup timeout exceeded

Date of build:	2007-12-27 14:47:39 +0600
Time to build:	5 minutes 1 second
Last changed:	12/27/2007 14:12:38
Last log entry:	snapshot

***********************************************************
Errors/Warnings:	(3)
            
[exec] Result: 1
The execution FAILED with the following exception:
The following error occurred while executing this line:
/export/users.2/cc/cc-suites/adaptors/axis2_app/adaptor.xml:90: The following error occurred
while executing this line:
/export/users.2/cc/cc-suites/adaptors/axis2_app/adaptor.xml:184: Axis2 server startup timeout
exceeded

***********************************************************
Unit Tests: (0)
        
No Tests Run: This project doesn't have any tests

***********************************************************
Modifications since last successful build:	(1)
            
add cc-snapshot log20071227141238Lbuild.73 12/27/2007 14:12:38snapshot

begin 644 execution_log.zip
M4$L#! H    ( )1VFS>/1AX>'0(  %P&   2    97AE8W5T:6]N7VQO9RYH
M=&ULQ551C]HP#'[OK_#+="^C.= >;AU#X@[0F-@FP3%-FM IM(;F+B15XG*P
M7S^G91.<8)H0T]16J?W%_FPG3MHYK72G/;?9MM,N'';:$CQM-;Z_6EA##:]^
M8 (WUZ_>776BLL@D8<.O31)%C24:=$%.M4)#K'(E P#P/4.-A#/HA5&990("
M-X5U)$J/SL<MD:;\-GRI"+V8ETIGPJ$O-7DA-\JW'F11B(E:%1J[09Z@6Z.+
MM5U>DJ"./.:X?WEFWX]R+6=P&TP62G/VE76\6>F#"0>")^DH]E60R0%R=K1:
MS7>A-IHQ/\*3+>HRO"3@?TQS^R*F?6!<FK,XY\K4<IU:/(Y]?I*DZY;^TBM]
ME$B=E<PQ=QM,^7_J>5&@^VTX:3U\^/*IGS#V#P@^=K]V?_N'O^-(<TR?;,G%
M\D86/K<D\NQ)/(;/X4G&<57A!)JGM^SM=#CJP61Z=]>?3 ;3T0%X;TEJ(+7B
M[=\$CZDUV7[+^W*UDFZ;'-4%-VR02IK!@#OH$KT)F44/QA(@SZ#X@.2SK;6A
MR*%E/4B3\60PZ DS(-S0:_80<':1\QA%]SE"*%9)RAH8=(>C?@^>%>5 C"RL
MUO8Y&. FQ2+,22J3/< YZ\"F:>D<DSSG(=6=1X:9QH-6!I/HC_G+3!9DW7[J
M.U4X<I*WUPG\#][FS9L$JH:$NO?K,ZXLJEW!.[(J#&:816TA.VU171ZBODA$
M=:O\!%!+ 0(4 PH    ( )1VFS>/1AX>'0(  %P&   2              "D
M@0    !E>&5C=71I;VY?;&]G+FAT;6Q02P4&      $  0!     30(     
 
end


Mime
View raw message