harmony-alerts mailing list archives

Site index · List index
Message view « Date » · « Thread »
Top « Date » · « Thread »
From nom...@intel.com
Subject [build-test alert] FAILED Linux x86: tomcat-scenario
Date Thu, 27 Dec 2007 08:46:41 GMT
svn.revision=606926
BUILD FAILED:
	Ant Error Message:
/export/users.2/cc/cc-suites/scripts/cc-exec-adaptor.xml:104: The following error occurred
while executing this line: /export/users.2/cc/cc-suites/adaptors/tomcat-scenario/adaptor.xml:100:
Tomcat server startup timeout exceeded

Date of build:	2007-12-27 14:41:36 +0600
Time to build:	5 minutes 1 second
Last changed:	12/27/2007 14:12:38
Last log entry:	snapshot

***********************************************************
Errors/Warnings:	(1)
            
The execution FAILED with the following exception:
The following error occurred while executing this line:
/export/users.2/cc/cc-suites/adaptors/tomcat-scenario/adaptor.xml:100: Tomcat server startup
timeout exceeded

***********************************************************
Unit Tests: (0)
        
No Tests Run: This project doesn't have any tests

***********************************************************
Modifications since last successful build:	(1)
            
add cc-snapshot log20071227141238Lbuild.73 12/27/2007 14:12:38snapshot

begin 644 execution_log.zip
M4$L#! H    ( --UFS?J"68?+@$  %0"   2    97AE8W5T:6]N7VQO9RYH
M=&ULK5+!2L- $+WG*^8B/26;BHK$&!"J('CL342VNY-F99-=9F?;U*]W$RL(
M0NE!&)C#FWGO\7AUQ[UMZHW3AZ;VA$TM(?#!XOVB=0/GP7QB!;?EQ=VBR:+7
MDC$/NZ'*,F51I@T KQHM,K[!:MIFV%8@</2.6,2 %(I+H52:/$3#&,0F&JL%
M88B6@V#7*YF$% Z2C!-FT#@6R=;_4W\$_WZ"&ZZA-18#M.3Z<W2LV00AO50=
MYD>MFZ(LEE?"NFW(,HI34.L. 4=4D8T;X.GA^>5Q!7O#'7!"6F>MVT_J."KT
MTTTUO_P"B!R!4RH2H89]ETS^,":8.Q/ F@&K[*1GJ:5G1W]C.0+%V-MJ6985
MK.<#2"0[I%0'21P]L.G119Y]HD:=U4(VM9A+([X+).8V?0%02P$"% ,*    
M" #3=9LWZ@EF'RX!  !4 @  $@              I($     97AE8W5T:6]N
?7VQO9RYH=&UL4$L%!@     !  $ 0    %X!      $! 
end


Mime
View raw message