harmony-alerts mailing list archives

Site index · List index
Message view « Date » · « Thread »
Top « Date » · « Thread »
From nom...@intel.com
Subject [build-test alert] FAILED Linux x86: JettyScenario
Date Thu, 27 Dec 2007 08:18:34 GMT
Jetty server JRE:

Apache Harmony Launcher : (c) Copyright 1991, 2007 The Apache Software Foundation or its licensors,
as applicable.
java version "1.5.0" 
pre-alpha : not complete or compatible
svn = r606822, (Dec 26 2007), Linux/ia32/gcc 4.1.0, release build
http://harmony.apache.org

Scenario framework JRE:

Apache Harmony Launcher : (c) Copyright 1991, 2007 The Apache Software Foundation or its licensors,
as applicable.
java version "1.5.0" 
pre-alpha : not complete or compatible
svn = r606822, (Dec 26 2007), Linux/ia32/gcc 4.1.0, release build
http://harmony.apache.org

================================================================================
Scenario results:

Testsuite: org.apache.harmony.test.jetty.JettyScenario
Tests run: 5, Failures: 0, Errors: 0, Time elapsed: 4.676 sec
------------- Standard Output ---------------
Setup completed.

==============================================================testInitialPage===
Starting initial page test case.
Loading page from server: http://localhost:7070/test/
Getting resource with name: initial_page.html
Found resource: /export/users.2/cc/cc-suites/build/checkouts/JettyScenario/resources/JettyScenario/initial_page.html
Saving content of downloaded page to: /export/users.2/cc/cc-suites/build/results/JettyScenario/JettyScenario/initial_page.html
Comparing page content with etalon: initial_page.html
Page is equal to etalon.
Initial page test case passed.

============================================================testStaticContent===
Starting static content page test case.
Loading page from server: http://localhost:7070/test/data.txt
Getting resource with name: static_content.txt
Found resource: /export/users.2/cc/cc-suites/build/checkouts/JettyScenario/resources/JettyScenario/static_content.txt
Saving content of downloaded page to: /export/users.2/cc/cc-suites/build/results/JettyScenario/JettyScenario/static_content.txt
Comparing page content with etalon: static_content.txt
Page is equal to etalon.
Static content page test case passed.

=======================================================testSessionDumpServlet===
Starting servlet test case.
Loading page from server: http://localhost:7070/test/session/
Getting resource with name: session_dump.html
Found resource: /export/users.2/cc/cc-suites/build/checkouts/JettyScenario/resources/JettyScenario/session_dump.html
Saving content of downloaded page to: /export/users.2/cc/cc-suites/build/results/JettyScenario/JettyScenario/session_dump.html
Comparing page content with etalon: session_dump.html
Page is equal to etalon.
Session dump servlet page is OK.
Getting resource with name: session_dump_new.html
Found resource: /export/users.2/cc/cc-suites/build/checkouts/JettyScenario/resources/JettyScenario/session_dump_new.html
Saving content of downloaded page to: /export/users.2/cc/cc-suites/build/results/JettyScenario/JettyScenario/session_dump_new.html
Comparing page content with etalon: session_dump_new.html
Page is equal to etalon.
Session create page is OK.
Getting resource with name: session_dump_set.html
Found resource: /export/users.2/cc/cc-suites/build/checkouts/JettyScenario/resources/JettyScenario/session_dump_set.html
Saving content of downloaded page to: /export/users.2/cc/cc-suites/build/results/JettyScenario/JettyScenario/session_dump_set.html
Comparing page content with etalon: session_dump_set.html
Page is equal to etalon.
Session set page is OK.
Getting resource with name: session_dump_remove.html
Found resource: /export/users.2/cc/cc-suites/build/checkouts/JettyScenario/resources/JettyScenario/session_dump_remove.html
Saving content of downloaded page to: /export/users.2/cc/cc-suites/build/results/JettyScenario/JettyScenario/session_dump_remove.html
Comparing page content with etalon: session_dump_remove.html
Page is equal to etalon.
Session remove page is OK.
Getting resource with name: session_dump_invalidate.html
Found resource: /export/users.2/cc/cc-suites/build/checkouts/JettyScenario/resources/JettyScenario/session_dump_invalidate.html
Saving content of downloaded page to: /export/users.2/cc/cc-suites/build/results/JettyScenario/JettyScenario/session_dump_invalidate.html
Comparing page content with etalon: session_dump_invalidate.html
Page is equal to etalon.
Session invalidate page is OK.
Servlet test case passed.

===========================================================testRequestDumpJSP===
Starting JSP test case.
Loading page from server: http://localhost:7070/test/snoop.jsp
Getting resource with name: request_dump_JSP.html
Found resource: /export/users.2/cc/cc-suites/build/checkouts/JettyScenario/resources/JettyScenario/request_dump_JSP.html
Saving content of downloaded page to: /export/users.2/cc/cc-suites/build/results/JettyScenario/JettyScenario/request_dump_JSP.html
Comparing page content with etalon: request_dump_JSP.html
Page is equal to etalon.
JSP test case passed.

=====================================================testGZippedStaticContent===
Starting gzipped static content test case.
Loading page from server: http://localhost:7070/test/data.txt.gz
Unpacking content from archive.
Getting resource with name: static_content_ungzipped.txt
Found resource: /export/users.2/cc/cc-suites/build/checkouts/JettyScenario/resources/JettyScenario/static_content_ungzipped.txt
Saving content of downloaded page to: /export/users.2/cc/cc-suites/build/results/JettyScenario/JettyScenario/static_content_ungzipped.txt
Comparing page content with etalon: static_content_ungzipped.txt
Page is equal to etalon.
Gzipped static content test case passed.
------------- ---------------- ---------------

Testcase: testInitialPage took 1.374 sec
Testcase: testStaticContent took 0.451 sec
Testcase: testSessionDumpServlet took 0.521 sec
Testcase: testRequestDumpJSP took 1.425 sec
Testcase: testGZippedStaticContent took 0.796 sec

================================================================================
Jetty server output:

2007-12-26 13:00:58.532::INFO:  Logging to STDERR via org.mortbay.log.StdErrLog
2007-12-26 13:00:58.925::INFO:  Statistics on = false for SelectChannelConnector @ 0.0.0.0:7070
2007-12-26 13:00:58.993::INFO:  jetty-6.1.2rc1
2007-12-26 13:00:59.113::INFO:  Deploy /export/users.2/cc/cc-suites/build/libs/jetty-6.1.2rc1/contexts/test.xml
-> org.mortbay.jetty.webapp.WebAppContext@29c06bcf{/test,/export/users.2/cc/cc-suites/build/libs/jetty-6.1.2rc1/webapps/test}
2007-12-26 13:00:59.136::INFO:  Deploy /export/users.2/cc/cc-suites/build/libs/jetty-6.1.2rc1/contexts/javadoc.xml
-> org.mortbay.jetty.servlet.Context@29c33c3d{/javadoc,file:/export/users.2/cc/cc-suites/build/libs/jetty-6.1.2rc1/javadoc/}
2007-12-26 13:01:03.272::WARN:  Unknown realm: Test JAAS Realm
2007-12-26 13:01:05.386::INFO:  Started SelectChannelConnector @ 0.0.0.0:7070

================================================================================

BUILD FAILED:
	Ant Error Message:
/export/users.2/cc/cc-suites/scripts/cc-exec-adaptor.xml:104: The following error occurred
while executing this line: /export/users.2/cc/cc-suites/adaptors/JettyScenario/adaptor.xml:133:
Jetty server startup timeout exceeded

Date of build:	2007-12-27 14:12:59 +0600
Time to build:	5 minutes 30 seconds
Last changed:	12/27/2007 14:12:38
Last log entry:	snapshot

***********************************************************
Errors/Warnings:	(2)
            
The execution FAILED with the following exception:
The following error occurred while executing this line:
/export/users.2/cc/cc-suites/adaptors/JettyScenario/adaptor.xml:133: Jetty server startup
timeout exceeded

***********************************************************
Unit Tests: (5)
        
All Tests Passed

***********************************************************
Modifications since last successful build:	(1)
            
add cc-snapshot log20071227141238Lbuild.73 12/27/2007 14:12:38snapshot

begin 644 execution_log.zip
M4$L#! H    ( $]RFS?5#29+40$  #4"   2    97AE8W5T:6]N7VQO9RYH
M=&UL?5)-;\(P#+WG5_@R<6H#0QI35BHAL4E#.\%NB$-(#0T*394X?.S7+RE,
M@QUFY4.)[2>_9Q<U[4U9K&UU+HO685E(\'0V..YM;$.9UU\HX+G_\-(K66@K
M29CY0R,8)%OB"=4*)@0.#]IKV\!3?]0?C'+&,F7WK3:8Z4W6(%98"<9<^$U5
MM5W!^-9@4LF6K(--W#,D.B\4-M)I*V >&LCSE+NLT"#A"J;IULU6 ,=3:QWQ
MX-'Y_)$K%5?F@R;T?!VTJ;A#'PQY?@?+=^F5&[N]*VI!TB7@2PT000_HKA$[
M>9 KF,43YAVD@ %CGS5"TB)0TN!M\O[Q.H6CIAHH>C;6&'M,@'A2V*88T:7<
M.)R+G*U2P3FLX%A'Y7X0HYMJ[<'H!@7[EZN\"/B7YO4[/^V-& R'XHY8['>D
M&UH@O4<;J"LR]8L57)8%[Z:"7R:$=^/R#5!+ 0(4 PH    ( $]RFS?5#29+
M40$  #4"   2              "D@0    !E>&5C=71I;VY?;&]G+FAT;6Q0
52P4&      $  0!     @0$      
end


Mime
View raw message