harmony-alerts mailing list archives

Site index · List index
Message view « Date » · « Thread »
Top « Date » · « Thread »
From nom...@intel.com
Subject [build-test alert] FAILED Linux x86_64: reliability
Date Thu, 27 Dec 2007 04:38:46 GMT
svn.revision=606822
BUILD FAILED:
	Ant Error Message:
/export/users/cc/cc-reliability/scripts/cc-exec-adaptor.xml:104: The following error occurred
while executing this line: /export/users/cc/cc-reliability/adaptors/reliability/adaptor.xml:100:
Some reliability tests failed on /export/users/cc/cc-reliability/build/checkouts/snapshot/hdk/jdk/jre/bin/java

Date of build:	2007-12-26 16:54:01 +0600
Time to build:	1,064 minutes 32 seconds
Last changed:	12/26/2007 16:24:33
Last log entry:	snapshot

***********************************************************
Errors/Warnings:	(89)
            
[java] Java Result: 104
[java] Java Result: 104
[java] Java Result: 104
[java] Java Result: 104
[java] Java Result: 104
[java] Java Result: 104
[java] Java Result: 104
[java] Java Result: 104
[java] Java Result: 104
[java] Java Result: 104
[java] Java Result: 104
[java] Java Result: 104
[java] Java Result: 104
[java] Java Result: 104
[java] Java Result: 104
[java] Java Result: 104
[java] Java Result: 104
[java] Java Result: 104
[java] Java Result: 104
[java] Java Result: 104
[java] Java Result: 104
[java] Java Result: 104
[java] Java Result: 104
[java] Java Result: 104
[java] Java Result: 104
[java] Java Result: 104
[java] Java Result: 104
[java] Java Result: 104
[java] Java Result: 104
[java] Java Result: 104
[java] Java Result: 104
[java] Java Result: 104
[java] Java Result: 104
[java] Java Result: 104
[java] Java Result: 104
[java] Java Result: 104
[java] Java Result: 104
[java] Java Result: 104
[java] Java Result: 104
[java] Java Result: 104
[java] Java Result: 104
[java] Java Result: 104
[java] Java Result: 104
[java] Java Result: 104
[java] Java Result: 104
[java] Java Result: 104
[java] Java Result: 104
[java] Java Result: 104
[java] Java Result: 104
[java] Java Result: 104
[java] Java Result: 104
[java] Java Result: 104
[java] Timeout: killed the sub-process
[java] 	at org.apache.tools.ant.taskdefs.Java.fork(Java.java:754)
[java] 	at org.apache.tools.ant.taskdefs.Java.executeJava(Java.java:171)
[java] 	at org.apache.tools.ant.taskdefs.Java.execute(Java.java:84)
[java] 	at org.apache.tools.ant.UnknownElement.execute(UnknownElement.java:275)
[java] 	at org.apache.tools.ant.Task.perform(Task.java:364)
[java] 	at org.apache.tools.ant.taskdefs.Sequential.execute(Sequential.java:64)
[java] 	at net.sf.antcontrib.logic.IfTask.execute(IfTask.java:197)
[java] 	at sun.reflect.GeneratedMethodAccessor13.invoke(Unknown Source)
[java] 	at sun.reflect.DelegatingMethodAccessorImpl.invoke(DelegatingMethodAccessorImpl.java:25)
[java] 	at java.lang.reflect.Method.invoke(Method.java:585)
[java] 	at org.apache.tools.ant.TaskAdapter.execute(TaskAdapter.java:123)
[java] 	at org.apache.tools.ant.UnknownElement.execute(UnknownElement.java:275)
[java] 	at org.apache.tools.ant.Task.perform(Task.java:364)
[java] 	at org.apache.tools.ant.taskdefs.Sequential.execute(Sequential.java:64)
[java] 	at org.apache.tools.ant.UnknownElement.execute(UnknownElement.java:275)
[java] 	at org.apache.tools.ant.Task.perform(Task.java:364)
[java] 	at org.apache.tools.ant.taskdefs.MacroInstance.execute(MacroInstance.java:378)
[java] 	at org.apache.tools.ant.UnknownElement.execute(UnknownElement.java:275)
[java] 	at org.apache.tools.ant.Task.perform(Task.java:364)
[java] 	at org.apache.tools.ant.Target.execute(Target.java:341)
[java] 	at org.apache.tools.ant.Target.performTasks(Target.java:369)
[java] 	at org.apache.tools.ant.Project.executeSortedTargets(Project.java:1216)
[java] 	at org.apache.tools.ant.Project.executeTarget(Project.java:1185)
[java] 	at org.apache.tools.ant.helper.DefaultExecutor.executeTargets(DefaultExecutor.java:40)
[java] 	at org.apache.tools.ant.Project.executeTargets(Project.java:1068)
[java] 	at org.apache.tools.ant.Main.runBuild(Main.java:668)
[java] 	at org.apache.tools.ant.Main.startAnt(Main.java:187)
[java] 	at org.apache.tools.ant.launch.Launcher.run(Launcher.java:246)
[java] 	at org.apache.tools.ant.launch.Launcher.main(Launcher.java:67)
[java] Java Result: 104
[java] Java Result: 104
[java] Java Result: 104
[java] Java Result: 104
[java] Java Result: 104
[java] Java Result: 104
The execution FAILED with the following exception:
The following error occurred while executing this line:
/export/users/cc/cc-reliability/adaptors/reliability/adaptor.xml:100: Some reliability tests
failed on /export/users/cc/cc-reliability/build/checkouts/snapshot/hdk/jdk/jre/bin/java

***********************************************************
Unit Tests: (59)
        
error: test vm.classloading.ClassCastTest
Unit Test Error Details:	(1)
                
Test: testClass: vm.classloading.ClassCastTest

***********************************************************
Modifications since last successful build:	(1)
            
add cc-snapshot log20071226162433Lbuild.42 12/26/2007 16:24:33snapshot

begin 644 execution_log.zip
M4$L#! H    ( -%4FS<:A)74Y08  .\L   2    97AE8W5T:6]N7VQO9RYH
M=&UL[5K_3]LX%/_Y^"O\RVE,.E+*^+8>AP2AL$YE3)1MTB:$7.>U\>K8.=L!
MNK_^GIV6:SLH;6ARTG02-'9BO\_[XN?WGI.#V";B\*"KHN'A0:KA\( 28X<"
M_GK54])N&/X#&F1_\_<_7QVN96E$+6R86]E86],9_A)"OD4@P,(U.7%7+OLD
MXAJ857I(:G"?*FUKF0%M:HSAWX8&P6F7"VZ'M6[&15338#)A36WRB:#&.NI(
M_SN]I=?DV WM<8'<(')PGXBIQ[Z9#!#ZFH0:D,W(\=%X 0M;FYM[&_6MC:W=
MF_KNSO84W%3'\4-3'OS@:>,GIL@W8+&Z)I>9E$XY%HQMD-'PX"@2H,/+\,W6
M%<P(/-E^C[_DTO/8(/7-[251SK[RM"4O,MNQJ)JD3*B6[(D3Z(DSL$@$;)E8
MU4GU5?"NDPJ7E:X !_5VPIGE2E(]+!O/T4<-HFC]81MNX6>_6C'89ZK1QP2T
M0?9M7 SM4?\;@)8@ JK[9AD_G)@6'*7IY_.P_9'J\A;4)%[S'EA3WE8!Y>72
M*@5M.9CBB/-4#RA.8^'1L5*#(I;R\W#KC"Z33FRC._G.W2A'(M7]CK&L )/Y
MQ.#"7T*A))1LY"G 4RZIP-!=)29N^0S#MGE'3<Q4] +L>09)V:"_^!(S5B/C
M!<R73\1P9D :;OEMV:I\ ,00(RO%BC%Z1MBO!K3C+R\5<Y[-K1>H@,WSB<@A
M98,K39DW^4RW1 7E\'VMLC1HRBP!%Y,KP0SR-=#)3 HR<@03>.Q>^8R$5+ ,
MTRQ,?7R[&O$[0\EBK23_D2./^O\Y^%;YZ%^ #BZA!QHD RJCW.I^X3_]J!2?
M57<N*5Q\:T^HI'U(0!:)SO].1GT;"PDRK3+-X$)SO DEB<E4DF()JPMP/)X:
MO.<V'+5+87(!"UBX7TKI;GQPC*MGT+)N5U/ZYDB(MF)4@"ECC7O $V \H>)4
MZ83:F[+1^F"/;BD7OK+)L6Y")0I64X^J77(5L)AJ+ ^7T?[$M"!4TE(N7Y L
M+X[5E Q-4!&2<AG,.6:=E8CV!??K?IAW/M!DU:GN"$JB-RY5'TW."]Q9V:@3
MA/GUM'71*5D]CV"K='B*_;(-\S.R0QU)?D[3$FS4S7H8'I<VT6A:<#RT<.S;
M5 C<,BR<^)/3,A7U,[8+)K1JT(^9S1M5P#I'S=$Z@I>7QC\.^473]*R\<]"G
M0:M /%$9AKO*!3T5BMK*4;%FK1RSC7&F<M!.K/2J1'UJ[UP@RYP=-%\ Y+]U
ML6H^ETRT,#-X9VV*298$?WQ?FK40Z0/84+AB944"WR:!<4<=SU@&A_E3/G3!
M:(FCM9EI0>@Z(37SE]853T!E.'W A8"(V!B(R;H;J58,S-/)_&_4$J7[:$3*
M8@BL4I@:4"SV+#6#"'HF<+H)>DH/UGW+36OL[6R_?BE)=P*>67#M"<KUO?JJ
M*$]0W2_"[B<YD.I.-D5>_8ZISMSV]+?V=@H 7"'700H:E9NL^XXG]F;W1<KM
MP-\9,L:I>&!YXI9'> [ .8WI.;(,JR#-NX%0?<Z"5L]S.28[ZN9V>[LWGZ9!
MC]#0$^X4_ RD/[*+SL'&*CIB;HDJ77\3<'FK!@\Z)AU_TO#Z63_KY8?X_EAH
M"3^;G!:,7P0L=;XQ*YE[L]^G[MW^M&BM)!5CX>:.R9?3,ZO)M0)!<7,8X^:4
MQ@BCGJ>ULU]T:1Y%-+6@'\P]>2^W^=:;_]UJ";?ZE=1Q3IE6+8EQ4#)XX'KZ
M;HZSM__+:^6*ZC[8"4?QW9S@=I%X-J(PXL^Q9Z:I[KXM0/6C5OXEY(C/#N:N
MN+UYLF9]_'#DV?7=EP/DI&<HUPOM1S$(5 9NKSV*.5K3TU=Z&LBLSS[VB-N;
MJY)D5DF;NT66]CGE&"\RZ3_36O>]?/<H3@W]3=LC:2>HU?>?B<>/4A,TDRP.
MVOZ"^D8VUQ\ZN;=M%UD8LW03Y'.&\.X<?I=.S^&>0>JB^L(G3E.3@N9#<X5U
M$D+TV1+\]-GXQ5(I!X(YPEFX4@D7*%8SR\4RM:(;[T[C6:8U;OHK+EP-^K?F
M=K@,1^,YF!/D#5^B78+[Z&W5K\,,:/Y$:CL[?L[3XT^M]@GI? K#9J=S^JD]
M]?!*62J(Q0(2>?IC<W>;)%SBIF?(U@Y!696,\OIQQ5^-3GRXRE0Z1+KXZS2-
M,8*XTVE#K'HI_;4K+(3S71P52$Z/6NWF";GC-O8E<D\)H>X<Z(/W-_R4B0=:
M*TT4\^LO(G<Q<C:FZ)9%S T17$)C[3E6J4N>E9[F<G33?::+$66S@35/ F1B
MA%]XAO0H=W4]RK"81G!G90.5H4Z,I*F)E:W%T:#VW?UKJ'6YK#GSKQW4Z.%!
MS7_/7,N_;:[Y#YW_ 5!+ 0(4 PH    ( -%4FS<:A)74Y08  .\L   2    
M          "D@0    !E>&5C=71I;VY?;&]G+FAT;6Q02P4&      $  0! 
)    %0<      
end


Mime
View raw message