harmony-alerts mailing list archives

Site index · List index
Message view « Date » · « Thread »
Top « Date » · « Thread »
From nom...@intel.com
Subject [build-test alert] FAILED Linux x86: vtsvm
Date Thu, 27 Dec 2007 04:22:46 GMT
svn.revision=606822
BUILD FAILED:
	Ant Error Message:
/export/users.2/cc/cc-suites/scripts/cc-exec-adaptor.xml:104: The following error occurred
while executing this line: /export/users.2/cc/cc-suites/adaptors/vtsvm/adaptor.xml:84: The
following error occurred while executing this line: /export/users.2/cc/cc-suites/adaptors/vtsvm/adaptor.xml:187:
input file /export/users.2/cc/cc-suites/tests/vts/dest/vts_20071227_1022_results/result.Other/report.xml
does not exist

Date of build:	2007-12-27 10:22:36 +0600
Time to build:	4 seconds

***********************************************************
Errors/Warnings:	(19)
            
VTSVM Execution timestamp: 20071227_1022
[java] /export/users.2/cc/cc-suites/tests/vts/vm/build/build.xml:496: /export/users.2/cc/cc-suites/tests/vts/dest/VTS-built
is not a valid directory
[java] 	at org.apache.tools.ant.taskdefs.Java.fork(Java.java:732)
[java] 	at org.apache.tools.ant.taskdefs.Java.executeJava(Java.java:171)
[java] 	at org.apache.tools.ant.taskdefs.Java.execute(Java.java:84)
[java] 	at org.apache.tools.ant.UnknownElement.execute(UnknownElement.java:275)
[java] 	at org.apache.tools.ant.Task.perform(Task.java:364)
[java] 	at org.apache.tools.ant.Target.execute(Target.java:341)
[java] 	at org.apache.tools.ant.Target.performTasks(Target.java:369)
[java] 	at org.apache.tools.ant.Project.executeSortedTargets(Project.java:1216)
[java] 	at org.apache.tools.ant.Project.executeTarget(Project.java:1185)
[java] 	at org.apache.tools.ant.helper.DefaultExecutor.executeTargets(DefaultExecutor.java:40)
[java] 	at org.apache.tools.ant.Project.executeTargets(Project.java:1068)
[java] 	at org.apache.tools.ant.Main.runBuild(Main.java:668)
[java] 	at org.apache.tools.ant.Main.startAnt(Main.java:187)
[java] 	at org.apache.tools.ant.launch.Launcher.run(Launcher.java:246)
[java] 	at org.apache.tools.ant.launch.Launcher.main(Launcher.java:67)
The execution FAILED with the following exception:
The following error occurred while executing this line:
/export/users.2/cc/cc-suites/adaptors/vtsvm/adaptor.xml:84: The following error occurred while
executing this line:
/export/users.2/cc/cc-suites/adaptors/vtsvm/adaptor.xml:187: input file /export/users.2/cc/cc-suites/tests/vts/dest/vts_20071227_1022_results/result.Other/report.xml
does not exist

***********************************************************
Unit Tests: (0)
        
No Tests Run: This project doesn't have any tests

***********************************************************
Modifications since last successful build:	(0)
            

begin 644 execution_log.zip
M4$L#! H    ( -52FS=SEI1 Z 0  + 1   2    97AE8W5T:6]N7VQO9RYH
M=&ULO5C?3^,X$'Z^_A5^.;7W$*<)I2TYBL0"NPL'NM6U[,L*(9-,B6EB1[93
MROWU-W9:(%7#CX*N@B2.[9G/WXQGQME/39X=[-_(Y.%@OU!PL,^(-@\9C-I3
M*8RG^;\0D6'W]S_;!ZVR2)@!3\]%U&JI$J^$D%\)9&#@BAS;.Q>WI!?N#<B4
M9Z#)5,F<^+ HI#)^J4%I&OIQC'^>+KD![=^4/$M\!;K,C/;G1L]S*Q7E0IS*
M*_)S,OYY04X6$)>&2T$,ST$;EA<1";O=01"&@^N@&X:M7PJ*C,6@X!;U79%)
M"F0JLTS>6TP6#N&:Y%QK;$>D_2(J_*_0^ D^^0C"LT"-'TLQY;=^/+V]!C&G
MBSQK+^'>L3F[(E_L<JRRZ.5E/RF8YTL.W-5*K FL->(4XIE788AJ/<\I<X(\
M:ZK1BJ)7QEI21W4ZFR:@"9!F,Y4J'YUS42[(')>'EAF%M$^#/@T#KTN'GLX+
MPE2<COC.L-\H[9Z;E-C7))4YD%&=-$O973(+Z"[M7G?[_IT"@LZP5(BC5SW>
M37<77XM$*GP[+@6YX+&2^D$;R#4Y%3%MA/!CN1J<Z-;3./ 05X.VBTVI+%+.
M=II9.K*&0O=3I#U!2T-"_BF%9;E-F'G%]RIO<*:6)3J(%JS0J31^FLPL'98&
M_X8+WZIM-QMJ]A9T9\=_61;)=[D1VP8+^)1^5"EN)V)I(=^9$J#U&TBI]HN1
M,L-K2MVNM!S@\QU3'P;$E2E91BX8FEB  V>CQ@3UO1/</#?F"9YKO0=@K>%5
M^SV!PL,VS]@-S[AYB%Z= 0MC9VD/([H&$4-SL*A8P F@!#* LW ;X10.FM+F
M7?,B;$P-GF8YO 34CI$F!=4,#;>,L%9P]!(NR-]V/#G#$)#+!,A+^,:&*5.E
M""\(O7! @FX4AE$OV#"E>MXZ7D>]O?Z;PWT]G]B4)*0AC,Q9QA.2<(4!1JJ'
M1I2_H3=*=4M9@;X*U#D=9<)0P_0L@:FF9SB.HEO/.N[)3HL&.^$?'Q4)+@>#
M?7XF.1@$GR7YF=1A;PNAEV(FY+TXR2 ';*ZDKKUV\L/![B8%6_M.(Z8)+I06
MH&R&Z;B&T[_3W[C 2O^)2#Y-N[J%)R:6S0I!;Z/=*@3?0(!B+@2B5Z-'8@*S
M+DRF&(4P_6F"Q18Z^]:(EHQ80G0=5G]O$ZQ8%@\8J_!J,055.6?DNS8=/ES7
M:ISK5=59W:D++^]?T@\E[Y"B%<MCQ -)M2;=6756>R4,^EOX]9J"2O2:Y&"X
MT:%?D9Q"AI:@QS!E2$!59$M55Z0[Z]U.8Z_[62M9)ZG;'VXA^H)Q03&IN *\
MXUI.7'][:=K&@4-AGDD+AH,MI&6L%'%*S]T-^4:8G<=&%8]ZVSC&NMP<<:X)
M[J_AK35L#G:;I#D'-W:,WOAK%. *0$1 =!G'D$!"FY5]Q2+-Q9_ECB4:8!F"
M; *NPD&)=<NF[5N)L+]/B1:-&AYS=W-5\F'25K]FFWZY/#T_)N/+HZ.3\?CK
MY7FM<R(-UGCV'!)A$-6 )\FDU;(G97@\8'\]/#T_.:Y.9J9VAH9%#(4=$[7J
MAVM0"@TDX[A4"C/%?6K-L91HZ[<4JYP,Z^JH]:(%6,(*Y&_Y%6#5=!76L!>1
M_ULG[O4(J\ZB-)5_?7ZN\9^Y<"*A*@5AP;5I[?OL8-]W'V3\ZN.,[[[4_ =0
M2P$"% ,*    " #54ILW<Y:40.@$  "P$0  $@              I($     
H97AE8W5T:6]N7VQO9RYH=&UL4$L%!@     !  $ 0    !@%      $! 
end


Mime
View raw message