harmony-alerts mailing list archives

Site index · List index
Message view « Date » · « Thread »
Top « Date » · « Thread »
From nom...@intel.com
Subject [build-test alert] FAILED Windows 2003 x86: ehwa
Date Wed, 26 Dec 2007 05:40:42 GMT
svn.revision=606736
BUILD FAILED:
	Ant Error Message:
C:\cc\cc-suites\scripts\cc-exec-adaptor.xml:104: The following error occurred while executing
this line: C:\cc\cc-suites\adaptors\ehwa\adaptor.xml:82: The following error occurred while
executing this line: C:\cc\cc-suites\scripts\framework.xml:1079: Java returned: 1

Date of build:	2007-12-26 03:45:56 +0600
Time to build:	474 minutes 39 seconds
Last changed:	12/25/2007 14:38:59
Last log entry:	snapshot

***********************************************************
Errors/Warnings:	(47)
            
[exec] Result: 1
[echo]
[echo]
[echo] ========================== EHWA.log =======================
[echo]
[echo] --- Automated Eclipse EHWA scenario for Eclipse 3.2.1 ---
[echo]
[echo] Eclipse Home = C:\cc\cc-suites/build/libs/eclipse-3.2.1-win-x86/eclipse
[echo] Tested JRE = C:\cc\cc-suites/build/checkouts/snapshot/hdk/jdk/jre
[echo] Tested JRE options for Eclipse launching =
[echo] Delay factor = 2
[echo]
[echo] Start:
[echo] 	Run Eclipse
[echo] 	Wait Eclipse 'Workspace Launcher' window to appear
[echo] 	WARNING! Window 'Workspace Launcher' didn't become active during 30c. Add extra delay
for 120c.
[echo] 	ERROR! Window 'Workspace Launcher' didn't become active during additional 120c. STOP.
[echo]
[echo] An ERROR has ocurred!
[echo]
[echo] Exit Eclipse:
[echo] 	Eclipse wasn't found
[echo]
[echo] EHWA FAILED!
[echo]
[echo] ======================= eclipse.log =======================
[echo] Install location:
[echo]     file:/C:/cc/cc-suites/build/libs/eclipse-3.2.1-win-x86/eclipse/
[echo] Configuration file:
[echo]     file:/C:/cc/cc-suites/build/libs/eclipse-3.2.1-win-x86/eclipse/configuration/config.ini
loaded
[echo] Configuration location:
[echo]     file:/C:/cc/cc-suites/build/libs/eclipse-3.2.1-win-x86/eclipse/configuration/
[echo] Framework located:
[echo]     file:/C:/cc/cc-suites/build/libs/eclipse-3.2.1-win-x86/eclipse/plugins/org.eclipse.osgi_3.2.1.R32x_v20060919.jar
[echo] Framework classpath:
[echo]     file:/C:/cc/cc-suites/build/libs/eclipse-3.2.1-win-x86/eclipse/plugins/org.eclipse.osgi_3.2.1.R32x_v20060919.jar
[echo] Debug options:
[echo]     file:/C:/cc/cc-suites/build/checkouts/ehwa/.options not found
[echo] Time to load bundles: 250
[echo] Starting application: 11796
[echo] Application Started: 28447902
[echo]
[echo] ===========================================================
BUILD FAILED
C:\cc\cc-suites\build\checkouts\ehwa\ehwa_run.xml:210: EHWA FAILED!
Total time: 474 minutes 38 seconds
The execution FAILED with the following exception:
The following error occurred while executing this line:
C:\cc\cc-suites\adaptors\ehwa\adaptor.xml:82: The following error occurred while executing
this line:
C:\cc\cc-suites\scripts\framework.xml:1079: Java returned: 1

***********************************************************
Unit Tests: (0)
        
No Tests Run: This project doesn't have any tests

***********************************************************
Modifications since last successful build:	(1)
            
add cc-snapshot log20071225143859Lbuild.56 12/25/2007 14:38:59snapshot

begin 644 execution_log.zip
M4$L#! H    ( !-=FC=[[9Z.JP0  -,4   2    97AE8W5T:6]N7VQO9RYH
M=&ULU5C=3QLY$'\&B?]A^G#BY;*;! ID+R"E0*]4J*U23CR0"CG>2=;%6:]L
M+X3[ZV_L?)"EV4TNUX)N!8&-QS._^1Z[G=B1/&GW5?QXTLXTGK09&/LH\7AW
MH%);,^)OC."H_ML?NR<[VWD6,XLU<Y]&.]L[VSIW?\$]-]_9/?L&[W(AXX&0
MM >3!W9+%,%X)(M$Q;<?F4S^1YZH;U"KU:";IW#^X;H#AF/*M%"@4K )PD!)
MJ1Y$.@2NTH$8YII906NTJ9SC%1J+,7SLGL,QG$8]SNFG9G)AT81]AS_D"?([
ME5L3FI1E)E$V3.*[\+O[U;@6:Y4Y)(9$E).?<RDR@_!!C; 4BQ1]$^*$LK87
M-(-&C32NC8\.9M^6"SA#R1YAP+A5F@0T*\V\V5/E66_&@.56"1NM)K3>>@%9
M> WBJ>[K4P;WJ VYI"+63B6RU$73S#'%J J"H'SO5W:/P&A']@AJ4,+!JHV=
M'!8X!7W&[_)L&1R'@%2A3Z?)00M<-IHEHGM>=,^)[BT5/?NVMY;HFQ@E6O1!
MA];)CH5&%WF//TER3^GAW)O*#,5K8^!*8T#ERXK1CTGXPE@FE?DU4 0&K>-L
MRI.CBR-UOYA8#TK?F8QQ7)I4_Q[TO&#W7-?IS=FOR'7(,]^FP)4>)Z0ZQT\U
M,@]'H\FE-0NPENZ[&=T1Q70?]05ZB4H4F'*<P&_6ZX>-9O/@MKZW_[:BY%BF
M;;$QEA-_(7T-_@X&L:0&32&$#D)8@! Z&8%40VJX&F*T3,CEWAXC=]YVC")H
M5-7F16S%E4R+U 8#DA&,T!@V?%[D%[=6<#TN?6"N3QG!NE@75]RDTJ%>-_*^
MGD5Z<6YQ]INM^-RJ'E5><71XV2EIT2Z2Y2E/7)I5^6']T69% E4$UY8?/%=9
M:NN:"3M'OWL]+VV77A'4NT!6C]6#Z\$LRY#I"DQ;UYWNIXM/?[Z!Z\FFI0QC
M$:>[%OK(G?_)"(*FCSC7SFI[=1Y )XX!QU8S2E=O*+)2HTDK%9+/N]W/W<WE
MLC@6SIM,3B3!UZO/7RKDE:]TR.H."R3,@.*YUAB_V2A+QD^>B:J,/N]+S#C]
M!BI/XXT$NFQ_W[FX/#^K +Q!U8)9G]^L:EVDQC(I02KNFW951:7''^#"TRCD
M/-Q@5*WHH(5QV(OYI4@*D\KT+1"I($.P&"M<7 3Z,F8K@BT7]5ZS$;H19X(+
MXU\+*Y/Y4*0F?#Y]WWKRH+O7'-_>T[QP4&\U6L%WIM=!SB4S5%QL\K_!?H;]
M?#AK6/\!]5/7](-6,&N!J5I9=Z[HG.&:B M>Z!,I'>PB:+ZMKSX'-CRF\E/@
MXORYHF'Z6I]E4DQS AJ-P]9!135_HITPH("%YM'^_F&K7M&V-YKL5CY5(^F[
MORXNSZ;5N[BRUJ%C\;XK:C;J444W*+Y=*2K.X$Z1$>P?[L-(I#F)@;TC&M>I
M*L0T;&]?)0ANOLZ](2=<:;"PR;.;,!QS]"$5^2T+"UK3$*#XI)_"0^("8LJ1
MEFTB#$B1NHK\7%\6LXSFK*FBTS>OYU$S@I\FQG M,C+G8%8FO(A&_; 5P4>R
M%)V[;*Y3%S^-[9WM=LA.VJ&_LPPG]Y>AO\S\!U!+ 0(4 PH    ( !-=FC=[
M[9Z.JP0  -,4   2              "D@0    !E>&5C=71I;VY?;&]G+FAT
8;6Q02P4&      $  0!     VP0      
end


Mime
View raw message