harmony-alerts mailing list archives

Site index · List index
Message view « Date » · « Thread »
Top « Date » · « Thread »
From nom...@intel.com
Subject [build-test alert] FAILED Windows 2003 x86: jdktools-test debug
Date Tue, 25 Dec 2007 17:45:47 GMT

BUILD FAILED:
	Ant Error Message:
D:\cc\cc-common\scripts\cc-exec-adaptor.xml:104: The following error occurred while executing
this line: D:\cc\cc-common\adaptors\jdktools-test\adaptor.xml:28: The following error occurred
while executing this line: D:\cc\cc-common\build\checkouts\hdk\working_jdktools\build.xml:242:
The following error occurred while executing this line: D:\cc\cc-common\build\checkouts\hdk\working_jdktools\make\build-test.xml:97:
There were test errors.

Date of build:	2007-12-25 23:24:42 +0600
Time to build:	20 minutes 58 seconds
Last changed:	12/25/2007 18:50:00
Last log entry:	hdk

***********************************************************
Errors/Warnings:	(229)
            
Result: 1
[cc-ant]: Test Suite 'jdktools-test' execution. Repository updated: ${repository.updated}
[cc-ant]: Check for 'run' failure of hdk = ${hdk.parameters.run.failed}
[cc-ant]: Result: failed.superiors = '${failed.superiors}'
========================================
Testing jdktools binaries...
========================================
Compiling JPDA tests
Since fork is false, ignoring memoryMaximumSize setting
----------
1. WARNING in D:\cc\cc-common\build\checkouts\hdk\working_jdktools\modules\jpda\test\common\unit\org\apache\harmony\jpda\tests\framework\DebuggeeRegister.java
(at line 58)
registered.add(debuggee);
^^^^^^^^^^^^^^^^^^^^^^^^
Type safety: The method add(Object) belongs to the raw type LinkedList. References to generic
type LinkedList<E> should be parameterized
----------
----------
2. WARNING in D:\cc\cc-common\build\checkouts\hdk\working_jdktools\modules\jpda\test\common\unit\org\apache\harmony\jpda\tests\framework\TestOptions.java
(at line 505)
internalProperties.put(name, value);
^^^^^^^^^^^^^^^^^^^^^^^^^^^^^^^^^^^
Type safety: The method put(Object, Object) belongs to the raw type HashMap. References to
generic type HashMap<K,V> should be parameterized
----------
----------
3. WARNING in D:\cc\cc-common\build\checkouts\hdk\working_jdktools\modules\jpda\test\common\unit\org\apache\harmony\jpda\tests\framework\jdwp\PacketDispatcher.java
(at line 114)
eventQueue.add(eventPacket);
^^^^^^^^^^^^^^^^^^^^^^^^^^^
Type safety: The method add(Object) belongs to the raw type List. References to generic type
List<E> should be parameterized
----------
4. WARNING in D:\cc\cc-common\build\checkouts\hdk\working_jdktools\modules\jpda\test\common\unit\org\apache\harmony\jpda\tests\framework\jdwp\PacketDispatcher.java
(at line 249)
replies.put(new Integer(replyPacket.getId()),
replyPacket);
^^^^^^^^^^^^^^^^^^^^^^^^^^^^^^^^^^^^^^^^^^^^^^^^^^^^^^^^^^^^^^^^^^^^^^^^^^^^^^^^^^^^^^^^^^^
Type safety: The method put(Object, Object) belongs to the raw type Hashtable. References
to generic type Hashtable<K,V> should be parameterized
----------
5. WARNING in D:\cc\cc-common\build\checkouts\hdk\working_jdktools\modules\jpda\test\common\unit\org\apache\harmony\jpda\tests\framework\jdwp\PacketDispatcher.java
(at line 284)
commands.put(Id, command);
^^^^^^^^^^^^^^^^^^^^^^^^^
Type safety: The method put(Object, Object) belongs to the raw type Hashtable. References
to generic type Hashtable<K,V> should be parameterized
----------
6. WARNING in D:\cc\cc-common\build\checkouts\hdk\working_jdktools\modules\jpda\test\common\unit\org\apache\harmony\jpda\tests\framework\jdwp\PacketDispatcher.java
(at line 355)
commands.put(Id, command);
^^^^^^^^^^^^^^^^^^^^^^^^^
Type safety: The method put(Object, Object) belongs to the raw type Hashtable. References
to generic type Hashtable<K,V> should be parameterized
----------
----------
7. WARNING in D:\cc\cc-common\build\checkouts\hdk\working_jdktools\modules\jpda\test\common\unit\org\apache\harmony\jpda\tests\framework\jdwp\VmMirror.java
(at line 1834)
frames.add(frame);
^^^^^^^^^^^^^^^^^
Type safety: The method add(Object) belongs to the raw type ArrayList. References to generic
type ArrayList<E> should be parameterized
----------
8. WARNING in D:\cc\cc-common\build\checkouts\hdk\working_jdktools\modules\jpda\test\common\unit\org\apache\harmony\jpda\tests\framework\jdwp\VmMirror.java
(at line 1902)
vars.add(var);
^^^^^^^^^^^^^
Type safety: The method add(Object) belongs to the raw type ArrayList. References to generic
type ArrayList<E> should be parameterized
----------
9. WARNING in D:\cc\cc-common\build\checkouts\hdk\working_jdktools\modules\jpda\test\common\unit\org\apache\harmony\jpda\tests\framework\jdwp\VmMirror.java
(at line 2122)
fields.add(superClassFields.toArray()[i]);
^^^^^^^^^^^^^^^^^^^^^^^^^^^^^^^^^^^^^^^^^
Type safety: The method add(Object) belongs to the raw type ArrayList. References to generic
type ArrayList<E> should be parameterized
----------
10. WARNING in D:\cc\cc-common\build\checkouts\hdk\working_jdktools\modules\jpda\test\common\unit\org\apache\harmony\jpda\tests\framework\jdwp\VmMirror.java
(at line 2132)
fields.add(field);
^^^^^^^^^^^^^^^^^
Type safety: The method add(Object) belongs to the raw type ArrayList. References to generic
type ArrayList<E> should be parameterized
----------
----------
11. WARNING in D:\cc\cc-common\build\checkouts\hdk\working_jdktools\modules\jpda\test\common\unit\org\apache\harmony\jpda\tests\jdwp\DebuggerOnDemand\OnthowDebuggerLaunchDebuggee.java
(at line 94)
class ExceptionForDebugger extends Exception {
^^^^^^^^^^^^^^^^^^^^
The serializable class ExceptionForDebugger does not declare a static final serialVersionUID
field of type long
----------
----------
12. WARNING in D:\cc\cc-common\build\checkouts\hdk\working_jdktools\modules\jpda\test\common\unit\org\apache\harmony\jpda\tests\jdwp\Events\ClassUnloadDebuggee.java
(at line 32)
import java.util.LinkedList;
^^^^^^^^^^^^^^^^^^^^
The import java.util.LinkedList is never used
----------
13. WARNING in D:\cc\cc-common\build\checkouts\hdk\working_jdktools\modules\jpda\test\common\unit\org\apache\harmony\jpda\tests\jdwp\Events\ClassUnloadDebuggee.java
(at line 97)
boolean isOutOfMemory = false;
^^^^^^^^^^^^^
The local variable isOutOfMemory is never read
----------
14. WARNING in D:\cc\cc-common\build\checkouts\hdk\working_jdktools\modules\jpda\test\common\unit\org\apache\harmony\jpda\tests\jdwp\Events\ClassUnloadDebuggee.java
(at line 171)
public Class loadClass(String name) throws ClassNotFoundException {
^^^^^
Type safety: The return type Class for loadClass(String) from the type ClassUnloadDebuggee.CustomLoader
needs unchecked conversion to conform to Class<?> from the type ClassLoader
----------
15. WARNING in D:\cc\cc-common\build\checkouts\hdk\working_jdktools\modules\jpda\test\common\unit\org\apache\harmony\jpda\tests\jdwp\Events\ClassUnloadDebuggee.java
(at line 179)
public Class findClass(String name) throws ClassNotFoundException {
^^^^^
Type safety: The return type Class for findClass(String) from the type ClassUnloadDebuggee.CustomLoader
needs unchecked conversion to conform to Class<?> from the type ClassLoader
----------
----------
16. WARNING in D:\cc\cc-common\build\checkouts\hdk\working_jdktools\modules\jpda\test\common\unit\org\apache\harmony\jpda\tests\jdwp\Events\CombinedEvents002Test.java
(at line 100)
boolean expectColocatedEvents = (testedMethodStartCodeIndex == testedMethodEndCodeIndex);
^^^^^^^^^^^^^^^^^^^^^
The local variable expectColocatedEvents is never read
----------
----------
17. WARNING in D:\cc\cc-common\build\checkouts\hdk\working_jdktools\modules\jpda\test\common\unit\org\apache\harmony\jpda\tests\jdwp\Events\CombinedEvents003Test.java
(at line 53)
private boolean eventMethodExitReceived = false;
^^^^^^^^^^^^^^^^^^^^^^^
The field CombinedEvents003Test.eventMethodExitReceived is never read locally
----------
18. WARNING in D:\cc\cc-common\build\checkouts\hdk\working_jdktools\modules\jpda\test\common\unit\org\apache\harmony\jpda\tests\jdwp\Events\CombinedEvents003Test.java
(at line 76)
int EXPECTED_EVENTS_COUNT = EXPECTED_EVENTS_ARRAY.length;
^^^^^^^^^^^^^^^^^^^^^
The local variable EXPECTED_EVENTS_COUNT is never read
----------
----------
19. WARNING in D:\cc\cc-common\build\checkouts\hdk\working_jdktools\modules\jpda\test\common\unit\org\apache\harmony\jpda\tests\jdwp\Events\CombinedEventsTest.java
(at line 84)
int EXPECTED_EVENTS_COUNT = EXPECTED_EVENTS_ARRAY.length;
^^^^^^^^^^^^^^^^^^^^^
The local variable EXPECTED_EVENTS_COUNT is never read
----------
20. WARNING in D:\cc\cc-common\build\checkouts\hdk\working_jdktools\modules\jpda\test\common\unit\org\apache\harmony\jpda\tests\jdwp\Events\CombinedEventsTest.java
(at line 212)
int EXPECTED_EVENTS_COUNT = EXPECTED_EVENTS_ARRAY.length;
^^^^^^^^^^^^^^^^^^^^^
The local variable EXPECTED_EVENTS_COUNT is never read
----------
21. WARNING in D:\cc\cc-common\build\checkouts\hdk\working_jdktools\modules\jpda\test\common\unit\org\apache\harmony\jpda\tests\jdwp\Events\CombinedEventsTest.java
(at line 348)
int EXPECTED_EVENTS_COUNT = EXPECTED_EVENTS_ARRAY.length;
^^^^^^^^^^^^^^^^^^^^^
The local variable EXPECTED_EVENTS_COUNT is never read
----------
22. WARNING in D:\cc\cc-common\build\checkouts\hdk\working_jdktools\modules\jpda\test\common\unit\org\apache\harmony\jpda\tests\jdwp\Events\CombinedEventsTest.java
(at line 732)
String failureMessage = "## FAILURE during checking events! !";
^^^^^^^^^^^^^^
The local variable failureMessage is never read
----------
23. WARNING in D:\cc\cc-common\build\checkouts\hdk\working_jdktools\modules\jpda\test\common\unit\org\apache\harmony\jpda\tests\jdwp\Events\CombinedEventsTest.java
(at line 894)
String failureMessage = "## FAILURE during checking events !";
^^^^^^^^^^^^^^
The local variable failureMessage is never read
----------
----------
24. WARNING in D:\cc\cc-common\build\checkouts\hdk\working_jdktools\modules\jpda\test\common\unit\org\apache\harmony\jpda\tests\jdwp\Events\CombinedEventsTestCase.java
(at line 135)
long methodStartCodeIndex = lineTableReply.getNextValueAsLong();
^^^^^^^^^^^^^^^^^^^^
The local variable methodStartCodeIndex is never read
----------
25. WARNING in D:\cc\cc-common\build\checkouts\hdk\working_jdktools\modules\jpda\test\common\unit\org\apache\harmony\jpda\tests\jdwp\Events\CombinedEventsTestCase.java
(at line 187)
long methodStartCodeIndex = reply.getNextValueAsLong();
^^^^^^^^^^^^^^^^^^^^
The local variable methodStartCodeIndex is never read
----------
----------
26. WARNING in D:\cc\cc-common\build\checkouts\hdk\working_jdktools\modules\jpda\test\common\unit\org\apache\harmony\jpda\tests\jdwp\Events\ExceptionTest.java
(at line 188)
long frameID = reply.getNextValueAsFrameID();
^^^^^^^
The local variable frameID is never read
----------
----------
27. WARNING in D:\cc\cc-common\build\checkouts\hdk\working_jdktools\modules\jpda\test\common\unit\org\apache\harmony\jpda\tests\jdwp\ThreadReference\FramesTest.java
(at line 450)
frames.add(new FrameStruct(frameID, loc));
^^^^^^^^^^^^^^^^^^^^^^^^^^^^^^^^^^^^^^^^^
Type safety: The method add(Object) belongs to the raw type Vector. References to generic
type Vector<E> should be parameterized
----------
----------
28. WARNING in D:\cc\cc-common\build\checkouts\hdk\working_jdktools\modules\jpda\test\common\unit\org\apache\harmony\jpda\tests\jdwp\share\JDWPUnitDebuggeeProcessWrapper.java
(at line 233)
argv.add(val);
^^^^^^^^^^^^^
Type safety: The method add(Object) belongs to the raw type Vector. References to generic
type Vector<E> should be parameterized
----------
29. WARNING in D:\cc\cc-common\build\checkouts\hdk\working_jdktools\modules\jpda\test\common\unit\org\apache\harmony\jpda\tests\jdwp\share\JDWPUnitDebuggeeProcessWrapper.java
(at line 253)
return (String[])argv.toArray(args);
^^^^^^^^^^^^^^^^^^
Type safety: The method toArray(Object[]) belongs to the raw type Vector. References to generic
type Vector<E> should be parameterized
----------
29 problems (29 warnings)
JPDA exclude list: D:\cc\cc-common\build\checkouts\hdk\working_classlib\deploy\build\jdktools.jpda.exclude
Running JPDA tests
Debugger JVM=D:\cc\cc-common\build\checkouts\hdk\target\hdk\jdk\jre/bin/java
Debuggee JVM=D:\cc\cc-common\build\checkouts\hdk\target\hdk\jdk\jre/bin/java
SAMSA exclude list: D:\cc\cc-common\build\checkouts\hdk\working_classlib\deploy\build\jdktools.samsa.exclude
Running SAMSA tests
test.jre.home=D:\cc\cc-common\build\checkouts\hdk\target\hdk\jdk\jre
Run jdk/bin/java -version in D:\cc\cc-common\build\checkouts\hdk\working_jdktools\build\test_report
java version "1.5.0"
pre-alpha : not complete or compatible
svn = r606788, (Dec 25 2007), Windows/ia32/msvc 1310, debug build
http://harmony.apache.org
Run jdk/bin/javac -version in D:\cc\cc-common\build\checkouts\hdk\working_jdktools\build\test_report
Run jdk/bin/javah in D:\cc\cc-common\build\checkouts\hdk\working_jdktools\build\test_report
Run jdk/bin/javadoc in D:\cc\cc-common\build\checkouts\hdk\working_jdktools\build\test_report
Run jdk/bin/jarsigner in D:\cc\cc-common\build\checkouts\hdk\working_jdktools\build\test_report
Run jdk/bin/keytool -help in D:\cc\cc-common\build\checkouts\hdk\working_jdktools\build\test_report
Compiling TOOLS tests
Since fork is false, ignoring memoryMaximumSize setting
----------
1. WARNING in D:\cc\cc-common\build\checkouts\hdk\working_jdktools\modules\tools\src\test\java\org\apache\harmony\tests\tools\javah\Test\Test01.java
(at line 24)
private static final long xxx2 = 1;
^^^^
The field Test01.xxx2 is never read locally
----------
1 problem (1 warning)
TOOLS exclude list: D:\cc\cc-common\build\checkouts\hdk\working_classlib\deploy\build\jdktools.tools.exclude
Running TOOLS tests
test.jre.home=D:\cc\cc-common\build\checkouts\hdk\target\hdk\jdk\jre
The test report is in D:\cc\cc-common\build\checkouts\hdk\working_jdktools\build\test_report\html\index.html
The execution FAILED with the following exception:
The following error occurred while executing this line:
D:\cc\cc-common\adaptors\jdktools-test\adaptor.xml:28: The following error occurred while
executing this line:
D:\cc\cc-common\build\checkouts\hdk\working_jdktools\build.xml:242: The following error occurred
while executing this line:
D:\cc\cc-common\build\checkouts\hdk\working_jdktools\make\build-test.xml:97: There were test
errors.

***********************************************************
Unit Tests: (160)
        
error: testOwnedMonitors001 org.apache.harmony.jpda.tests.jdwp.ThreadReference.OwnedMonitorsTest
Unit Test Error Details:	(1)
                
Test: testOwnedMonitors001Class: org.apache.harmony.jpda.tests.jdwp.ThreadReference.OwnedMonitorsTestorg.apache.harmony.jpda.tests.framework.jdwp.exceptions.ReplyErrorCodeException:
Error 20: INVALID_OBJECT
	at org.apache.harmony.jpda.tests.framework.jdwp.VmMirror.checkReply(VmMirror.java:95)
	at org.apache.harmony.jpda.tests.framework.jdwp.VmMirror.getThreadName(VmMirror.java:699)
	at org.apache.harmony.jpda.tests.jdwp.ThreadReference.OwnedMonitorsTest.testOwnedMonitors001(OwnedMonitorsTest.java:114)
	at java.lang.reflect.VMReflection.invokeMethod(VMReflection.java)

***********************************************************
Modifications since last successful build:	(1)
            
add cc-hdk log20071225185000Lbuild.442 12/25/2007 18:50:00hdk

begin 644 execution_log.zip
M4$L#! H    ( +6]F3=P+<1T#A(  %]^   2    97AE8W5T:6]N7VQO9RYH
M=&UL[5W_4^,ZDO\9JN9_T+ZMJX4J8O(%2,)FN.* V6'>,'"$X=W59(X2MI(8
M',LKV4!VZOWOURW926PG3@ QA*E-S5"V++5:_6FU6BU9;O7#@;?7NN;.<*\5
M"+;7HD2&0X^]_UN7^V%)NO]BNZ11_H^__VWOW6H4.#1D)7GG[[Y;?;=:DBR,
M@M*-<QMR[LG2O=3)<;9LNHBPV&$4>*X-SQT2"'[#[)#X=,"(ZQ-W$' 16N0L
M3K_@0>DSNV,>Y@R8"(?$85W7=T.7^U)? YFN*V2(Y0]W.[8-_THV'PRXWY&V
M<(-0=N+2+I/6P\ CU'<([5&L,%_F.G(]IV/WF7W+(RC;=VX[]US<NG[O*FE0
M9T!O688J-C!D,H06$OQ]8W:??R>K[Q?\K5Y 8:B$))60:]>G JE;UN)4D W;
M8]0O(3.R!&T(HE")W^;!L'0C6*GK>DPC8O<'W,FFQ=EVDQ:5($^DGZJ&#6X=
M5WPG!X(I$.%F]VE2U)FPBBO!$/F7JT!B8]2MEDL&I0,^"%P/I?_I['"?Q"5>
MC)F.[5$I65+%#;VC]B03U7J%2!X)FQ&%"PGY"]79=GVL!,H15Y(N]23;(&[/
MYP+Y&+ !%\,3^N .HD$;+ &!#H]*FB92&OW2Z16+_+%__N7XRS^>WM&TZG5N
MP**H=G3BTA$8@0X7O0X-*-#H]*F Y.$XH^QT!9@5I-@Y9-=1K\?8.>NY,F3"
M0@;3O)(U&A(0/B/;C?7THQ41%V..11UGS8FIK?^=9#+^WXQ?.MO%, !!TBX+
MA[ODHL] S&&?@TD"VJ?7:/C6R37SN-]3P(>00]![$F*QSZY_RYS/P(Y%SED7
M> +\5+8>\YEP[6RVUM$>D7T>>0[0) %%F4!3 $MG,1!GI5>7!5RTFZ>!&A&*
M<2UO9X%U?1"%3[VSL24'8[F&P]$&N:->!!@O"/&CT<:*--H;9![J'ZGLG]"@
M$/(X3^OWC<L70KRV+(C?./=!YXS:MRP\=&5 0RA1W*<KE:TL]N!6^.%_1RQB
MJE.K6TWS,9B;[-ES^[2!WKSU=C&L;C7SAAE<R:33LGMR#/VYQ\0:I@\U<:O'
MPF-G;7U](T-WSF^"Q%-LP%-_+V,[0GKML;G60^4R8#^VW[".-7)V BN&"8-6
MLF-G@\0)BVO%KX#ISMO%M+:=&_?_C6E1>GVIL+X<G+A"\#GC>Z.6Z[B*CE2#
MN[J<#ZZYP7Q?"#J<.Z*/<CU[6&^\0<B:Y6H6LCLJ-&!P40S7VX6J^?:@JE:J
M.:BZ+O,<#9:,8/)T@-&%#SHQY$I<:^O?W.]/=Y[>+L25\EO$N%:$L;K\E2WH
M3"Q?.8BE$(SC5^+4/V3HIW1.?1#D?9+\F4:^W4^"7(4P-_/^+79<<O1@,Q5#
M^<!%0I:PAY"!ES1^2'YD"NNYT@*]MX^A0^%2S_T7>B^DH%:' ] ^#XG#()=@
M!!<D: B0=UV?>C&=2R8D%/QZ?$B4;A+>U2J!ZO1,R%\YM*4@/\)XA.PHL_K5
M]SAU%L(WWXGUF@K!6RL*7<\:QP:SW9D\!LX"NAA*]MD=8!G)A6WF*T>7GB/T
M9CTK]&O@AU$?!'$:A:?=$Q5')^]U@'V&V,D<@7O<!NT'S\A5/2A->B1QP>BB
M$G_E6-!S)%ZI5[(B#Z)K#VR$HD20D+I::X=J)0-#NNLPP@A^+W6>+SS\P"/?
MF6?<R"(#FV!A)'QM@#0'72YR7*R3KN #-<Z-<V9:?1#)D \^0Q* Z3,&YA>-
M.Z# ')BF^G?:[N%("'=0RP O%:76?^Y-JT#36E G7CEV\SR=R,4'4SH!H\<2
MZ$26B^77B9FZ\LHQH92N\,$U;@70M^5R%1>%BK6E7)YEM-E# *[I 4>#&R8T
MP7BO8;W,.5%.;#ND O(X[-AWV -Y_YY,/CT"D)-G.:]YJKU?V.Y/Y^X)]G\F
MKJ\<_RG"M387U^U:S@@(]PXD14;P(JT8I@<W/&<V<^^@(\T9G0M1FX:;=DNG
MMV 6#RD8-?+><$'87CD&]#S8ZCM3UF;)T?^<'1U<'!U>'5T>?;EH7QV<?OUR
M 4!ET_?/S_?_U_*8WPO[T_![6D^;7KO)GO;*L:#9D,W%*[].\@OA57WE^,TS
M<*E6\A/ 7PB890C&/ V8VE9N6]&O!,PRA4P>!TP]'S*)YP==ZGJ18"=,2MIC
M ,IO?_TK^;!__/GK^1%Q(I5'M0DOU(@N_T+^\MM"496YT&0J?PHFRQ11>>3H
MD@]3/AV3)8)D)E3+%(K)075 Y9R9=RVWPHY1V#C<GYTIJ3(7*-%SW&.#&W2^
ML(?P$K?;[</,U.^M39\R/<G$3>7A*;UIF2(C3X"HD8M1%D$DWA R,Q%;HOC$
M** T/R[1R/D)"BBUIG=\. .;#_II,3SS#5Q<ATD0EB&8<-''AHR6$3M*6O-'
MH:WM7(AH8D\)[C=4A&!DBNQP+1;>!@IU?1E6O2_A*1>%RZ<ZR\MM$5^&D(2$
M!ZSSZ?"/LZ]0(HFIG@D. I%_"!H$\_8$UG(A)2IZ=_$^%>]G[5/Y>7!6ER$L
M\7S8\I' ."(?1]Z_?5]7.":[5>!&SHS5CGY/[;%)+1IFJ'LI@,;WZL#R#R19
M@YM[*GP0C%S'EZ4"&&< @A)[L+W(89D7IM1K4O$CD+<,'_=2E%K^]]SKC@.#
M&1_&>1/ML5 9K)AZ_.+@U->VSB/?G_;25O*<D-&N@D^7)^\7X1#<$1A:U>4-
M_A=L$WRMS;&FY6@S<[2_W6#W&+<+^HFE^XD5]Q,M&M54"_N)=>F*,*+>"60"
MK;?B;1$XMJ5)8HHD^ 8FJ6R0#WHJ(W=)>8,<X>8@?7GA#AAA'@TD<W;)CK5-
M)+.?3VC;*M<;IDA5*DM(:<L8*8.2*N_43)&JEHM)U18E5=FVMJK50EK5A6F5
MK5K5H+2*V7J4.I@25B&=K47IU':LQI8Q73"GH:8XVJD:([55JQ>2VEE8YE6K
M-D?FCU'T\AQ=6+B)6U:S4:R>CY#6MBFNC.%7;>Z8DE.M4@S?PMVOTK2:57,#
M1,T<*7,FKUPQ)O?FCB'[8E35RS53LC+6N-HRRLF<+3:&W)8AU412Q:/#HUR7
M+7,R+S>72^;+16993:8I]QQ-IBD%,.=H+!D9HTHPQPR\TG2O:<J@+-VP@J26
M4!&6T1)LFYOG+:=+9]#K,64UD2MC%J&R72SVA:,'59@-;9D;%\S9O'DM? 0I
M8TZ460NS9&,H-*ZY9![B7!EM/T+-:]L&W9]7-WJ512>?1^V+198(,LO?UNF]
MSYP3#C2@.N1';: Z.C32'TW%8RL&H:@8'/,-TZHTC+E_C68Q6Z\2;80AJ&%N
ME:5A;@BJF^-J3L#C47*?,QMX%*TY,]7%5R'J5F-.*/11#JJY$=N@5VG*;38\
MZ5D^4E6K6C/FEIA<-S5EE8U&4XRYNF95U-@D\87)3'-,GKXYXB/W)O;,/I_M
MIK5MRD79J5O-LB%I(BE#;('E-]05ZE:]:6CT-L>4P5DM KAM*#3<,&?,S,D*
M&M@P-<U"89D*F!A4K&US7.W@B!L;V7>K(8_L?BE^?T2JL]9WQ^E,$9E(9:,S
MUW?G[\1K[Y^T7W KGJ0#.;$7#^NUN6]3D,L7#M6Z^M!Z?4PY'JSO<^(S?!.>
MA.PAW" .5V<M\+"OS@V?OYE/-TCE2&? ).M&@+GG _;$#7>Y*O&X_=$N/%)*
MCE)XZK[7&4?:0X4/S/Y.]M5X13[J\8KH@YN8(+MDS5XG!SP8"K?7#TFEV015
MJY;+=;6'-"[6YMWP'D]$4H=44'5 !1?$!>WT7)OY$M1H@U# (5"?6,##)-/U
MJT8F;?RM8H$!_(VDLX"VE:@7]"DPA:<P0>L#CX4,:\)KJ!;HILO(.Q]?3-@I
M[]0;C0VR=LAL K,BY']]@_SA^@Z_EYLNK54W!_+.)I5:!7J,.D>=*(FER?7#
M,-C=W$Q&]7B0A_&^&#W[Q>$[LCT7^C?YA&+4Q_4#>&6K7@>T:E;-@E:-03S^
MKQ.X$P'*H:S1M,B^YQ'U&"P*DTS<,<<J;E;_I5KSZ<MQ27WJ@_29.EI$=V*U
MTYCB%N1T]O3=5WP';G>:$Q9OX47.K1/\R,8WKD]G_TY:^M@O/'A%[A51'Q5)
M)Q-2NN8\5%1 $?NDA7_W5!_IN>#9$95Z[X*0<4LTM)KY#IHBGB4T_8<;L1W6
MI9$7QD>4(<%"00!/.7[P-X,GW+C^$UCBI(5H[J5(H>XA.?U-D!%+@CFN8#::
M;-=_#%LR8+;;==476'*F)L>20UJZ'BZ&([X2EE(:F#!FQ]_< !U*5;<8AZ/*
MR'W?M?MYJEVPG/I=)WRG@(KAO!:X/O2,;#7'*C'^N,:$ZJD7%: :&H5\ $93
M'>4QKP:P7]<<#$P6-CRA2,3C(UH F,/,XS?5UR:I*1]!'9>'AY1$P!7Y)TR2
M-) 3A1:3LD3?1,GS>H@G]8$MR&K".9.@O. \%=LYA]LO9NF _"&2UP<+NCBB
MH0R!ZR$+B]B"X:2'^+X88Z*M*^@S+["FF=B5,1,_8JOX)_FT?Z[\10*XT0Q2
M$P50G]SN<$K!(LV)2ZW C\0$ %BDZ&!YDB]?NF5#"5V-D59R=:4LX8IZQ5 [
M*EKADN<9 BI-O=LRIH"W0$&E+E Z0,V=K%]*@,,!"B/NDK0\]Z/"$^562')T
M$*2/RI(U,!R.V^V"JZ&/UII2YWJ6024] $:;Y2OL8%B!^O!5W+9B"<-3!?CT
M\E;[@W*^K4-PG941S4.J#,N*:A6_<V&N0!U'?4B+>O&(D*O2@SZ2+@)-9O?)
M  )W 9<R[P^6;"; P5$:Y+@R\.B08!+8&#RT2I*U"'BY=V%<3%04N4^XS$HO
ME)2T+MK[5U_//^\AS912P;P+%( . C2U?2[<<)@OC[5K&GAUI;K-I&:HA 0)
MR#;);H8:R.)A2%I]#GT:1 A>G-S[L=O"SKWWIQ(5/%:>'?1JR$3B3*J)F&N#
M,*MGZ8R6SFB!3=FM5&M;T^K2W0+_CG"?[!.I"M<^7ER<H:O>/CWXO9T59 RC
MT%9>CQ!(;FSUD:@MAD'(>X(&,&XJPC"Y2%1 S""I"K<2_I)413/;V^1T-A[%
MA3I+;T!]VL,A<899&->4YFYL#PK8A YGBD\<%;2V8Q^G(08!9M>6YG54HI!9
MU%;SW$YVV8(*)QF>+%/(\< QS^\@/IG#<7NIZ$&VQK2$TZ5F,)US#4"'<(0G
M)1RX7\H]2-_]'E<9*;\@_2QAYT>I%7_+0MN*/R=3M!> :2U]>:6^<;7WIV59
MI/2IA5Y8DJF0$9_?^\DW,V2&DQ6E&X+]<V7E'WHFR5)* 4^B4?1]HA *RA;>
MRLH!7J6'"\'N$HN/1T%'68^GI _!#*&POAAW\9"#W>5A7RL+..+9H@[#Z :,
M*N=LP.\8@2$/I@QJ8)]N5E9*[ &A@B)'ZB+5/*Q/C<!HA&7H\.RPNE*""390
MAN)M!G,1Q2MFUDZ&*Y().+0V6Q)U#<I=],&157J7Z"[7#B0! =$$F&QA?6 S
M%#_6)S?3%-]K=A_FZNM(B9*#]KD^9B)+ WBT/>Z#N$9?\83LR+D2VY3LRB5R
M$%7J]]*>5#8W>%M^:"L8S_ 29:DEF.%5@9/WD59*DGE=36"D>N"Y0F+L@*6H
M*),Q"F "8SEJB5>9YK_(E5P9^\Z7B><\6:<2<E'7^H@H%G5P;6]^9'IY)DP%
M[L7N2J:(UKILW?EH\R(?R;PX/?W<3GTE,WZC?)QE^]\?L$P=A*#OI+#U:0A8
MP;1C$'1+=6850E.?-U1_RI4YGT>;=?!IZO1\=9C,P\-#E;PGE;FG'8Q^T\^/
MT4><QLPIHL\YP#0YC("L59*C"!8XB4#KXHNM?^B_/W/](]>YS*]_++"4/FX]
M'NXOXU5U<$'::/[T^=%M"D@7+J4OO%]IR^2FX'G[@A;FJCQ>'W[N(IYV<$I@
MJ$IL$(1#G1B'"2>2\BD8HBMI[Q#N=7/T+31*4%_J [^!<1!CO5$=9-0&.RIR
M0W0A[*+&W-4.?CV\X^+1719>(K\2YN#AF.%WJS#R3-YJ02CY"!T9?+>ZBDSB
MF!0I)T]O^] CM(I2<@R!JB/]DH.T=E61B0<H?\)M.Q("^MY]W_5&%.%QB"X3
MVDG\ 'FFZ=2A 6Z%'75ZQ5R2C-_VWJTV]&$N1NI;7-2Z[JWJSZY<?=Y\[ @H
M-IIUQ06X/O?X1VF45GH+0&UMTKW6IOI^_*;^EORF^K#\_P-02P$"% ,*    
M" "UO9DW<"W$= X2  !??@  $@              I($     97AE8W5T:6]N
?7VQO9RYH=&UL4$L%!@     !  $ 0    #X2      $! 
end


Mime
View raw message