harmony-alerts mailing list archives

Site index · List index
Message view « Date » · « Thread »
Top « Date » · « Thread »
From nom...@intel.com
Subject [build-test alert] FAILED Windows 2003 x86_64: jdktools-test debug
Date Tue, 25 Dec 2007 15:59:50 GMT

BUILD FAILED:
	Ant Error Message:
C:\cc\cc-common\scripts\cc-exec-adaptor.xml:104: The following error occurred while executing
this line: C:\cc\cc-common\adaptors\jdktools-test\adaptor.xml:23: The following error occurred
while executing this line: C:\cc\cc-common\build\checkouts\hdk\working_jdktools\build.xml:242:
The following error occurred while executing this line: C:\cc\cc-common\build\checkouts\hdk\working_jdktools\make\build-test.xml:97:
There were test errors.

Date of build:	2007-12-25 21:33:38 +0600
Time to build:	26 minutes 5 seconds
Last changed:	12/25/2007 13:49:42
Last log entry:	hdk

***********************************************************
Errors/Warnings:	(226)
            
Result: 1
========================================
Testing jdktools binaries...
========================================
Compiling JPDA tests
Since fork is false, ignoring memoryMaximumSize setting
----------
1. WARNING in C:\cc\cc-common\build\checkouts\hdk\working_jdktools\modules\jpda\test\common\unit\org\apache\harmony\jpda\tests\framework\DebuggeeRegister.java
(at line 58)
registered.add(debuggee);
^^^^^^^^^^^^^^^^^^^^^^^^
Type safety: The method add(Object) belongs to the raw type LinkedList. References to generic
type LinkedList<E> should be parameterized
----------
----------
2. WARNING in C:\cc\cc-common\build\checkouts\hdk\working_jdktools\modules\jpda\test\common\unit\org\apache\harmony\jpda\tests\framework\TestOptions.java
(at line 505)
internalProperties.put(name, value);
^^^^^^^^^^^^^^^^^^^^^^^^^^^^^^^^^^^
Type safety: The method put(Object, Object) belongs to the raw type HashMap. References to
generic type HashMap<K,V> should be parameterized
----------
----------
3. WARNING in C:\cc\cc-common\build\checkouts\hdk\working_jdktools\modules\jpda\test\common\unit\org\apache\harmony\jpda\tests\framework\jdwp\PacketDispatcher.java
(at line 114)
eventQueue.add(eventPacket);
^^^^^^^^^^^^^^^^^^^^^^^^^^^
Type safety: The method add(Object) belongs to the raw type List. References to generic type
List<E> should be parameterized
----------
4. WARNING in C:\cc\cc-common\build\checkouts\hdk\working_jdktools\modules\jpda\test\common\unit\org\apache\harmony\jpda\tests\framework\jdwp\PacketDispatcher.java
(at line 249)
replies.put(new Integer(replyPacket.getId()),
replyPacket);
^^^^^^^^^^^^^^^^^^^^^^^^^^^^^^^^^^^^^^^^^^^^^^^^^^^^^^^^^^^^^^^^^^^^^^^^^^^^^^^^^^^^^^^^^^^
Type safety: The method put(Object, Object) belongs to the raw type Hashtable. References
to generic type Hashtable<K,V> should be parameterized
----------
5. WARNING in C:\cc\cc-common\build\checkouts\hdk\working_jdktools\modules\jpda\test\common\unit\org\apache\harmony\jpda\tests\framework\jdwp\PacketDispatcher.java
(at line 284)
commands.put(Id, command);
^^^^^^^^^^^^^^^^^^^^^^^^^
Type safety: The method put(Object, Object) belongs to the raw type Hashtable. References
to generic type Hashtable<K,V> should be parameterized
----------
6. WARNING in C:\cc\cc-common\build\checkouts\hdk\working_jdktools\modules\jpda\test\common\unit\org\apache\harmony\jpda\tests\framework\jdwp\PacketDispatcher.java
(at line 355)
commands.put(Id, command);
^^^^^^^^^^^^^^^^^^^^^^^^^
Type safety: The method put(Object, Object) belongs to the raw type Hashtable. References
to generic type Hashtable<K,V> should be parameterized
----------
----------
7. WARNING in C:\cc\cc-common\build\checkouts\hdk\working_jdktools\modules\jpda\test\common\unit\org\apache\harmony\jpda\tests\framework\jdwp\VmMirror.java
(at line 1834)
frames.add(frame);
^^^^^^^^^^^^^^^^^
Type safety: The method add(Object) belongs to the raw type ArrayList. References to generic
type ArrayList<E> should be parameterized
----------
8. WARNING in C:\cc\cc-common\build\checkouts\hdk\working_jdktools\modules\jpda\test\common\unit\org\apache\harmony\jpda\tests\framework\jdwp\VmMirror.java
(at line 1902)
vars.add(var);
^^^^^^^^^^^^^
Type safety: The method add(Object) belongs to the raw type ArrayList. References to generic
type ArrayList<E> should be parameterized
----------
9. WARNING in C:\cc\cc-common\build\checkouts\hdk\working_jdktools\modules\jpda\test\common\unit\org\apache\harmony\jpda\tests\framework\jdwp\VmMirror.java
(at line 2122)
fields.add(superClassFields.toArray()[i]);
^^^^^^^^^^^^^^^^^^^^^^^^^^^^^^^^^^^^^^^^^
Type safety: The method add(Object) belongs to the raw type ArrayList. References to generic
type ArrayList<E> should be parameterized
----------
10. WARNING in C:\cc\cc-common\build\checkouts\hdk\working_jdktools\modules\jpda\test\common\unit\org\apache\harmony\jpda\tests\framework\jdwp\VmMirror.java
(at line 2132)
fields.add(field);
^^^^^^^^^^^^^^^^^
Type safety: The method add(Object) belongs to the raw type ArrayList. References to generic
type ArrayList<E> should be parameterized
----------
----------
11. WARNING in C:\cc\cc-common\build\checkouts\hdk\working_jdktools\modules\jpda\test\common\unit\org\apache\harmony\jpda\tests\jdwp\DebuggerOnDemand\OnthowDebuggerLaunchDebuggee.java
(at line 94)
class ExceptionForDebugger extends Exception {
^^^^^^^^^^^^^^^^^^^^
The serializable class ExceptionForDebugger does not declare a static final serialVersionUID
field of type long
----------
----------
12. WARNING in C:\cc\cc-common\build\checkouts\hdk\working_jdktools\modules\jpda\test\common\unit\org\apache\harmony\jpda\tests\jdwp\Events\ClassUnloadDebuggee.java
(at line 32)
import java.util.LinkedList;
^^^^^^^^^^^^^^^^^^^^
The import java.util.LinkedList is never used
----------
13. WARNING in C:\cc\cc-common\build\checkouts\hdk\working_jdktools\modules\jpda\test\common\unit\org\apache\harmony\jpda\tests\jdwp\Events\ClassUnloadDebuggee.java
(at line 97)
boolean isOutOfMemory = false;
^^^^^^^^^^^^^
The local variable isOutOfMemory is never read
----------
14. WARNING in C:\cc\cc-common\build\checkouts\hdk\working_jdktools\modules\jpda\test\common\unit\org\apache\harmony\jpda\tests\jdwp\Events\ClassUnloadDebuggee.java
(at line 171)
public Class loadClass(String name) throws ClassNotFoundException {
^^^^^
Type safety: The return type Class for loadClass(String) from the type ClassUnloadDebuggee.CustomLoader
needs unchecked conversion to conform to Class<?> from the type ClassLoader
----------
15. WARNING in C:\cc\cc-common\build\checkouts\hdk\working_jdktools\modules\jpda\test\common\unit\org\apache\harmony\jpda\tests\jdwp\Events\ClassUnloadDebuggee.java
(at line 179)
public Class findClass(String name) throws ClassNotFoundException {
^^^^^
Type safety: The return type Class for findClass(String) from the type ClassUnloadDebuggee.CustomLoader
needs unchecked conversion to conform to Class<?> from the type ClassLoader
----------
----------
16. WARNING in C:\cc\cc-common\build\checkouts\hdk\working_jdktools\modules\jpda\test\common\unit\org\apache\harmony\jpda\tests\jdwp\Events\CombinedEvents002Test.java
(at line 100)
boolean expectColocatedEvents = (testedMethodStartCodeIndex == testedMethodEndCodeIndex);
^^^^^^^^^^^^^^^^^^^^^
The local variable expectColocatedEvents is never read
----------
----------
17. WARNING in C:\cc\cc-common\build\checkouts\hdk\working_jdktools\modules\jpda\test\common\unit\org\apache\harmony\jpda\tests\jdwp\Events\CombinedEvents003Test.java
(at line 53)
private boolean eventMethodExitReceived = false;
^^^^^^^^^^^^^^^^^^^^^^^
The field CombinedEvents003Test.eventMethodExitReceived is never read locally
----------
18. WARNING in C:\cc\cc-common\build\checkouts\hdk\working_jdktools\modules\jpda\test\common\unit\org\apache\harmony\jpda\tests\jdwp\Events\CombinedEvents003Test.java
(at line 76)
int EXPECTED_EVENTS_COUNT = EXPECTED_EVENTS_ARRAY.length;
^^^^^^^^^^^^^^^^^^^^^
The local variable EXPECTED_EVENTS_COUNT is never read
----------
----------
19. WARNING in C:\cc\cc-common\build\checkouts\hdk\working_jdktools\modules\jpda\test\common\unit\org\apache\harmony\jpda\tests\jdwp\Events\CombinedEventsTest.java
(at line 84)
int EXPECTED_EVENTS_COUNT = EXPECTED_EVENTS_ARRAY.length;
^^^^^^^^^^^^^^^^^^^^^
The local variable EXPECTED_EVENTS_COUNT is never read
----------
20. WARNING in C:\cc\cc-common\build\checkouts\hdk\working_jdktools\modules\jpda\test\common\unit\org\apache\harmony\jpda\tests\jdwp\Events\CombinedEventsTest.java
(at line 212)
int EXPECTED_EVENTS_COUNT = EXPECTED_EVENTS_ARRAY.length;
^^^^^^^^^^^^^^^^^^^^^
The local variable EXPECTED_EVENTS_COUNT is never read
----------
21. WARNING in C:\cc\cc-common\build\checkouts\hdk\working_jdktools\modules\jpda\test\common\unit\org\apache\harmony\jpda\tests\jdwp\Events\CombinedEventsTest.java
(at line 348)
int EXPECTED_EVENTS_COUNT = EXPECTED_EVENTS_ARRAY.length;
^^^^^^^^^^^^^^^^^^^^^
The local variable EXPECTED_EVENTS_COUNT is never read
----------
22. WARNING in C:\cc\cc-common\build\checkouts\hdk\working_jdktools\modules\jpda\test\common\unit\org\apache\harmony\jpda\tests\jdwp\Events\CombinedEventsTest.java
(at line 732)
String failureMessage = "## FAILURE during checking events! !";
^^^^^^^^^^^^^^
The local variable failureMessage is never read
----------
23. WARNING in C:\cc\cc-common\build\checkouts\hdk\working_jdktools\modules\jpda\test\common\unit\org\apache\harmony\jpda\tests\jdwp\Events\CombinedEventsTest.java
(at line 894)
String failureMessage = "## FAILURE during checking events !";
^^^^^^^^^^^^^^
The local variable failureMessage is never read
----------
----------
24. WARNING in C:\cc\cc-common\build\checkouts\hdk\working_jdktools\modules\jpda\test\common\unit\org\apache\harmony\jpda\tests\jdwp\Events\CombinedEventsTestCase.java
(at line 135)
long methodStartCodeIndex = lineTableReply.getNextValueAsLong();
^^^^^^^^^^^^^^^^^^^^
The local variable methodStartCodeIndex is never read
----------
25. WARNING in C:\cc\cc-common\build\checkouts\hdk\working_jdktools\modules\jpda\test\common\unit\org\apache\harmony\jpda\tests\jdwp\Events\CombinedEventsTestCase.java
(at line 187)
long methodStartCodeIndex = reply.getNextValueAsLong();
^^^^^^^^^^^^^^^^^^^^
The local variable methodStartCodeIndex is never read
----------
----------
26. WARNING in C:\cc\cc-common\build\checkouts\hdk\working_jdktools\modules\jpda\test\common\unit\org\apache\harmony\jpda\tests\jdwp\Events\ExceptionTest.java
(at line 188)
long frameID = reply.getNextValueAsFrameID();
^^^^^^^
The local variable frameID is never read
----------
----------
27. WARNING in C:\cc\cc-common\build\checkouts\hdk\working_jdktools\modules\jpda\test\common\unit\org\apache\harmony\jpda\tests\jdwp\ThreadReference\FramesTest.java
(at line 450)
frames.add(new FrameStruct(frameID, loc));
^^^^^^^^^^^^^^^^^^^^^^^^^^^^^^^^^^^^^^^^^
Type safety: The method add(Object) belongs to the raw type Vector. References to generic
type Vector<E> should be parameterized
----------
----------
28. WARNING in C:\cc\cc-common\build\checkouts\hdk\working_jdktools\modules\jpda\test\common\unit\org\apache\harmony\jpda\tests\jdwp\share\JDWPUnitDebuggeeProcessWrapper.java
(at line 233)
argv.add(val);
^^^^^^^^^^^^^
Type safety: The method add(Object) belongs to the raw type Vector. References to generic
type Vector<E> should be parameterized
----------
29. WARNING in C:\cc\cc-common\build\checkouts\hdk\working_jdktools\modules\jpda\test\common\unit\org\apache\harmony\jpda\tests\jdwp\share\JDWPUnitDebuggeeProcessWrapper.java
(at line 253)
return (String[])argv.toArray(args);
^^^^^^^^^^^^^^^^^^
Type safety: The method toArray(Object[]) belongs to the raw type Vector. References to generic
type Vector<E> should be parameterized
----------
29 problems (29 warnings)
JPDA exclude list: C:\cc\cc-common\build\checkouts\hdk\working_classlib\deploy\build\jdktools.jpda.exclude
Running JPDA tests
Debugger JVM=C:\cc\cc-common\build\checkouts\hdk\target\hdk\jdk\jre/bin/java
Debuggee JVM=C:\cc\cc-common\build\checkouts\hdk\target\hdk\jdk\jre/bin/java
SAMSA exclude list: C:\cc\cc-common\build\checkouts\hdk\working_classlib\deploy\build\jdktools.samsa.exclude
Running SAMSA tests
test.jre.home=C:\cc\cc-common\build\checkouts\hdk\target\hdk\jdk\jre
Run jdk/bin/java -version in C:\cc\cc-common\build\checkouts\hdk\working_jdktools\build\test_report
java version "1.5.0"
pre-alpha : not complete or compatible
svn = r606769, (Dec 25 2007), Windows/em64t/msvc 1400, debug build
http://harmony.apache.org
Run jdk/bin/javac -version in C:\cc\cc-common\build\checkouts\hdk\working_jdktools\build\test_report
Run jdk/bin/javah in C:\cc\cc-common\build\checkouts\hdk\working_jdktools\build\test_report
Run jdk/bin/javadoc in C:\cc\cc-common\build\checkouts\hdk\working_jdktools\build\test_report
Run jdk/bin/jarsigner in C:\cc\cc-common\build\checkouts\hdk\working_jdktools\build\test_report
Run jdk/bin/keytool -help in C:\cc\cc-common\build\checkouts\hdk\working_jdktools\build\test_report
Compiling TOOLS tests
Since fork is false, ignoring memoryMaximumSize setting
----------
1. WARNING in C:\cc\cc-common\build\checkouts\hdk\working_jdktools\modules\tools\src\test\java\org\apache\harmony\tests\tools\javah\Test\Test01.java
(at line 24)
private static final long xxx2 = 1;
^^^^
The field Test01.xxx2 is never read locally
----------
1 problem (1 warning)
TOOLS exclude list: C:\cc\cc-common\build\checkouts\hdk\working_classlib\deploy\build\jdktools.tools.exclude
Running TOOLS tests
test.jre.home=C:\cc\cc-common\build\checkouts\hdk\target\hdk\jdk\jre
The test report is in C:\cc\cc-common\build\checkouts\hdk\working_jdktools\build\test_report\html\index.html
The execution FAILED with the following exception:
The following error occurred while executing this line:
C:\cc\cc-common\adaptors\jdktools-test\adaptor.xml:23: The following error occurred while
executing this line:
C:\cc\cc-common\build\checkouts\hdk\working_jdktools\build.xml:242: The following error occurred
while executing this line:
C:\cc\cc-common\build\checkouts\hdk\working_jdktools\make\build-test.xml:97: There were test
errors.

***********************************************************
Unit Tests: (160)
        
error: testPopSeveralFrames org.apache.harmony.jpda.tests.jdwp.StackFrame.PopFrames002Test
Unit Test Error Details:	(1)
                
Test: testPopSeveralFramesClass: org.apache.harmony.jpda.tests.jdwp.StackFrame.PopFrames002Testorg.apache.harmony.jpda.tests.framework.TestErrorException:
org.apache.harmony.jpda.tests.framework.jdwp.exceptions.TimeoutException: Connection was closed
	at org.apache.harmony.jpda.tests.framework.jdwp.VmMirror.performCommand(VmMirror.java:1590)
	at org.apache.harmony.jpda.tests.jdwp.StackFrame.JDWPStackFrameTestCase.jdwpPopFrames(JDWPStackFrameTestCase.java:210)
	at org.apache.harmony.jpda.tests.jdwp.StackFrame.PopFrames002Test.testPopSeveralFrames(PopFrames002Test.java:139)
	at java.lang.reflect.VMReflection.invokeMethod(VMReflection.java)
Caused by: org.apache.harmony.jpda.tests.framework.jdwp.exceptions.TimeoutException: Connection
was closed
	at org.apache.harmony.jpda.tests.framework.jdwp.PacketDispatcher.run(PacketDispatcher.java:600)

***********************************************************
Modifications since last successful build:	(1)
            
add cc-hdk log20071225134942Lbuild.395 12/25/2007 13:49:42hdk

begin 644 execution_log.zip
M4$L#! H    ( '>OF3=A#+QI/A(  (9^   2    97AE8W5T:6]N7VQO9RYH
M=&UL[3W]4]LZMC_#3/\'[=UYLS!#3#Y)8%/>\(!NZ2V%1RCWO6GZ.L)6$H-C
M>24;R';N__[.D>PDMA,G@"AI9S,M8\O2T='YUI$LMP?AT-MO7W-GM-\.!-MO
M4R+#D<?>_JW'_; DW7^Q/=(J_\??_[;_9CT*'!JRDKSS]]ZLOUDO219&0>G&
MN0TY]V3I7NKBN%JV7$38["@*/->&YPX)!+]A=DA\.F3$]8D[#+@(+7(>EU_R
MH/21W3$/:P9,A"/BL)[KNZ'+?:FO 4S/%3+$]H=[7=N&?R6;#X?<[TI;N$$H
MNW%KETGK8>@1ZCN$]BEVF&]S';F>T[4'S+[E$;0=.+?=>RYN7;__+1E0=TAO
M608J#C!D,H01$OQ]8?: ?R7K;Y?\K5]"8^B$))V0:]>G J%;UO)0$ W;8]0O
M(3*R!&,(HE"1W^;!J'0C6*GG>DQSQ!X,N9,MBZOM)2,J09U(/U4#&]XZKOA*
M#@533(2;O:=145?"+KX)AIQ_N0XD#D;=:KIDN'3(AX'K(?4_G!\=D+C%BR'3
MM3TJ)4NZN*%WU)Y&HMJL$,DC83.B^$)"_D)]=EP?.X%VQ)6D1SW)MHC;][E 
M/(9LR,7HE#ZXPVC8 4M 0.%12-- 2N-?NKQBD3\.+CZ=?/K'TQ5-BU[W!BR*
M&D<W;AV!$>ART>_2@ *,[H **!Y-*LIN3X!908C=(W8=]?N,7;"^*T,F+$0P
MC2O9H"$!XC/2:&VF'ZV)N!ES+.HX&TX,;?/O)%/Q_^;\TM4N1P$0DO98.-HC
MEP,&9 X''$P2P#Z[1L.W2:Z9Q_V^8GP(-02])R$V^^CZM\SY".A8Y(+U "?@
MGZK69SX3KIVMUC[>)W+ (\\!F"2@2!,8"O#268Z)\\JKJ\)<M)MG@?((Q7PM
M-[*,=7T@A4^]\XDE!V.Y@>YHB]Q1+P(>+\GB1W,;.]+<WB*+N/Z>RL$I#0I9
M'M=I_[YU]4(<KZT*QV^<^Z![3NU;%AZY,J AM"C6Z4JEGN4]A!5^^-\1BYA2
M:G6K83Z&YR8U>Z%.&]#F^L_+PVI]-V^8(91,E);=DQ/0YSX3&U@^TL"M/@M/
MG(W-S:T,W 6_*1!/L0%/_;V,[0CIM<<66@]5RX#]:/S$,M;*V0GL&"8,6LA.
MG"T2%RPO%;\"3W=^7I[6&CF__V^>%I4W5XK75\-35PB^P+^W:CG%57"D<N[J
M<C%SS3GS R'H:*%'']=ZMEMO_80LVRU7LRR[HT(S#"Z*V?7SLFKWYV-5M5+-
ML:KG,L_1S)(13)X.,;OP3A>&7)%K8_.+^_7IP=//R^)*^6?D<:V(Q^KR5[:@
M<WGYRDDLQ<$X?R7._".&<4KWS ="WB?%'VGDVX,DR57(YMU\?(N*2XX?;*9R
M*.^X2, 2]A RB)(F#\GW3&,]5UI">P>8.A0N]=Q_8?1""GIU.##:YR%Q&-02
MC.""! V!Y3W7IUX,YXH)"0T_GQP1)9N$][1(H#@]D^6OG-I2+#_&?(3L*K/Z
MV?<X=9;B;UZ)]9H*P5LK"EW/FN0&L^I,'L/. KB82O;9'? RDDO;S%?.+CV'
MZ+O-+-&O 1]&?2#$612>]4Y5'IV\U0GV.60G"PCN<1ND'R(C5VE0&O28XH+1
M92G^RKF@YU"\TJQD21Y$UQ[8" 6)("!UM=$)U4H&IG0WP<,(?B]UG4\\?,<C
MWUEDW,@RCDVP,!*^-D :@QX7.2PV24_PH?)SDYJ941]&,N3#CU $S/09 _.+
MQAVXP!R8IOIWVNZA)X0[Z&6H%H<04OL_]V=UH&$M*1.OG+MYGDSD\H,IF0#O
ML0(RD<5B]65BKJR\<DXH)2M\>(U; ?1MN5S%1:%B:2F7YQEM]A! :'K(T>"&
M"4PPWAO8+W-.51#;":F .@X[\1WV0-Z^)=-/CX')R;-<U#S3WB]M]V=C]P3[
M/Y>OKYS_*>)K;2%?&[6<$1#N'5"*C-F+L&(V/;CA!;.9>P>*M, [%W)M%M]T
M6#I[!/-P2+%1<]X;+<FV5\X!/8]MS9T9:[/D^'_.CP\OCX^^'5\=?[KL?#L\
M^_SI$AB5+3^XN#CX7\MC?C\<S.+?TS1M=N\F->V5<T'S6;:07_EUDE^(7]57
MSM\\@R_52GX"^ LQ9A62,4]C3*V>VU;T*S%FE5(FCV-,,Y\RB><'/>IZD6"G
M3$K:9\"4W_[Z5_+NX.3CYXMCXD2JCAH37BB/+O]"_O+;4EF5A:S)=/X4GJQ2
M1N61WB6?IGPZ3U:()7-9M4JIF!RK#JE<,/.NY5;8,0L;I_NS,R75YA(I>H%[
M;'"#SB?V$%[A=KL#F)GZ_8W94Z8GF;B9.#Q%FU8I,_($%K5R.<HB%HF?B#-S
M.;9"^8EQ0FEQ7J*5BQ,4H]2:WLG1'-Z\TT^+V;/8P,5]F&3"*B03+@<XD/$R
M8E=1:[$7JC=R*:*I/26XWU ! L\4V>%&3+PM).KF*JQZ7\%3+@J73W65E]LB
MO@HI"0D/6/?#T1_GGZ%%DE,]%QP((O\0- @6[0FLY5)*5/3OXGTJWH_:I_+C
MV%E=A;3$\]F6SP3&&?DX\_[EZZ;B8[);!6[DW%SM^/=4C4UZT6R&OE>"T?A>
M'5C^H20;<'-/A0^$D9OXLE0 ?@984&(/MA<Y+//"E'I-*GX$]);AXUZ*4LO_
MGGO==<"9\5%<-Y$>"X7!BJ''+P[.?&WK(O+]62]M)<\)&>\J^'!U^G89#"$<
M =>J+F_POV#;$&MM3R0M!YN9@_WE!M5C,B[0$TOKB17KB2:-&JJ%>F)=N2*,
MJ'<*E4#JK7A;!/JV-$@LD03?P"25+?).3V7D'BEOD6/<'*0O+]TA(\RC@63.
M'FE9.XT=(IG]?% [5FNW8@94TRHW6Z:PVFW4#&%E#*.:.5#&!F>5=ZJ%H&K+
M@JI6K$JQ(%27!56I6^6R(:$"8I4-T1V(52G6FN6)5;9VFL6$KR\+JU&Q=LU)
M5MF<7:@:4N:FM5/>-06JL5.L.CO+@JK7K4:MF(7+"WS-:C964>#KID !5M5B
M8CT"J\H"U7G, !MU,UH(\^%ZS9"4@N[4C1GX:L485KL[!@=83/=7$2QC@VLV
MC(&J&!H<@#)DV9M6LV705AGS-[LU<\'C K/WJ$AF@<-Y!-T-*DW+G":;$W9C
MFFP0J]7S?P:]@\%8P:S5,PBJL7J2;FX^LFO.BQKT[>:F$ :C!(.";LXG&_19
M!HV"23]C4/VJ*QE]F@I@0)OKQ2(Z+[M0R<U%=JWFS*C_N'.Y3.JQ$U+[5BV!
M6><\T(MJ\=9KM27C^&BE+,[BO,QCYI8M8QK9-)F664DW;5"Y#9J<2K$A;"P+
MJE:W&B;3D,;<HD'!,C4/:%HU0\.K&"15Q:#F5 RN=%3 9"W('3YF6KA X!^3
MAER4E7Y,XJEL;.);,[?$5%M +(.K,(]+_QH#M4A*EU^DJ%G5EK%0M[EK+M0U
M-\$P)PT&G:%)^VZ(5#4(C PAU3"WG&,V^V0NDJ^NGH,VN![WHZ*U65.-IV^@
M>,^]J7VU!GQXQ:KNF#)$+=!Y0XQNF?/A+7/VL65NT< @*)-962!6TY XM!:%
M X^!9,P4M0RN42,L@T)J+&8U)PYH)&-Q>+,>\L@>E.+73*0ZDGUO4LX4D*E2
M-CZ:?6_QAKW.P6GG!7?L23J44UOVL%^;^S8%NGSBT*VKS[;7IYGC^?L^)S[#
M%^9)R!["+>)P=20##P?J>/'%>_[T@%2-= 4LLFX$6'P^9$_<EY?K$D_E'V_6
M(Z7DQ(6G;H^=<_(]=/C [*_D0+DL\EZ[+*+/=V*"[)$->Y,<\F DW/X@))7=
M71"U:ADFK[C5-&[6X;WP'@].4F=94'6.!1?$!>GT7)OY$L1HBU#@0Z"^Q(!G
M3J;[5X-,QOA;Q6I8Y=](N@I(6XEZP8 "4GA8$XP^\%C(L">\AFX!;KJ-O//Q
M_86=\DYS9W>+;!PQFU0;"O_-+?*'ZSO\7FZSX4X]W![*.YM4ZF50&77>.E$D
M2\,;A&&PM[V=>/;8T8//+V:?_>+\.[8]%Q2<?$ ZZF/]@7MEJ]D$=M6LF@6C
MFG#QY+].X4X$2(BR9J=%#CR/J,=@4IADXHXY5O&P!B\UF@^?3DKJDR!DP-01
M)%J+U8YDBEN5T]73=Y_Q7;F]68%8O-47,;=.\6,<7[@^Q?TK:>OCP?" %KE?
M!'W<)%U,2.F:\U!! 4D<D#;^W5=*TG<ANB.J]-X%(N/6:1@U\QVT13P+:/8/
M-VP[K$<C+XR/,D. A80 G'+XX&\.3KC!_0>@Q$D;N;F? H6RA^#TMT/&* GF
MN(+9:+-=_S%HR8#9;L]57VK)V9H<2@YIZWZX&(WQ2E!*26""F!U_FP-D*-7=
M<AB..R/W ]<>Y*'VP'3J=Z+PW0,J1HM&X/J@&=EN3E1A_!&.*=%3+S1 -S0*
M^1"LICKR8U$/8+^N.1B8+-OP)",1.TBT #"/681O2M>FH:D@01VKAX>91( 5
M^2=,E#0CIQHM1V6)P8FBY_4(3_0#6Y"5A LF07@A>BJV<PZW7\S2 ?@C!*\/
M('31I2$- >L1"XO0 G?21_Z^&&*BHSL8,"^P9IG8M0D2WV.K^"?Y<'"A D8"
M?*,93DTU0'ER>Z,9#8LD)VZU!C\2 P#&(D0'VY-\^](M&TE0-4;:R=4W90G7
MU*N(.E+1 I<\SP!09>H=F D$O 4(JG2)U@%*[G3_4@(['( PQBXIRV,_;CS5
M;HTD1PQ!^;@MV0##X;B]'H0:^@BN&7UN9A%4U /&:+/\#14,.U ?R(K'5DQA
M>*H8/KN]U7FGHF_K"&)G943S+%6&94V-BM^Y,%F@CJ,^N$6]V"/DNO1 1])-
M8,CL/G$@<!=P*?,!8<EF @(<)4&.*P./C@@6@8W!PZTDV8@ EWL7_&(BHHA]
M@F66>J&DI'W9.?CV^>+C/L),"15,O$  Z#! 4SO@P@U'^?;8NX:!5]^4VDQ+
MABI(. '5IM'-0 -:/(Q(>\!!IX&$$,7)_>][;53N_3\5J>"QBNQ JZ$2B2NI
M(6*M+<*LOJ4K6KJB!39EKU*MU6?UI=4"_X[Y/JT3J0XWWE]>GF.LWCD[_+V3
M)63,1J&MO/80"&YB]1&H+49!R/N"!N W%6"8720B(.: 5(W;"7Y)J8*9U38Y
M&XU'8:'.W!M2G_;1)<XQ"Y.>TMA-[$$!FJ!PIO!$KZ"E'76<AI@%F-];&M=Q
MBT)D45K-8SNML@4=3B,\W:80XZ%C'M]A?(*'X_93Z8-LCVD*IUO-03H7&H ,
MH8<G)73<+Q4>I.]^C[N,5%R0?I:@\[W4CK]YH6W%G],E.@K LK:^_*:^A;7_
MIV59I/2AC5%84JD0$9_?^\FW-60&DS4E&X+]<VWM'WHFR5)" 4^B<09^JA$2
MRA;>VMHA7J7=A6!WB<7'(Z.C;,13TH=EAM!87TQ4/.1@=WDXT,("@7BVJ<,P
MO0%>Y8(-^1TCX/)@RJ <^VRSLE9B#\@J:'*L+E+#P_Z4!T8C+$.'9]WJ6@DF
MV  9FG<8S$44KEA9!QFN2";@,-IL2Y0U:'<Y@$!6R5TBNUP'D 0(1!/&9!OK
M@YVA^8D^X9FF\-ZP!S!7WT1(E!QV+O1Q%%D8@*/M<1_(-?[:)U1'S!799E17
M(9&#7*5^/QU)96M#M.6'MF+C.5XB+34%,[@JYN1CI+629%Y/ QB+'D2N4!@'
M8"DHRF2,,YB 6 Y:$E6F\2\*)=<FL?-5$CE/]ZF(7*1:[Y&+10JN[<WWC)9G
MTE007NRM99IHJ<OVG4\W+_,QS<NSLX^=U-<TXS?/)U4:__[09>K !'TGA:U/
M3< .9AV7H$>J*ZL4FOH,HOI3KBSXC-J\ U)3I^RK0V<>'AZJY"VI+#P58?R;
M?<Z,/@HU1DX!?<Y!I\FA!62CDAQ9L,2)!5H67VP!1/_]D0L@.>4ROP"RQ'+Z
M9/3X$0 9KZQ#"-)!\Z?/F>Y0X'3A<OK2&Y<:QC80MJR=!7MXET:J/'D]_KF+
M>#J^*8&=*K%A$(YT89PEG"K*EV"&KJ2#0[C7P]&W,"A!?:G/!0?$@8HP]&%&
M:E!/$1NB&Z&&&HM6N_B1\:Z+)WQ9>(GX2IB"AQ.$WZR#XYF^U810]!$Z,?AF
M?1V11)<4J1A/[_S0#EHE*3EF0-7)?\EY6WNJR=0#I#_AMAT) :IW/W"],41X
M'&+$A&82.LL.G3H4IAA"CG5>(9<4XR? ]ZHU?>:+D?Z6)[7NNU[]T9VKKZ!/
MX@"%QFY380&1SSW^41*EA=X"IK:WZ7Y[6WUF?EM_<GY;?7_^_P%02P$"% ,*
M    " !WKYDW80R\:3X2  "&?@  $@              I($     97AE8W5T
B:6]N7VQO9RYH=&UL4$L%!@     !  $ 0    &X2      $! 
end


Mime
View raw message