harmony-alerts mailing list archives

Site index · List index
Message view « Date » · « Thread »
Top « Date » · « Thread »
From nom...@intel.com
Subject [build-test alert] FAILED Windows 2003 x86: jdktools-test debug
Date Mon, 24 Dec 2007 20:27:36 GMT

BUILD FAILED:
	Ant Error Message:
D:\cc\cc-common\scripts\cc-exec-adaptor.xml:104: The following error occurred while executing
this line: D:\cc\cc-common\adaptors\jdktools-test\adaptor.xml:28: The following error occurred
while executing this line: D:\cc\cc-common\build\checkouts\hdk\working_jdktools\build.xml:242:
The following error occurred while executing this line: D:\cc\cc-common\build\checkouts\hdk\working_jdktools\make\build-test.xml:97:
There were test errors.

Date of build:	2007-12-25 02:06:31 +0600
Time to build:	20 minutes 58 seconds
Last changed:	12/24/2007 21:30:31
Last log entry:	hdk

***********************************************************
Errors/Warnings:	(229)
            
Result: 1
[cc-ant]: Test Suite 'jdktools-test' execution. Repository updated: ${repository.updated}
[cc-ant]: Check for 'run' failure of hdk = ${hdk.parameters.run.failed}
[cc-ant]: Result: failed.superiors = '${failed.superiors}'
========================================
Testing jdktools binaries...
========================================
Compiling JPDA tests
Since fork is false, ignoring memoryMaximumSize setting
----------
1. WARNING in D:\cc\cc-common\build\checkouts\hdk\working_jdktools\modules\jpda\test\common\unit\org\apache\harmony\jpda\tests\framework\DebuggeeRegister.java
(at line 58)
registered.add(debuggee);
^^^^^^^^^^^^^^^^^^^^^^^^
Type safety: The method add(Object) belongs to the raw type LinkedList. References to generic
type LinkedList<E> should be parameterized
----------
----------
2. WARNING in D:\cc\cc-common\build\checkouts\hdk\working_jdktools\modules\jpda\test\common\unit\org\apache\harmony\jpda\tests\framework\TestOptions.java
(at line 505)
internalProperties.put(name, value);
^^^^^^^^^^^^^^^^^^^^^^^^^^^^^^^^^^^
Type safety: The method put(Object, Object) belongs to the raw type HashMap. References to
generic type HashMap<K,V> should be parameterized
----------
----------
3. WARNING in D:\cc\cc-common\build\checkouts\hdk\working_jdktools\modules\jpda\test\common\unit\org\apache\harmony\jpda\tests\framework\jdwp\PacketDispatcher.java
(at line 114)
eventQueue.add(eventPacket);
^^^^^^^^^^^^^^^^^^^^^^^^^^^
Type safety: The method add(Object) belongs to the raw type List. References to generic type
List<E> should be parameterized
----------
4. WARNING in D:\cc\cc-common\build\checkouts\hdk\working_jdktools\modules\jpda\test\common\unit\org\apache\harmony\jpda\tests\framework\jdwp\PacketDispatcher.java
(at line 249)
replies.put(new Integer(replyPacket.getId()),
replyPacket);
^^^^^^^^^^^^^^^^^^^^^^^^^^^^^^^^^^^^^^^^^^^^^^^^^^^^^^^^^^^^^^^^^^^^^^^^^^^^^^^^^^^^^^^^^^^
Type safety: The method put(Object, Object) belongs to the raw type Hashtable. References
to generic type Hashtable<K,V> should be parameterized
----------
5. WARNING in D:\cc\cc-common\build\checkouts\hdk\working_jdktools\modules\jpda\test\common\unit\org\apache\harmony\jpda\tests\framework\jdwp\PacketDispatcher.java
(at line 284)
commands.put(Id, command);
^^^^^^^^^^^^^^^^^^^^^^^^^
Type safety: The method put(Object, Object) belongs to the raw type Hashtable. References
to generic type Hashtable<K,V> should be parameterized
----------
6. WARNING in D:\cc\cc-common\build\checkouts\hdk\working_jdktools\modules\jpda\test\common\unit\org\apache\harmony\jpda\tests\framework\jdwp\PacketDispatcher.java
(at line 355)
commands.put(Id, command);
^^^^^^^^^^^^^^^^^^^^^^^^^
Type safety: The method put(Object, Object) belongs to the raw type Hashtable. References
to generic type Hashtable<K,V> should be parameterized
----------
----------
7. WARNING in D:\cc\cc-common\build\checkouts\hdk\working_jdktools\modules\jpda\test\common\unit\org\apache\harmony\jpda\tests\framework\jdwp\VmMirror.java
(at line 1834)
frames.add(frame);
^^^^^^^^^^^^^^^^^
Type safety: The method add(Object) belongs to the raw type ArrayList. References to generic
type ArrayList<E> should be parameterized
----------
8. WARNING in D:\cc\cc-common\build\checkouts\hdk\working_jdktools\modules\jpda\test\common\unit\org\apache\harmony\jpda\tests\framework\jdwp\VmMirror.java
(at line 1902)
vars.add(var);
^^^^^^^^^^^^^
Type safety: The method add(Object) belongs to the raw type ArrayList. References to generic
type ArrayList<E> should be parameterized
----------
9. WARNING in D:\cc\cc-common\build\checkouts\hdk\working_jdktools\modules\jpda\test\common\unit\org\apache\harmony\jpda\tests\framework\jdwp\VmMirror.java
(at line 2122)
fields.add(superClassFields.toArray()[i]);
^^^^^^^^^^^^^^^^^^^^^^^^^^^^^^^^^^^^^^^^^
Type safety: The method add(Object) belongs to the raw type ArrayList. References to generic
type ArrayList<E> should be parameterized
----------
10. WARNING in D:\cc\cc-common\build\checkouts\hdk\working_jdktools\modules\jpda\test\common\unit\org\apache\harmony\jpda\tests\framework\jdwp\VmMirror.java
(at line 2132)
fields.add(field);
^^^^^^^^^^^^^^^^^
Type safety: The method add(Object) belongs to the raw type ArrayList. References to generic
type ArrayList<E> should be parameterized
----------
----------
11. WARNING in D:\cc\cc-common\build\checkouts\hdk\working_jdktools\modules\jpda\test\common\unit\org\apache\harmony\jpda\tests\jdwp\DebuggerOnDemand\OnthowDebuggerLaunchDebuggee.java
(at line 94)
class ExceptionForDebugger extends Exception {
^^^^^^^^^^^^^^^^^^^^
The serializable class ExceptionForDebugger does not declare a static final serialVersionUID
field of type long
----------
----------
12. WARNING in D:\cc\cc-common\build\checkouts\hdk\working_jdktools\modules\jpda\test\common\unit\org\apache\harmony\jpda\tests\jdwp\Events\ClassUnloadDebuggee.java
(at line 32)
import java.util.LinkedList;
^^^^^^^^^^^^^^^^^^^^
The import java.util.LinkedList is never used
----------
13. WARNING in D:\cc\cc-common\build\checkouts\hdk\working_jdktools\modules\jpda\test\common\unit\org\apache\harmony\jpda\tests\jdwp\Events\ClassUnloadDebuggee.java
(at line 97)
boolean isOutOfMemory = false;
^^^^^^^^^^^^^
The local variable isOutOfMemory is never read
----------
14. WARNING in D:\cc\cc-common\build\checkouts\hdk\working_jdktools\modules\jpda\test\common\unit\org\apache\harmony\jpda\tests\jdwp\Events\ClassUnloadDebuggee.java
(at line 171)
public Class loadClass(String name) throws ClassNotFoundException {
^^^^^
Type safety: The return type Class for loadClass(String) from the type ClassUnloadDebuggee.CustomLoader
needs unchecked conversion to conform to Class<?> from the type ClassLoader
----------
15. WARNING in D:\cc\cc-common\build\checkouts\hdk\working_jdktools\modules\jpda\test\common\unit\org\apache\harmony\jpda\tests\jdwp\Events\ClassUnloadDebuggee.java
(at line 179)
public Class findClass(String name) throws ClassNotFoundException {
^^^^^
Type safety: The return type Class for findClass(String) from the type ClassUnloadDebuggee.CustomLoader
needs unchecked conversion to conform to Class<?> from the type ClassLoader
----------
----------
16. WARNING in D:\cc\cc-common\build\checkouts\hdk\working_jdktools\modules\jpda\test\common\unit\org\apache\harmony\jpda\tests\jdwp\Events\CombinedEvents002Test.java
(at line 100)
boolean expectColocatedEvents = (testedMethodStartCodeIndex == testedMethodEndCodeIndex);
^^^^^^^^^^^^^^^^^^^^^
The local variable expectColocatedEvents is never read
----------
----------
17. WARNING in D:\cc\cc-common\build\checkouts\hdk\working_jdktools\modules\jpda\test\common\unit\org\apache\harmony\jpda\tests\jdwp\Events\CombinedEvents003Test.java
(at line 53)
private boolean eventMethodExitReceived = false;
^^^^^^^^^^^^^^^^^^^^^^^
The field CombinedEvents003Test.eventMethodExitReceived is never read locally
----------
18. WARNING in D:\cc\cc-common\build\checkouts\hdk\working_jdktools\modules\jpda\test\common\unit\org\apache\harmony\jpda\tests\jdwp\Events\CombinedEvents003Test.java
(at line 76)
int EXPECTED_EVENTS_COUNT = EXPECTED_EVENTS_ARRAY.length;
^^^^^^^^^^^^^^^^^^^^^
The local variable EXPECTED_EVENTS_COUNT is never read
----------
----------
19. WARNING in D:\cc\cc-common\build\checkouts\hdk\working_jdktools\modules\jpda\test\common\unit\org\apache\harmony\jpda\tests\jdwp\Events\CombinedEventsTest.java
(at line 84)
int EXPECTED_EVENTS_COUNT = EXPECTED_EVENTS_ARRAY.length;
^^^^^^^^^^^^^^^^^^^^^
The local variable EXPECTED_EVENTS_COUNT is never read
----------
20. WARNING in D:\cc\cc-common\build\checkouts\hdk\working_jdktools\modules\jpda\test\common\unit\org\apache\harmony\jpda\tests\jdwp\Events\CombinedEventsTest.java
(at line 212)
int EXPECTED_EVENTS_COUNT = EXPECTED_EVENTS_ARRAY.length;
^^^^^^^^^^^^^^^^^^^^^
The local variable EXPECTED_EVENTS_COUNT is never read
----------
21. WARNING in D:\cc\cc-common\build\checkouts\hdk\working_jdktools\modules\jpda\test\common\unit\org\apache\harmony\jpda\tests\jdwp\Events\CombinedEventsTest.java
(at line 348)
int EXPECTED_EVENTS_COUNT = EXPECTED_EVENTS_ARRAY.length;
^^^^^^^^^^^^^^^^^^^^^
The local variable EXPECTED_EVENTS_COUNT is never read
----------
22. WARNING in D:\cc\cc-common\build\checkouts\hdk\working_jdktools\modules\jpda\test\common\unit\org\apache\harmony\jpda\tests\jdwp\Events\CombinedEventsTest.java
(at line 732)
String failureMessage = "## FAILURE during checking events! !";
^^^^^^^^^^^^^^
The local variable failureMessage is never read
----------
23. WARNING in D:\cc\cc-common\build\checkouts\hdk\working_jdktools\modules\jpda\test\common\unit\org\apache\harmony\jpda\tests\jdwp\Events\CombinedEventsTest.java
(at line 894)
String failureMessage = "## FAILURE during checking events !";
^^^^^^^^^^^^^^
The local variable failureMessage is never read
----------
----------
24. WARNING in D:\cc\cc-common\build\checkouts\hdk\working_jdktools\modules\jpda\test\common\unit\org\apache\harmony\jpda\tests\jdwp\Events\CombinedEventsTestCase.java
(at line 135)
long methodStartCodeIndex = lineTableReply.getNextValueAsLong();
^^^^^^^^^^^^^^^^^^^^
The local variable methodStartCodeIndex is never read
----------
25. WARNING in D:\cc\cc-common\build\checkouts\hdk\working_jdktools\modules\jpda\test\common\unit\org\apache\harmony\jpda\tests\jdwp\Events\CombinedEventsTestCase.java
(at line 187)
long methodStartCodeIndex = reply.getNextValueAsLong();
^^^^^^^^^^^^^^^^^^^^
The local variable methodStartCodeIndex is never read
----------
----------
26. WARNING in D:\cc\cc-common\build\checkouts\hdk\working_jdktools\modules\jpda\test\common\unit\org\apache\harmony\jpda\tests\jdwp\Events\ExceptionTest.java
(at line 188)
long frameID = reply.getNextValueAsFrameID();
^^^^^^^
The local variable frameID is never read
----------
----------
27. WARNING in D:\cc\cc-common\build\checkouts\hdk\working_jdktools\modules\jpda\test\common\unit\org\apache\harmony\jpda\tests\jdwp\ThreadReference\FramesTest.java
(at line 450)
frames.add(new FrameStruct(frameID, loc));
^^^^^^^^^^^^^^^^^^^^^^^^^^^^^^^^^^^^^^^^^
Type safety: The method add(Object) belongs to the raw type Vector. References to generic
type Vector<E> should be parameterized
----------
----------
28. WARNING in D:\cc\cc-common\build\checkouts\hdk\working_jdktools\modules\jpda\test\common\unit\org\apache\harmony\jpda\tests\jdwp\share\JDWPUnitDebuggeeProcessWrapper.java
(at line 233)
argv.add(val);
^^^^^^^^^^^^^
Type safety: The method add(Object) belongs to the raw type Vector. References to generic
type Vector<E> should be parameterized
----------
29. WARNING in D:\cc\cc-common\build\checkouts\hdk\working_jdktools\modules\jpda\test\common\unit\org\apache\harmony\jpda\tests\jdwp\share\JDWPUnitDebuggeeProcessWrapper.java
(at line 253)
return (String[])argv.toArray(args);
^^^^^^^^^^^^^^^^^^
Type safety: The method toArray(Object[]) belongs to the raw type Vector. References to generic
type Vector<E> should be parameterized
----------
29 problems (29 warnings)
JPDA exclude list: D:\cc\cc-common\build\checkouts\hdk\working_classlib\deploy\build\jdktools.jpda.exclude
Running JPDA tests
Debugger JVM=D:\cc\cc-common\build\checkouts\hdk\target\hdk\jdk\jre/bin/java
Debuggee JVM=D:\cc\cc-common\build\checkouts\hdk\target\hdk\jdk\jre/bin/java
SAMSA exclude list: D:\cc\cc-common\build\checkouts\hdk\working_classlib\deploy\build\jdktools.samsa.exclude
Running SAMSA tests
test.jre.home=D:\cc\cc-common\build\checkouts\hdk\target\hdk\jdk\jre
Run jdk/bin/java -version in D:\cc\cc-common\build\checkouts\hdk\working_jdktools\build\test_report
java version "1.5.0"
pre-alpha : not complete or compatible
svn = r606703, (Dec 24 2007), Windows/ia32/msvc 1310, debug build
http://harmony.apache.org
Run jdk/bin/javac -version in D:\cc\cc-common\build\checkouts\hdk\working_jdktools\build\test_report
Run jdk/bin/javah in D:\cc\cc-common\build\checkouts\hdk\working_jdktools\build\test_report
Run jdk/bin/javadoc in D:\cc\cc-common\build\checkouts\hdk\working_jdktools\build\test_report
Run jdk/bin/jarsigner in D:\cc\cc-common\build\checkouts\hdk\working_jdktools\build\test_report
Run jdk/bin/keytool -help in D:\cc\cc-common\build\checkouts\hdk\working_jdktools\build\test_report
Compiling TOOLS tests
Since fork is false, ignoring memoryMaximumSize setting
----------
1. WARNING in D:\cc\cc-common\build\checkouts\hdk\working_jdktools\modules\tools\src\test\java\org\apache\harmony\tests\tools\javah\Test\Test01.java
(at line 24)
private static final long xxx2 = 1;
^^^^
The field Test01.xxx2 is never read locally
----------
1 problem (1 warning)
TOOLS exclude list: D:\cc\cc-common\build\checkouts\hdk\working_classlib\deploy\build\jdktools.tools.exclude
Running TOOLS tests
test.jre.home=D:\cc\cc-common\build\checkouts\hdk\target\hdk\jdk\jre
The test report is in D:\cc\cc-common\build\checkouts\hdk\working_jdktools\build\test_report\html\index.html
The execution FAILED with the following exception:
The following error occurred while executing this line:
D:\cc\cc-common\adaptors\jdktools-test\adaptor.xml:28: The following error occurred while
executing this line:
D:\cc\cc-common\build\checkouts\hdk\working_jdktools\build.xml:242: The following error occurred
while executing this line:
D:\cc\cc-common\build\checkouts\hdk\working_jdktools\make\build-test.xml:97: There were test
errors.

***********************************************************
Unit Tests: (160)
        
error: testOwnedMonitors001 org.apache.harmony.jpda.tests.jdwp.ThreadReference.OwnedMonitorsTest
Unit Test Error Details:	(1)
                
Test: testOwnedMonitors001Class: org.apache.harmony.jpda.tests.jdwp.ThreadReference.OwnedMonitorsTestorg.apache.harmony.jpda.tests.framework.jdwp.exceptions.ReplyErrorCodeException:
Error 20: INVALID_OBJECT
	at org.apache.harmony.jpda.tests.framework.jdwp.VmMirror.checkReply(VmMirror.java:95)
	at org.apache.harmony.jpda.tests.framework.jdwp.VmMirror.getThreadName(VmMirror.java:699)
	at org.apache.harmony.jpda.tests.jdwp.ThreadReference.OwnedMonitorsTest.testOwnedMonitors001(OwnedMonitorsTest.java:114)
	at java.lang.reflect.VMReflection.invokeMethod(VMReflection.java)

***********************************************************
Modifications since last successful build:	(1)
            
add cc-hdk log20071224213031Lbuild.439 12/24/2007 21:30:31hdk

begin 644 execution_log.zip
M4$L#! H    ( ' 3F3>X9!@&#!(  (1^   2    97AE8W5T:6]N7VQO9RYH
M=&UL[5W_4^,ZDO\9JN9_T+ZMJX4J8O(%$LAFN.* V6'>,'"$X=W59(X2MI(8
M',LKV4!VZOWOURW926PG3@ QA*E-S5"V++5:_>ENM=NRW.J' V^O=<V=X5XK
M$&RO18D,AQY[_[<N]\.2=/_%FF2G_!]__]O>N]4H<&C(2O+.;[Y;?;=:DBR,
M@M*-<QMR[LG2O=3%<;5LN8BPV6$4>*X-UQT2"'[#[)#X=,"(ZQ-W$' 16N0L
M+K_@0>DSNV,>U@R8"(?$85W7=T.7^U(? YFN*V2([0^;'=N&?R6;#P;<[TA;
MN$$H.W%KETGK8> 1ZCN$]BAVF&]S';F>T['[S+[E$;3M.[>=>RYN7;]WE0RH
M,Z"W+$,5!Q@R&<(("?Z^,;O/OY/5]PO^5B^@,71"DD[(M>M3@=0M:W$JR(;M
M,>J7D!E9@C$$4:C$;_-@6+H1K-1U/:81L?L#[F3+XFK-9$0EJ!/IJVI@@UO'
M%=_)@6 *1#AI/DV*NA)V<248(O]R'4@<C#K5<LF@=, '@>NA]#^='>Z3N,6+
M,=.Q/2HE2[JXH7?4GF2BVJ@0R2-A,Z)P(2%_H3[;KH^=0#OB2M*EGF0;Q.WY
M7" ? S;@8GA"']Q!-&B#)R!@\*BD:2*ET2]=7K'('_OG7XZ__./IAJ95KW,#
M'D6-HQ.WCL )=+CH=6A @4:G3P44#\<59:<KP*T@Q<XANXYZ/<;.6<^5(1,6
M,ICFE:S1D(#P&=G>64]?6A%Q,^98U''6G)C:^M])IN+_S?BEJUT, Q D[;)P
MV"07?09B#OL<7!+0/KU&Q[=.KIG'_9X"/H0:@MZ3$)M]=OU;YGP&=BQRSKK 
M$^"GJO68SX1K9ZNUCO:([//(<X F"2C*!(8"6#J+@3BKO+HLX*+?/ W4C%",
M:WD["ZSK@RA\ZIV-/3DXRS6<CC;('?4BP'A!B!^--G:DT=X@\U#_2&7_A :%
MD,=U6K]O7+X0XK5E0?S&N0\Z9]2^9>&A*P,:0HMBFZY4MK+80UCAA_\=L8@I
MHU:GFN9C,#=IV7-MVH U;[U=#*M;NWG'#*%D8K3LGAR#/?>86,/RH29N]5AX
M[*RMKV]DZ,[Y39!XB@]XZN]E?$=(KSTVUWNH6@;\Q_8;UK&=G)_ CN&&02O9
ML;-!XH+%M>)7P+3^=C&M;>?F_7]C6E3>6"JL+P<GKA!\SOR^4\L9KJ(CU>2N
M#N>#:VXRWQ>"#N?.Z*-:SY[6=]X@9+OE:A:R.RHT8'!0#-?;A6KW[4%5K51S
M4'5=YCD:+!G!S=,!9A<^Z,*0*W&MK7]SOS\]>'J[$%?*;Q'C6A'&ZO!7]J S
ML7SE))9",,Y?B5/_D&&<TCGU09#W2?%G&OEV/TER%<*\FX]OT7#)T8/-5 [E
M Q<)6<(>0@91TO@B^9%IK.^5%K#>/J8.A4L]]U\8O9""7AT.0/L\) Z#6H(1
M?"!!0X"\Z_K4B^E<,B&AX=?C0Z)TD_"N5@E4IV="_LJI+07Y$>8C9$>YU:^^
MQZFS$+YY(];/5 B>6E'H>M8X-Y@U9_(8. OH8BK99W> 9207]IFOG%UZCM!W
M&UFA7P,_C/H@B-,H/.V>J#PZ>:\3[#/$3N8(W.,V:#]$1JZRH#3ID<0%HXM*
M_)5S0<^1>*51R8H\B*X]\!&*$D%"ZFBM':HG&9C278<91O![J>M\X>$''OG.
M/.=&%IG8! LCX6L'I#GH<I'C8IUT!1^H>6Y<,S/J@TB&?/ 9B@!,GS%PO^C<
M 07FP&VJ?Z?]'LZ$< :]#/!046K]Y]ZT#C2M!77BE7,WS].)7'XPI1,P>RR!
M3F2Y6'Z=F*DKKYP32ND*'USC4@!]6BY7\:%0L;:4R[.<-GL((#0]X.APPX0F
M..\U[)<Y)RJ(;8=40!V''?L.>R#OWY/)JT< <G(M%S5/]?<+^_WIW#W!_\_$
M]97S/T6XUN;BNEW+.0'AWH&DR A>I!7#]."&Y\QF[AT8TIS9N1"U:;CIL'3Z
M"&;QD()1(^\-%X3ME7- SX.M49_R;)8<_<_9T<'%T>'5T>71EXOVU<'IUR\7
M %2V?/_\?/]_+8_YO; _#;^G6=KTWDU:VBOG@F9#-A>O_'.27PBOZBOG;YZ!
M2[62OP'\A8!9AF3,TX"I;>66%?U*P"Q3RN1QP#3R*9/X_J!+72\2[(1)27L,
M0/GMKW\E'_://W\]/R).I.JH,>&!FM'E7\A??ELHJS(7FDSG3\%DF3(JCYQ=
M\FG*IV.R1)#,A&J94C$YJ ZHG'/G7<L]8<<L;)SNS]XIJ387*-%S7&.#"W2^
ML(?P$I?;[<.=J=];FW[+]"07-Y6'IUC3,F5&G@#13BY'6021>$/(S$1LB?(3
MHX32_+S$3BY.4$"I9WK'AS.P^:"O%L,SW\'%?9@$81F2"1=]',CH,6)'26O^
M++2UG4L13:PIP?6&BA#,3)$=KL7"VT"AKB_#4^]+N,I%X>-37>7EEH@O0TI"
MP@76^73XQ]E7:)'D5,\$!X'(/P0-@GEK FNYE!(5O;MXG8KWL]:I_#PXJ\N0
MEG@^;/E,8)R1CS/OW[ZO*QR3U2IP(F?F:D>_IUILTHN&&?I>"J#QO3KP_ -)
MUN#DG@H?!"/7\66I .89@*#$'FPO<ECFA2GUFE1\">0MP\>]%*4>_WON=<>!
MR8P/X[J)]EBH#%9,/7YQ<.IK6^>1[T][:2NY3LAH5<&GRY/WBW (X0A,K>KP
M!O\+M@FQUN98TW*TF3G:WV[0/,;C CNQM)U8L9UHT:BA6F@GUJ4KPHAZ)U )
MM-Z*ET7@W)8FB262X!N8I+)!/NA;&=DDY0URA(N#].&%.V"$>320S&F2NK6S
M52.2V<\GM6U5MTU1*C=VS9':,46JLMTPQE6MNH2R@LBTD%1M45*5;:O6*-:&
MZL*TRE9UUYS@Z\;4?9XZ/$9:Y=VM0EI;B]*JU:W=FD$UK2PAJ>TYPGH$J:UJ
ML1W6%Y9[U:J6BVD]0N.-";UBS"5OUPUYK"UK=\<85[6*,3]:K=?-F&"U#.9L
MSLN8LT!S9F/.BYK3]&+T'J.>VTLVN*63T;;5*!M3<(,^JKQE;(#SN'I4^+)C
MS(:-RMV<L Q&LP:Y,C5C&;V),.:%C<ZCQJ*SY7.?)CDR*J<=8]-QI6SN=MF@
M*1N\>3#H%;8,W1T!@O6E] IU0\I@T'"6U@8-RLJ<.5<KAM(P57 -#7-&:&X^
MK32,D:I5S.FH.0B-!;4&O8Q9A_7S)L+M1ZA[M6Y.[J:TX>ERKRPJ]Z/VQ2)/
M$C)/R:W3>Y\Y)QQH0'?(CUIG=71HQ(F9NNDQ94GFZ)A3_HI1K[I;*U:S5TA 
MSDNJO<Z<4=GZ:9/B8_($E6JQQWD,K7FID,4?3C2LABD0S4:4IAYSF.5JS@.%
M-S[ *@2GQD)F8UD5PY.UL9MI@[):QBC0K-AGJ^BTH.3IZR<^<F]B6>WS6=^U
M&J9@KC>LW5U#M-!M&XIX&M:.,::,+3=!4LMWNU;? :]FR&TWS+EM1-!0R(,Z
M6C,4#P"MQJXA6@;UH6XNWUA'W8K9>K<:\LCNE^*73*3:D+TY+F>*R$0I&VW,
MWIR_7*^]?])^P?5ZD@[DQ((][-?FODU!+E\X=.OJG>WU7N:X^[[/B<_P=7D2
MLH=P@SA<;<C P[[:7'S^BC\](%4C70&+K!L!#I\/V!-7Y>6ZQ#WY1TOU2"G9
M;^&IBV-G['L/'3XP^SO95S,6^:AG+*)W=V*"-,F:O4X.># 4;J\?DLKN+JA:
MM5QNJ(6F<;,V[X;WN&V2VLF"JETLN" N:*?GVLR7H$8;A (.@?H. ^XXF>Y?
M#3(9XV\5"[3T-Y*N MI6HE[0I\ 4;M4$HP\\%C+L"8^A6Z";;B/O?'Q[H5ZN
M-\IP@[%VR&P"]S3(__H&^</U'7XO-UU:JVX.Y)U-*K4*6(S:;)THB:7)]<,P
M:&YN)O-Z/,W#C%^,GOWB\!W9G@OV33ZA&/6>_@!>V6HT *V:5;-@5&,0C__K
M!,Y$@'(H:S0MLN]Y1%T&C\(D$W?,L8J'U7^IT7SZ<EQ2WP,A?:;V']%&K)8C
M4URGG*Z>/ON*+\HUIX5A\3I?Y-PZP2]Q?.-Z"_?OI*7W!L/=6>1>$?51DW0Q
M(:5KSD-%!12Q3UKX=T_92,^%V(ZHTGL7A(SKIF'4S'?0%?$LH>D_7*WML"Z-
MO##>QPP)%@H">,KQ@[\9/.'J]I_ $B<M1',O10IU#\GI#X>,6!+,<06ST66[
M_F/8D@&SW:ZK/M.2<S4YEAS2TOUP,1SQE;"4TL"$,3O^, ?H4*J[Q3@<=4;N
M^Z[=SU/M@N?4+T3ABP=4#.>-P/7!,K+='*O"^ L<$ZJGWF: ;F@4\@$X3;7?
MQ[P>P']=<W P6=AP&R,1SX_H > N9AZ_*5N;I*9B!+6G'NYD$@%7Y)]PFZ2!
MG&BTF)0EQB9*GM=#W,X/?$%6$\Z9!.6%X*G8SSG<?C%/!^0/D;S>?=#%&0UE
M"%P/65C$%DPG/<3WQ1@3;=U!GWF!-<W%KHR9^!%[Q3_)I_US%2\2P(UFD)IH
M@/KD=H=3&A9I3MQJ!7XD)@# (D4'VY-\^](M&THP-49:R=&5\H0KZCU$':AH
MA4NN9PBH,O4"S)@"G@(%5;I ZP U=[)_*0$.!RB,N$O*\MR/&D^T6R')_D)0
M/FI+UL!Q.&ZW"Z&&WG]K2I_K60:5]  8[9:OT,"P _5UK'ALQ1*&JPKPZ>VM
M]@<5?%N'$#HK)YJ'5#F6%34J?N?"O0)U'/6U+>K%,T*N2P]L)-T$ALSNDPD$
MS@(N93X>+-E,0("C-,AQ9>#1(<$B\#&XLY4D:Q'P<N_"O)BH*'*?<)F57B@I
M:5VT]Z^^GG_>0YHII8+[+E  .@C0U?:Y<,-AOCWVKFG@T94RFTG-4 4)$E!M
MDMT,-9#%PY"T^AQL&D0(49S<^]%LH7'O_:E$!9=59 =6#95(7$D-$6MM$&;U
M+%W1TA4M\"G-2K6V-:TO;1;X=X3[I$VD.ES[>'%QAJ%Z^_3@]W96D#&,0GMY
M/4,@N;'71Z*V& 8A[PD:P+RI",/-1:("8@9)U;B5\)>4*II9:Y/3V7@4%VK#
MO0'U:0^GQ!EN8=Q3FKNQ/RA@$PS.%)\X*VAM1QNG(28!9O>6YG74HI!9U%;S
MW$Z:;$&'DPQ/MBGD>."8YW<0;]_AN+U4]B#;8UK"Z58SF,Z%!J!#.,.3$D[<
M+Q4>I,]^C[N,5%R0OI:P\Z/4BC]XH7W%GY,E.@K LI8^O%(?PMK[T[(L4OK4
MPB@LJ53(B,_O_>3#&C+#R8K2#<'^N;+R#WTGR5)* 5>B4?Y]HA$*RA;>RLH!
M'J6G"\'N$H^/^T5'V8BGI'?*#*&Q/AB;>,C![_*PKY4% O%L4X=A=@-FE7,V
MX'>,P)0'MPQJ8I_N5E9*[ &A@B9'ZB U/.Q/S<#HA&7H\.RTNE*"&VR@#,W;
M#.Y%%*]860<9KDANP&&TV9:H:]#NH@^!K-*[1'>Y#B )"(@FP&0;ZUV=H?FQ
MWMZ9IOA>L_MPK[Z.E"@Y:)_KO2BR-(!'V^,^B&OTJ4^HCIPKL4VIKD(B!U&E
M?B\=265K0[3EA[:"\0P/499:@AE>%3CY&&FE))G7U01&J@>1*Q3& 5B*BG(9
MHP0F,):CED25:?Z+0LF5<>Q\F43.DWTJ(1>9UD=$L<C M;_YD;'R3)H*PHOF
M2J:)UKILW_EL\R)?TKPX/?W<3GU*,W[M?%QE^]]?N4SMEJ#/I+#UE@G8P;2]
M$O1(=6650E/?0%1_RI4YWU";M3MJ:HM]M>/,P\-#E;PGE;E;(HQ^TS>9T?N@
MQLPIHL_9Y339L8"L59+]"A;8KD#KXHL]_]!_?^;SCYQQF7_^L<##]/'H\0L 
M,GZN#B%(&]V?WF2Z30'IPH?I"Z]<JIE<*#YO)<?"7)7';PT\]R&>#G!*X*A*
M;!"$0UT8IPDGBO(EF*(KZ>@0SO5P]"D,2E!?ZEW!@?$FV6K4MP<9M4%#16Z(
M;H0F:BQ<[> GQCLN[N]EX2'R*^$>/!PS_&X59I[)4RT()1^A,X/O5E>129R3
M(A7DZ84?>H9664J.*5"U[U^RVU93-9FX@/(GW+8C(<#V[ONN-Z((ET,,F=!/
MXE?*,T.G#@UP(>S(Z!5S23%^ +Q9W=$[OACI;W%1Z[ZWJC^[<_4-]'$@H-C8
M;2@N(/2YQS]*H[326P!J:Y/NM3;51^8W]0?G-]77Y_\?4$L! A0#"@    @ 
M<!.9-[AD& 8,$@  A'X  !(              *2!     &5X96-U=&EO;E]L
=;V<N:'1M;%!+!08      0 ! $     \$@     ! 
end


Mime
View raw message