harmony-alerts mailing list archives

Site index · List index
Message view « Date » · « Thread »
Top « Date » · « Thread »
From nom...@intel.com
Subject [build-test alert] FAILED Linux x86_64: ehwa
Date Mon, 24 Dec 2007 13:53:50 GMT
svn.revision=606592
BUILD FAILED:
	Ant Error Message:
/export/users/cc/cc-suites/scripts/cc-exec-adaptor.xml:104: The following error occurred while
executing this line: /export/users/cc/cc-suites/adaptors/ehwa/adaptor.xml:82: The following
error occurred while executing this line: /export/users/cc/cc-suites/scripts/framework.xml:1079:
Java returned: 1

Date of build:	2007-12-24 19:43:44 +0600
Time to build:	10 minutes 0 seconds
Last changed:	12/24/2007 14:28:42
Last log entry:	snapshot

***********************************************************
Errors/Warnings:	(91)
            
[exec] Result: 25
[echo]
[echo]
[echo] ========================== EHWA.log =======================
[echo]
[echo] Eclipse Home = /export/users/cc/cc-suites/build/libs/eclipse-3.2.1-lnx-x86_64/eclipse
[echo] Tested JRE = /export/users/cc/cc-suites/build/checkouts/snapshot/hdk/jdk/jre
[echo] Tested JRE options for Eclipse launching =
[echo] Delay factor = 2
[echo]
[echo] --- Automated EHWA scenario for Eclipse 3.2.1 ---
[echo]
[echo] Start:
[echo]
[echo] Run Eclipse
[echo] Select workspace
[echo]  wait window 'Workspace Launcher' to appear ...
[echo]  window 'Workspace Launcher' appeared
[echo] Press 'OK' button
[echo]  wait window '' to close ...
[echo]  window '' successfully closed
[echo] Close Welcome page
[echo]  wait window 'Java - Eclipse SDK' to appear ...
[echo]  window 'Java - Eclipse SDK' appeared
[echo] Create new project
[echo]  wait window 'New' to appear ...
[echo]  window 'New' appeared
[echo] Select new Java project
[echo]  wait window 'New Java Project' to appear ...
[echo]  window 'New Java Project' appeared
[echo] Type 'EHWA' as project name
[echo] Press 'Finish' button
[echo]  wait window 'New Java Project ' to close ...
[echo]  window 'New Java Project ' successfully closed
[echo] Create new Java class
[echo]  wait window 'Java - Eclipse SDK' to appear ...
[echo]  window 'Java - Eclipse SDK' appeared
[echo]  wait window 'New' to appear ...
[echo]  window 'New' appeared
[echo] Select new Java class for 'EHWA' project
[echo]  wait window 'Java Class' to appear ...
[echo]  window 'Java Class' appeared
[echo] Type 'EHWA' as class name, press 'Finish' button
[echo] Select the 'public static void main(String[] args)' checkbox
[echo] Press 'Finish' button
[echo]  wait window 'New Java Class ' to close ...
[echo]  window 'New Java Class ' successfully closed
[echo] Put System.out.println("Hello, world"); into EHWA class
[echo]  wait window 'Java - EHWA.java - Eclipse SDK' to appear ...
[echo]  window 'Java - EHWA.java - Eclipse SDK' appeared
[echo] Save EHWA class
[echo] Run EHWA class
[echo] Exit Eclipse
[echo]  wait window 'Java - EHWA.java - Eclipse SDK' to appear ...
[echo]  window 'Java - EHWA.java - Eclipse SDK' appeared
[echo]  wait window 'Java - EHWA.java - Eclipse SDK ' to close ...
[echo] ERROR: Failed to close 'Java - EHWA.java - Eclipse SDK ' window during 240 sec!
[echo]
[echo] Print error screen picture:
[echo] 	Picture was saved to /export/users/cc/cc-suites/build/results/ehwa/20071224_0743/error.xwd.
Use 'xwud -in error.xwd' to view the saved file.
[echo]
[echo] Kill Eclipse:
[echo] 	Found 1 Eclipse processes
[echo] 	Process 0:
[echo] 	Eclipse process was killed
[echo]
[echo]
[echo] EHWA FAILED!
[echo]
[echo] ======================= eclipse.log =======================
[echo] Install location:
[echo]     file:/export/users/cc/cc-suites/build/libs/eclipse-3.2.1-lnx-x86_64/eclipse/
[echo] Configuration file:
[echo]     file:/export/users/cc/cc-suites/build/libs/eclipse-3.2.1-lnx-x86_64/eclipse/configuration/config.ini
loaded
[echo] Configuration location:
[echo]     file:/export/users/cc/cc-suites/build/libs/eclipse-3.2.1-lnx-x86_64/eclipse/configuration/
[echo] Framework located:
[echo]     file:/export/users/cc/cc-suites/build/libs/eclipse-3.2.1-lnx-x86_64/eclipse/plugins/org.eclipse.osgi_3.2.1.R32x_v20060919.jar
[echo] Framework classpath:
[echo]     file:/export/users/cc/cc-suites/build/libs/eclipse-3.2.1-lnx-x86_64/eclipse/plugins/org.eclipse.osgi_3.2.1.R32x_v20060919.jar
[echo] Debug options:
[echo]     file:/export/users/cc/cc-suites/build/checkouts/ehwa/.options not found
[echo] Time to load bundles: 124
[echo] Starting application: 4908
[echo] Application Started: 64102
[echo]
[echo] ===========================================================
BUILD FAILED
/export/users/cc/cc-suites/build/checkouts/ehwa/ehwa_run.xml:210: EHWA FAILED!
Total time: 9 minutes 59 seconds
The execution FAILED with the following exception:
The following error occurred while executing this line:
/export/users/cc/cc-suites/adaptors/ehwa/adaptor.xml:82: The following error occurred while
executing this line:
/export/users/cc/cc-suites/scripts/framework.xml:1079: Java returned: 1

***********************************************************
Unit Tests: (0)
        
No Tests Run: This project doesn't have any tests

***********************************************************
Modifications since last successful build:	(1)
            
add cc-snapshot log20071224142842Lbuild.59 12/24/2007 14:28:42snapshot

begin 644 execution_log.zip
M4$L#! H    ( +>>F#?!GD ((08  $H@   2    97AE8W5T:6]N7VQO9RYH
M=&ULU5I;;]I*$'YN?L6<2D>T4K&!T%QH&BG-1;WI-"*I^A!5T;(>8)/%:WG7
M7,ZO/[-K0P+!!M,TZ;'2*-2SL]^,O[GLF(.^&<C#@XX*)H<'48R'!PRTF4A\
M7^FJT%2U^!=;L%?[^UWE<"N) F:PJH=A:VLK3N@WV.OJA@W93_B0"!ETA21Y
M[(_8-0EXXX&<DYG[\$!#^C?ROOH)U6H5VDD(IQ]_'('F&+)8*% AF#Y"5TFI
M1B+L 5=A5_22F!E!]VA1KL)+U 8#^-P^A??@XSA2L?$3C;'V.:>?JDZ$0>UW
MK!D^[R._58G1O@Y9I/O*^/W@UK^Q_V)<9Q,564B:-LN5/N521!KAHQK@.J"D
MZ&@?TT75;:_AU:LR'%?'>SO7.\WIC=S=3E"R"709-RJFW1I%KM_LRG_4SIT>
M2XP2IK5*S#@G>N3GE:*9S>O*>4/R+#V5?-H=2V2A)=;TV<P3S/.\W*47;(C 
M:$$T =7-46#4(SUF?TZOUV'\-HF68+-PR"SZ;:W:K8.-4/W$.*X"E&C0<1"-
M!1*(&"T1)[\%AJ_BWNR9*]T3?Q0@KF+T*/D9,7@0K<\*+,WOSP[)TVCL/CHW
MU-HX4,/[43I2\:V.&,=E$?I+!MP5 EO4_-E&Q1D$DL@50;"YS&Y7F#F.8V0.
M5XPZD4;?P[=LV=7@E@2R951MZ$-KM2&9[M2,1JVV6V\TFM>UW>9V?D8S+#;S
M%3A7]IS,UO@&-.*O8/'M;IY4/:KQ,01HF)!+>3!&3@6TW?[6;L$9"9$?**=Q
MJ8@-E<\D"56'W+O)_LZ8<G'R!2I O4.@1A DL75[HUDCW/PO8 8\!^HZ8^:U
MHZP729 B1!+<7OH4'9BV,ZH%C;?YU2BB_8S7);S> +5F/<PO1;DW\N^\S[U@
MYM<\@?(XGK9]>:[^S?)P:JED2<C[EC(%_EKLLS;PK&U^CZA9&KCXGF^![^-Q
M3G32Y?=PP=W:8*'KRC, ^=HIU7)S+R_GLWG$A)D&9.7';,%7YVN,*S:N610A
M*TZBA2K2]1CDIR]*21HJW[Y4H),80YW:FH K=VEG+705T GGM%DWD7*2K@SR
M-SMVFG^@Y#;((DH8ZP+[_"#OE?;D,A4K/9E6)0AQ1-E.W5@6K(GX'QR5ANC6
MK,24L=%B<C:5!Y:N.T_7;8)R0<%*R)>3B J9#7T2UC/$(1L4,"!C\9D(A>Z7
M9?(B2"A+[24*RG']CCE.#9>,K/G#Z?Y<%$Z=8XM!1I*2G'9*CJV2S?R4+2W+
MXQ2V9?$;0KPF6^?/L.D1=JT3[/T^<Y5G[5RI$B4=*3AH0_TXAZ$2 0R8"%]=
M&-LH7OT$%O?TZTHZ5>BH\>\.1>?ES0-QNKQ4&)XG!BXFU <-/&J@/->RRO#5
MRX\HI7IC2[H,7KY^!_3?*NU--@K4Y;WYQD&;IVYU8-FQS3IFS*:1*^1.QV3M
MR@;ISW9*&73KTO.Q#VOE.]=S2V7 .*:LJ7F,&$(DN$EB+.B#7YRG(N02#9K(
M$I1./0M'7 ? &X\"#[Y;!XQ'20!5$<+LAO/H4% 8VZR4;FJ3GK>!T5^$E%.'
M%IEYII(PH.0Z]3W5$YLSL(#I+\Y3&:@5*5Y0Z/QX2Z"*<M &AU$;F6='G[Z>
MGA10H_S9&:;#L8W.SI]"*B7D?ZFXFVWEG_;MY5Z>/-)(+;_+FIM'NRV?#-3\
MG"_]Y%&%)/^PH.A,,8?YZ9TYCSMWV[.8^AI[Y$TA8O!T"".9]$2H'PR^LP%6
M>[LQOAY2&MJI[=?W*<W&:QCAZES$3/__:,8)=I+>=(CS& 8L#(*]Z7PH5(;:
M<,J=^2VP&+AVU9*<&L$PD*A;4&\TBV<SMMA1H:9^-&4[-/=K>[E+CNXDT^7$
M/MAIUFOY[_DVF2.NO/)GGQ^^?_IZDJ7HN1ME77__[7*K4:?B<S_YYP.X5)2+
MP;YU:<$^#$28T!;P=M^V$RH,]-;6)55;.\Q-G!M3A=1^F/["6V<<<XS2%'0Y
M?\/U%HKS)*;V"D9]>U+)--)MTQ?:39);6P5&LX!%1L69M=DG9^Q>HP6_84/J
MA41$WNU.0]]M5J_M[K?2<T2,U &%EE'UK0.?'1[X[JL"?OJU =]]A^ _4$L!
M A0#"@    @ MYZ8-\&>0 @A!@  2B   !(              *2!     &5X
F96-U=&EO;E]L;V<N:'1M;%!+!08      0 ! $    !1!@     ! 
end


Mime
View raw message