harmony-alerts mailing list archives

Site index · List index
Message view « Date » · « Thread »
Top « Date » · « Thread »
From nom...@intel.com
Subject [build-test alert] FAILED Linux x86: ehwa
Date Mon, 24 Dec 2007 09:07:18 GMT
svn.revision=606592
BUILD FAILED:
	Ant Error Message:
/export/users.2/cc/cc-suites/scripts/cc-exec-adaptor.xml:104: The following error occurred
while executing this line: /export/users.2/cc/cc-suites/adaptors/ehwa/adaptor.xml:82: The
following error occurred while executing this line: /export/users.2/cc/cc-suites/scripts/framework.xml:1079:
Java returned: 1

Date of build:	2007-12-24 14:57:08 +0600
Time to build:	10 minutes 5 seconds
Last changed:	12/24/2007 13:26:33
Last log entry:	snapshot

***********************************************************
Errors/Warnings:	(91)
            
[exec] Result: 25
[echo]
[echo]
[echo] ========================== EHWA.log =======================
[echo]
[echo] Eclipse Home = /export/users.2/cc/cc-suites/build/libs/eclipse-3.2.l-lnx-x86/eclipse
[echo] Tested JRE = /export/users.2/cc/cc-suites/build/checkouts/snapshot/hdk/jdk/jre
[echo] Tested JRE options for Eclipse launching =
[echo] Delay factor = 2
[echo]
[echo] --- Automated EHWA scenario for Eclipse 3.2.1 ---
[echo]
[echo] Start:
[echo]
[echo] Run Eclipse
[echo] Select workspace
[echo]  wait window 'Workspace Launcher' to appear ...
[echo]  window 'Workspace Launcher' appeared
[echo] Press 'OK' button
[echo]  wait window '' to close ...
[echo]  window '' successfully closed
[echo] Close Welcome page
[echo]  wait window 'Java - Eclipse SDK' to appear ...
[echo]  window 'Java - Eclipse SDK' appeared
[echo] Create new project
[echo]  wait window 'New' to appear ...
[echo]  window 'New' appeared
[echo] Select new Java project
[echo]  wait window 'New Java Project' to appear ...
[echo]  window 'New Java Project' appeared
[echo] Type 'EHWA' as project name
[echo] Press 'Finish' button
[echo]  wait window 'New Java Project ' to close ...
[echo]  window 'New Java Project ' successfully closed
[echo] Create new Java class
[echo]  wait window 'Java - Eclipse SDK' to appear ...
[echo]  window 'Java - Eclipse SDK' appeared
[echo]  wait window 'New' to appear ...
[echo]  window 'New' appeared
[echo] Select new Java class for 'EHWA' project
[echo]  wait window 'Java Class' to appear ...
[echo]  window 'Java Class' appeared
[echo] Type 'EHWA' as class name, press 'Finish' button
[echo] Select the 'public static void main(String[] args)' checkbox
[echo] Press 'Finish' button
[echo]  wait window 'New Java Class ' to close ...
[echo]  window 'New Java Class ' successfully closed
[echo] Put System.out.println("Hello, world"); into EHWA class
[echo]  wait window 'Java - EHWA.java - Eclipse SDK' to appear ...
[echo]  window 'Java - EHWA.java - Eclipse SDK' appeared
[echo] Save EHWA class
[echo] Run EHWA class
[echo] Exit Eclipse
[echo]  wait window 'Java - EHWA.java - Eclipse SDK' to appear ...
[echo]  window 'Java - EHWA.java - Eclipse SDK' appeared
[echo]  wait window 'Java - EHWA.java - Eclipse SDK ' to close ...
[echo] ERROR: Failed to close 'Java - EHWA.java - Eclipse SDK ' window during 240 sec!
[echo]
[echo] Print error screen picture:
[echo] 	Picture was saved to /export/users.2/cc/cc-suites/build/results/ehwa/20071224_0257/error.xwd.
Use 'xwud -in error.xwd' to view the saved file.
[echo]
[echo] Kill Eclipse:
[echo] 	Found 1 Eclipse processes
[echo] 	Process 0:
[echo] 	Eclipse process was killed
[echo]
[echo]
[echo] EHWA FAILED!
[echo]
[echo] ======================= eclipse.log =======================
[echo] Install location:
[echo]     file:/export/users.2/cc/cc-suites/build/libs/eclipse-3.2.l-lnx-x86/eclipse/
[echo] Configuration file:
[echo]     file:/export/users.2/cc/cc-suites/build/libs/eclipse-3.2.l-lnx-x86/eclipse/configuration/config.ini
loaded
[echo] Configuration location:
[echo]     file:/export/users.2/cc/cc-suites/build/libs/eclipse-3.2.l-lnx-x86/eclipse/configuration/
[echo] Framework located:
[echo]     file:/export/users.2/cc/cc-suites/build/libs/eclipse-3.2.l-lnx-x86/eclipse/plugins/org.eclipse.osgi_3.2.1.R32x_v20060919.jar
[echo] Framework classpath:
[echo]     file:/export/users.2/cc/cc-suites/build/libs/eclipse-3.2.l-lnx-x86/eclipse/plugins/org.eclipse.osgi_3.2.1.R32x_v20060919.jar
[echo] Debug options:
[echo]     file:/export/users.2/cc/cc-suites/build/checkouts/ehwa/.options not found
[echo] Time to load bundles: 114
[echo] Starting application: 5218
[echo] Application Started: 68526
[echo]
[echo] ===========================================================
BUILD FAILED
/export/users.2/cc/cc-suites/build/checkouts/ehwa/ehwa_run.xml:210: EHWA FAILED!
Total time: 10 minutes 3 seconds
The execution FAILED with the following exception:
The following error occurred while executing this line:
/export/users.2/cc/cc-suites/adaptors/ehwa/adaptor.xml:82: The following error occurred while
executing this line:
/export/users.2/cc/cc-suites/scripts/framework.xml:1079: Java returned: 1

***********************************************************
Unit Tests: (0)
        
No Tests Run: This project doesn't have any tests

***********************************************************
Modifications since last successful build:	(1)
            
add cc-snapshot log20071224132633Lbuild.70 12/24/2007 13:26:33snapshot

begin 644 execution_log.zip
M4$L#! H    ( .=XF#?SMCGX(@8  %,@   2    97AE8W5T:6]N7VQO9RYH
M=&ULU5I;;]I*$'XNOV).I2-:J=A FDMI&BG-1>E%IQ%)U8>HBI;U )LL7LN[
MYG)^_9E=&Q((-IBF28^5H!#/SGXSGLNW _M],Y '^QT53 [VHQ@/]AEH,Y'X
MH=I5H:EI\2^V8*_^]_OJ026) F:PIH=AJU*)$WH%>UW=L"'["1\3(8.ND"2/
M_1&[)@%O/)!S,G-O'FA(_T;>5S^A5JM!.PGAY.S'(6B.(8N% A6"Z2-TE91J
M),(><!5V12^)F1%TCQ;E*KQ$;3" S^T3^  ^CB,5&S_1&&NOZ7-./S6="(/:
M[UA#?-Y'?JL2HWT=LDCWE?'[P:U_8W]C7&<;%5E0FK;+E3[A4D0:X4P-<#U8
M4G2TC^FRVI;7]&1-AN/:>&]G^M_<S8Y1L@ET&3<JILV:1;[?[,I_ULZ;'DN,
M$J:U2LPX'WKDYI6BF<WKRGE#<BP]E/RX.Y+(0AM9TT<S'V&>Y^4NO6!#!$8+
MH@FH;HX"HQ[G*?MS:KT.X[=)M 2:14-6T:LU:K<.-D/UT\*X"E"B01>!:"R.
M0,1HPW#R.U#X*N[-'KC2/?$GX>$J1H\JGQ&#!YGZG+C2VO[<B#R-QFZC<Y.L
MC0,UO)^?(Q7?ZHAQ7):;OXC_K@?8CN;/MBJN'I!$K@."K6-VP\*J<10C<\AB
MU(DT^A["9<NN!K<DD"VC1D-O6NN8DFE/#6G6Z[N-9O/M=;VYO9M?SPR+S7P#
MSI4])\,UO@&-^&MH?+N?)U6/FGP, 1HFY-)H&".G_MEN?VNWX)2$R!=4U+A4
M%!/5SR0)-8?=N\G^SN+EXO@+5('(0Z!&$"2Q=7WS;9V0\[^ &? <J.LL/J]M
MU#:\2((4(9+@UM(GZ<"TG5$M:&[G=Z.(]C->E_!Z ]2:]3"_%>7>R+_S(?>"
MF5_S!,KC>%+V\GS\S0;BU%3)DI#W;<P4.&R1:&W@6DM_#XDM#5R2SY/@^WA<
M>#KI\GNX_&YML-#Q\@Q OG:JN-S<*\_YX3QBPDPSLOICMN"K\S7&59O8+(J0
M%5?20A7I>@SR*QC5) W5;U^JT$F,(:JV)N#J7=U9CFZ>@C4< UN3@-VODZOM
MKH).."<SNHF4DQ13D&_&D</\ R6W^1M1+5K7Y,\/2FKI9[1,Q<IGE#8]"'%$
MA53=V/A:$_$_."H-T:U9B2F+<XO)V50>6+KN/%VW"<H%!2LA7TXBZI&VJ)"P
MGB$.V: @ K+\.!6AT/VR.;(($E8FS0HKH6RLWT6.4\,E(VO^\'!_KA!.G6/;
M3!8D)6/:*3FR2C;S4[:T;!RGL&T4OR'$I:(U\X"=+56CI",%!VV(EG,8*A' 
M@(GPU86Q7/'J)["XIU]7T\%"1XU_=\HX;VR>,-/EI=+E/#%P,2$F-/"(0GF.
MM<KPU<LSE%*]L4U=!B]?OP?ZMTK9R48)M9R>;YQ<>>I6)X"=W*QCQFPBN4+N
M9$S6KJ1(?[93RJ!;-SP?^[Q6GKN>VU &C&.J;IK'B"%$@ILDQ@(F_.(\%2&7
M:- 4+,$&_&WAG.L@>.-1X,%WZX+Q* F@)D*8W7 ^'0I*9%N7TFTM=_0V,/N+
MD'+JTB)#3U42!L11I]ZGRF^K!A;$^HOS5 ;J18H7%#I/WA*HHBJTP8G4YN;I
MX:>O)\<%P5'^  W3,=E&!^A/(343\K]4W(VY\H_\]G(?H3S.<"V?#LW-I-V.
M3X5I?N"7OO.H0Y)W6%#$_><@/[DKYV'G[GH:$_VP9]X4(09/!C"224^$^L'P
M.YM@M;>:X^LAE:"=^KO&.RJR\1HVN"X7,=/_'UIQC)VD-YWA/ [^A7&P-QT0
MA<H06Z;"F<]4Q< =^6V,$P\, XFZ!8W&V^+AC.UUU*>)CJ;!#MO-QE[NDL,[
MR70Y11_L[&TW=QYUDKCRRI]^?OS^Z>MQ5I_G;I1W_OV/F%O-!O6>^[4_'\*E
MHE(,]M,7\G\=!B),: _8LGQ"A8&N5"ZIV=J!;N(<F2HD_F'Z"Q\]XYACE-:@
MR_D;CEPHSI.8^!6,^G;>DVFDVZ8OM)LFMRJ%9K. 14;%F;W9.V?N7K,%OV5+
M(D0B(@]WIQ7 ;=>H[[YKI8>)&(D&A3:N&I5]GQWL^^X[ W[Z_0'??9G@/U!+
M 0(4 PH    ( .=XF#?SMCGX(@8  %,@   2              "D@0    !E
G>&5C=71I;VY?;&]G+FAT;6Q02P4&      $  0!     4@8      
end


Mime
View raw message