harmony-alerts mailing list archives

Site index · List index
Message view « Date » · « Thread »
Top « Date » · « Thread »
From nom...@intel.com
Subject [build-test alert] FAILED Windows 2003 x86: ehwa
Date Fri, 21 Dec 2007 07:07:17 GMT
svn.revision=605636
BUILD FAILED:
	Ant Error Message:
C:\cc\cc-suites\scripts\cc-exec-adaptor.xml:104: The following error occurred while executing
this line: C:\cc\cc-suites\adaptors\ehwa\adaptor.xml:82: The following error occurred while
executing this line: C:\cc\cc-suites\scripts\framework.xml:1079: Java returned: 1

Date of build:	2007-12-21 12:43:34 +0600
Time to build:	23 minutes 36 seconds
Last changed:	12/20/2007 23:48:51
Last log entry:	snapshot

***********************************************************
Errors/Warnings:	(47)
            
[exec] Result: 1
[echo]
[echo]
[echo] ========================== EHWA.log =======================
[echo]
[echo] --- Automated Eclipse EHWA scenario for Eclipse 3.2.1 ---
[echo]
[echo] Eclipse Home = C:\cc\cc-suites/build/libs/eclipse-3.2.1-win-x86/eclipse
[echo] Tested JRE = C:\cc\cc-suites/build/checkouts/snapshot/hdk/jdk/jre
[echo] Tested JRE options for Eclipse launching =
[echo] Delay factor = 2
[echo]
[echo] Start:
[echo] 	Run Eclipse
[echo] 	Wait Eclipse 'Workspace Launcher' window to appear
[echo] 	WARNING! Window 'Workspace Launcher' didn't become active during 30c. Add extra delay
for 120c.
[echo] 	ERROR! Window 'Workspace Launcher' didn't become active during additional 120c. STOP.
[echo]
[echo] An ERROR has ocurred!
[echo]
[echo] Exit Eclipse:
[echo] 	Eclipse wasn't found
[echo]
[echo] EHWA FAILED!
[echo]
[echo] ======================= eclipse.log =======================
[echo] Install location:
[echo]     file:/C:/cc/cc-suites/build/libs/eclipse-3.2.1-win-x86/eclipse/
[echo] Configuration file:
[echo]     file:/C:/cc/cc-suites/build/libs/eclipse-3.2.1-win-x86/eclipse/configuration/config.ini
loaded
[echo] Configuration location:
[echo]     file:/C:/cc/cc-suites/build/libs/eclipse-3.2.1-win-x86/eclipse/configuration/
[echo] Framework located:
[echo]     file:/C:/cc/cc-suites/build/libs/eclipse-3.2.1-win-x86/eclipse/plugins/org.eclipse.osgi_3.2.1.R32x_v20060919.jar
[echo] Framework classpath:
[echo]     file:/C:/cc/cc-suites/build/libs/eclipse-3.2.1-win-x86/eclipse/plugins/org.eclipse.osgi_3.2.1.R32x_v20060919.jar
[echo] Debug options:
[echo]     file:/C:/cc/cc-suites/build/checkouts/ehwa/.options not found
[echo] Time to load bundles: 125
[echo] Starting application: 3906
[echo] Application Started: 1409651
[echo]
[echo] ===========================================================
BUILD FAILED
C:\cc\cc-suites\build\checkouts\ehwa\ehwa_run.xml:210: EHWA FAILED!
Total time: 23 minutes 35 seconds
The execution FAILED with the following exception:
The following error occurred while executing this line:
C:\cc\cc-suites\adaptors\ehwa\adaptor.xml:82: The following error occurred while executing
this line:
C:\cc\cc-suites\scripts\framework.xml:1079: Java returned: 1

***********************************************************
Unit Tests: (0)
        
No Tests Run: This project doesn't have any tests

***********************************************************
Modifications since last successful build:	(1)
            
add cc-snapshot log20071220234851Lbuild.54 12/20/2007 23:48:51snapshot

begin 644 execution_log.zip
M4$L#! H    ( .=HE3?I%<S5I 0  - 4   2    97AE8W5T:6]N7VQO9RYH
M=&ULU5C=3]M($'\F$O_#].'$R\6.D_+E"T@IT"L5:JN4$P^D0AM[$F_9>*W=
M=0CWU]_LYH.8QDXNUX+.@H"SLS._^9[==F)&XK3=E_'C:3M3>-IFH,VCP).]
M@4Q-7?._,82CQF]_[)WNUO(L9@;K>IR&N[7=FLKM7[#/[7<V9M_@7<Y%/.""
M]F#RP.Z(PIN,1)&H^/8CD^G_&"7R&]3K=>CF*5Q\N.F CC!EBDN0*9@$82"%
MD \\'4(DTP$?YHH93FNTJ9SC-6J#,7SL7L )G(6]***?NLZY0>WW+7X_2C"Z
ME[G1ODY9IA-I_"2^][_;7X4;L9:91:))1#GY121XIA$^R!&68A&\KWV<4M9;
M7M,+ZJ1Q?7)T,/^V7, Y"O8( Q89J4A L]+,VSU5GG5F]%AN)#?A>D+CK.>1
MA3<@GNF^.:4W1J7))16Q=B:0I3::YHXI1I7G>>5[O[(Q J,=V2/(00D'([=V
MLE_@Y/59=)]GJ^!8!*0*?5I-#AM@LU&O$-USHGM6=&^EZ/FWO8U$W\8HT* +
M.C16=LP5VLA[_$F2>U(-%]Z4>LA?&T,D%7I4O@P?_9B$+XQE6IE? X6GT5C.
MNCPYNCB2X^7$>I#J7F<LPI5)]>]!+PIVSW:=WH+]FER'/'-M"FSIL4*J<_Q,
M(7-P%.I<&+T$:^6^V]$]4<SV45^@E[!$@1G'*?QFHW$8-)O!7=!\VZHH.88I
M4VR,Y<1?2%^-OX-&+*E!,PB^A> 7(/A6AB?DD!JN@A@-XV*UMR<866];1B$$
M5;4Y4SPUWH X>2/4F@V?E_)E\.4K%4LGI0\L]"DCV :*G50ZU.M&SM?S2"_.
M+=9^\Q676]6CRBN.#B\[)2W;1; \C1*;9E5^V'RT69- %6&WXP;/=9;:N6'<
M+-#OW2Q*VY53!-4>D-5C^6![,,LR9*H"T\Y-I_OI\M.?;^!FNFDEPYC'Z9Z!
M/D;6_V0$3M-'G"MKM58C\J 3QX 3HQBEJS,462EHTDJ%Y(MN]W-W>[DLCKGU
M)A-32?#U^O.7"GGE*QVRNL4""=,@HUPIC-]LE263)\^$549?]"6FK7X#F:?Q
M5@)MMK_O7%Y=G%< WJ)JP;S/;U>U+E-MF! @9.2:=D70V\<=X/RST(\B?XM1
MM:*#%L9A)^:7(BE,*K,WCZ><#,%BK'!Q$>C+F*T(MES4>\5&:$><*2Z,?RVL
M3.1#GFK_^?1]Y\B];JLYN1O3O'#0. Z.O>],;8(\$DQ3<3')_P;[.?;SX;QA
M_0?43UW3#5K>O 6F<FW=N:9SAFTB-GBA3Z1TL*,QJ[F_IL6YZIQE@L^B&%K'
MC8.*\OM$.MU/$0;!V\;QP7Y0H?<VD]C:9_T)-W#6+C_?+D_650/IN[\NK\YG
MM;NXLM&18_FV*VP&C;"B%Q3?KB659K!GR!":+1CQ-"<IT-JG69U*0DR3=NTZ
M0;##=>Z<,F5*4X5)GEV#X21"%T^AV[*TH!1- #*:-E-X2*S-9AQIV21<@^"I
M+<?/U64QRVC(FNDY>W-J'C5#^&EB=*1X1M8<S&N$$Q$T#H]#^$B&HD.7R57J
M8K&V6VO[[+3MNPM+?WIYZ;N;S'\ 4$L! A0#"@    @ YVB5-^D5S-6D!   
MT!0  !(              *2!     &5X96-U=&EO;E]L;V<N:'1M;%!+!08 
1     0 ! $    #4!      ! 
end


Mime
View raw message