harmony-alerts mailing list archives

Site index · List index
Message view « Date » · « Thread »
Top « Date » · « Thread »
From nom...@intel.com
Subject [build-test alert] FAILED Linux x86: ehwa
Date Thu, 13 Dec 2007 10:17:06 GMT
svn.revision=603534
BUILD FAILED:
	Ant Error Message:
/export/users.2/cc/cc-suites/scripts/cc-exec-adaptor.xml:104: The following error occurred
while executing this line: /export/users.2/cc/cc-suites/adaptors/ehwa/adaptor.xml:82: The
following error occurred while executing this line: /export/users.2/cc/cc-suites/scripts/framework.xml:1079:
Java returned: 1

Date of build:	2007-12-13 16:06:49 +0600
Time to build:	10 minutes 10 seconds
Last changed:	12/13/2007 14:04:54
Last log entry:	snapshot

***********************************************************
Errors/Warnings:	(91)
            
[exec] Result: 25
[echo]
[echo]
[echo] ========================== EHWA.log =======================
[echo]
[echo] Eclipse Home = /export/users.2/cc/cc-suites/build/libs/eclipse-3.2.l-lnx-x86/eclipse
[echo] Tested JRE = /export/users.2/cc/cc-suites/build/checkouts/snapshot/hdk/jdk/jre
[echo] Tested JRE options for Eclipse launching =
[echo] Delay factor = 2
[echo]
[echo] --- Automated EHWA scenario for Eclipse 3.2.1 ---
[echo]
[echo] Start:
[echo]
[echo] Run Eclipse
[echo] Select workspace
[echo]  wait window 'Workspace Launcher' to appear ...
[echo]  window 'Workspace Launcher' appeared
[echo] Press 'OK' button
[echo]  wait window '' to close ...
[echo]  window '' successfully closed
[echo] Close Welcome page
[echo]  wait window 'Java - Eclipse SDK' to appear ...
[echo]  window 'Java - Eclipse SDK' appeared
[echo] Create new project
[echo]  wait window 'New' to appear ...
[echo]  window 'New' appeared
[echo] Select new Java project
[echo]  wait window 'New Java Project' to appear ...
[echo]  window 'New Java Project' appeared
[echo] Type 'EHWA' as project name
[echo] Press 'Finish' button
[echo]  wait window 'New Java Project ' to close ...
[echo]  window 'New Java Project ' successfully closed
[echo] Create new Java class
[echo]  wait window 'Java - Eclipse SDK' to appear ...
[echo]  window 'Java - Eclipse SDK' appeared
[echo]  wait window 'New' to appear ...
[echo]  window 'New' appeared
[echo] Select new Java class for 'EHWA' project
[echo]  wait window 'Java Class' to appear ...
[echo]  window 'Java Class' appeared
[echo] Type 'EHWA' as class name, press 'Finish' button
[echo] Select the 'public static void main(String[] args)' checkbox
[echo] Press 'Finish' button
[echo]  wait window 'New Java Class ' to close ...
[echo]  window 'New Java Class ' successfully closed
[echo] Put System.out.println("Hello, world"); into EHWA class
[echo]  wait window 'Java - EHWA.java - Eclipse SDK' to appear ...
[echo]  window 'Java - EHWA.java - Eclipse SDK' appeared
[echo] Save EHWA class
[echo] Run EHWA class
[echo] Exit Eclipse
[echo]  wait window 'Java - EHWA.java - Eclipse SDK' to appear ...
[echo]  window 'Java - EHWA.java - Eclipse SDK' appeared
[echo]  wait window 'Java - EHWA.java - Eclipse SDK ' to close ...
[echo] ERROR: Failed to close 'Java - EHWA.java - Eclipse SDK ' window during 240 sec!
[echo]
[echo] Print error screen picture:
[echo] 	Picture was saved to /export/users.2/cc/cc-suites/build/results/ehwa/20071213_0406/error.xwd.
Use 'xwud -in error.xwd' to view the saved file.
[echo]
[echo] Kill Eclipse:
[echo] 	Found 1 Eclipse processes
[echo] 	Process 0:
[echo] 	Eclipse process was killed
[echo]
[echo]
[echo] EHWA FAILED!
[echo]
[echo] ======================= eclipse.log =======================
[echo] Install location:
[echo]     file:/export/users.2/cc/cc-suites/build/libs/eclipse-3.2.l-lnx-x86/eclipse/
[echo] Configuration file:
[echo]     file:/export/users.2/cc/cc-suites/build/libs/eclipse-3.2.l-lnx-x86/eclipse/configuration/config.ini
loaded
[echo] Configuration location:
[echo]     file:/export/users.2/cc/cc-suites/build/libs/eclipse-3.2.l-lnx-x86/eclipse/configuration/
[echo] Framework located:
[echo]     file:/export/users.2/cc/cc-suites/build/libs/eclipse-3.2.l-lnx-x86/eclipse/plugins/org.eclipse.osgi_3.2.1.R32x_v20060919.jar
[echo] Framework classpath:
[echo]     file:/export/users.2/cc/cc-suites/build/libs/eclipse-3.2.l-lnx-x86/eclipse/plugins/org.eclipse.osgi_3.2.1.R32x_v20060919.jar
[echo] Debug options:
[echo]     file:/export/users.2/cc/cc-suites/build/checkouts/ehwa/.options not found
[echo] Time to load bundles: 114
[echo] Starting application: 5160
[echo] Application Started: 66904
[echo]
[echo] ===========================================================
BUILD FAILED
/export/users.2/cc/cc-suites/build/checkouts/ehwa/ehwa_run.xml:210: EHWA FAILED!
Total time: 10 minutes 8 seconds
The execution FAILED with the following exception:
The following error occurred while executing this line:
/export/users.2/cc/cc-suites/adaptors/ehwa/adaptor.xml:82: The following error occurred while
executing this line:
/export/users.2/cc/cc-suites/scripts/framework.xml:1079: Java returned: 1

***********************************************************
Unit Tests: (0)
        
No Tests Run: This project doesn't have any tests

***********************************************************
Modifications since last successful build:	(2)
            
add cc-snapshot log20071213140454Lbuild.68 12/13/2007 14:04:54snapshot
add cc-snapshot log20071213135352Lbuild.67 12/13/2007 13:53:52snapshot

begin 644 execution_log.zip
M4$L#! H    ( """C3<$)/\@(@8  %,@   2    97AE8W5T:6]N7VQO9RYH
M=&ULU5I;3]M*$'XNOV).I:.T4F,GH:604B3*1;WI% 6J/J *;=:39&'CM;SK
M7,ZO/[-K!PADG3BET!.UB.#9F6_&<_D\R>[ #.7>;E=%T[W=),6]70;:3"6^
MK_54;.I:_(MMV&[\_:ZVMY$E$3-8UZ.XO;&19O03[.O\DHW83_B0"1GUA"1Y
M'(S9!0D$DZ&<DYE[<T]#_COR@?H)]7H=.ED,1Q]_[(/F&+-4*% QF %"3TFI
MQB+N U=Q3_2SE!E!U^B05^$9:H,1?.X<P7L(<9*HU(29QE0'K9!S^E?7F3"H
MPZYU).0#Y%<J,SK4,4OT0)EP$%V%E_9_BJN848D%I<F<5_J(2Y%HA(]JB*O!
MDJ*K0\R/U3>#5B#K,I[4)]M;L[]ZC1VB9%/H,6Y42L9:9;%?[^6_URZ: <N,
M$J:]3,RX& 84YJ6BA<^KR@4C"BS=%'_>'4ADL<VLV:V9S[ @"+Q'3]D(@=&!
M9 JJYU%@U,/<Y7!.;=!E_"I+%D"S:,@K^FF=VMH!6Z'Z<6&<1RC1H,M -!9'
M)%*T:3C]'2A"E?:O;[C2??$GX>$JQ8 ZGQ'#>Y7ZE+CRWO[4B *-QIK1WB+K
MX%"-;M?G6*57.F$<%]7F+^*_F0%VHH77ILJ[!V2)FX!@^Y@U6-HU#E)D#EF*
M.I-&WT*XZ-CY\(H$BF,T:.A->Q57"NVY(ZU&XVVSU=R\:+QN;/G[F6&IF1_ 
M7MD3<ESC*]"(OX8FM/8"J?HTY%.(T# A%V;#!#G-ST[G6Z<-QR1$L:"FQJ6B
MG*A])DFH.^S!9?%[D2^GAU^@!D0>(C6&*$MMZ%NO&X2<_P7,0.! 713Y>6&S
MMADD$J2(D00W%]Y)!Z;CG&I#ZXU_&B5DSP0]PAL,46O61_\H\E[P7WGO?<%U
M7'T"U7$\*GMY.OYF$W'FJF19S <V9TH"=I=HK1%:2W_WB2T-79'/D^#;>%QZ
M.NGJ-EQ]M]<XZ'AY <"OG3HN-[?:LS^=QTR86476?EP?^.IBC6G-%C9+$F3E
MG;1417X>(W\'HYZDH?;M2PVZF3%$U58$7+OI.RNAJX'.."=CO4S*:7XR\AL[
M<)I_H.2VRA+J&(MDYVE>T[&\%4G>[5Z\HLN?[[74RO=HD8JE]R@?>A#CF!JI
MNK3YM2+B?W!<&:([LQ13D><6D_.I.K#\W$E^;AV4=Q0LA7PV36A&VJ9"POH:
M<<R&)55:U,>QB(4>5*V1NR"A:M$L4%"MBFXRQZGADI$W?WBZ/U4*Y\&Q8Z9(
MDHHY[90<6"7KQ:DX6C6/<]@VBU\1XDK96D3 [I9J2=:5@H,V1,LYC)2(8,A$
M_.+46*YX_A-8VM<O:_EBH:LFO[MD7#36+YC9\4KE<I(9.)T2$QH&1*$"QUIE
M_.+Y1Y12O;)#74;/7[X#^K/*V<E:!;68GJ]=7#YURPO ;FY6<>-Z([E$[FA"
MWBZE2']V4*J@6S4]'_IYK3IW/;&I#)BFU-TT3Q%C2 0W68HE3/C922Y"(=&@
M*5FB-;C5G>=<!R&8C*, OML03,99!'41P_4%%].1H$*V?2DW:WE=L(;;7X24
MLY"6.7JLLC@B_CB+/G5^VS6P)->?G>0RT"A3?$>AB^05@2KK0FL\D=K:/-[_
M]/7HL"0YJC] PVQ-MM8#]*>8A@G%7RKNUES^1W[[<A^A/,QRS4^'YG;2SN)C
M89I?^.7O IJ0%!T6E7'_.<B/'LIYV%ZKQRG1#_O,FR/$Z-$ )C+KBUC?6WX7
M&ZS.9FMR,:(6M-78:>Y0DTU7\,%-N829P?_0BT/L9OW9#N=A\-]9!P>S!5&L
M#+%E:IQ^IBJ&[G'<YCCQP#B2J-O0;+XN7\[864=SFNAHGNSPIKG5\![9OY',
MCU/VP=;63L-O99U-XM*7?_OYX?NGKX=%?YZ[4#WXMS]B;K>:-'MN]WX_A#-%
MK1CLIR\4_P8,19R1#=BV?$+%D=[8.*-A:Q>ZF0MDKI#XAQG<^>@9)QR3O >=
MS5]PY$)QGJ7$KV \L+N80B-=-@.AW3:YO5'J-HM88E1:^%N\<^YNM]KP6TP2
M(1()1;@WZP#.7+/Q=J>=/TRD2#0HMGG5W-@-V=YNZ+XS$.;?'PC=EPG^ U!+
M 0(4 PH    ( """C3<$)/\@(@8  %,@   2              "D@0    !E
G>&5C=71I;VY?;&]G+FAT;6Q02P4&      $  0!     4@8      
end

Mime
View raw message