harmony-alerts mailing list archives

Site index · List index
Message view « Date » · « Thread »
Top « Date » · « Thread »
From nom...@intel.com
Subject [build-test alert] FAILED Windows 2003 x86: ehwa
Date Wed, 12 Dec 2007 09:14:32 GMT
svn.revision=603433
BUILD FAILED:
	Ant Error Message:
C:\cc\cc-suites\scripts\cc-exec-adaptor.xml:104: The following error occurred while executing
this line: C:\cc\cc-suites\adaptors\ehwa\adaptor.xml:82: The following error occurred while
executing this line: C:\cc\cc-suites\scripts\framework.xml:1079: Java returned: 1

Date of build:	2007-12-12 14:55:58 +0600
Time to build:	18 minutes 28 seconds
Last changed:	12/12/2007 14:50:21
Last log entry:	snapshot

***********************************************************
Errors/Warnings:	(46)
            
[exec] Result: 1
[echo]
[echo]
[echo] ========================== EHWA.log =======================
[echo]
[echo] --- Automated Eclipse EHWA scenario for Eclipse 3.2.1 ---
[echo]
[echo] Eclipse Home = C:\cc\cc-suites/build/libs/eclipse-3.2.1-win-x86/eclipse
[echo] Tested JRE = C:\cc\cc-suites/build/checkouts/snapshot/hdk/jdk/jre
[echo] Tested JRE options for Eclipse launching =
[echo] Delay factor = 2
[echo]
[echo] Start:
[echo] 	Run Eclipse
[echo] 	Wait Eclipse 'Workspace Launcher' window to appear
[echo] 	WARNING! Window 'Workspace Launcher' didn't become active during 30c. Add extra delay
for 120c.
[echo] 	ERROR! Window 'Workspace Launcher' didn't become active during additional 120c. STOP.
[echo]
[echo] An ERROR has ocurred!
[echo]
[echo] Exit Eclipse:
[echo] 	Eclipse wasn't found
[echo]
[echo] EHWA FAILED!
[echo]
[echo] ======================= eclipse.log =======================
[echo] Install location:
[echo]     file:/C:/cc/cc-suites/build/libs/eclipse-3.2.1-win-x86/eclipse/
[echo] Configuration file:
[echo]     file:/C:/cc/cc-suites/build/libs/eclipse-3.2.1-win-x86/eclipse/configuration/config.ini
loaded
[echo] Configuration location:
[echo]     file:/C:/cc/cc-suites/build/libs/eclipse-3.2.1-win-x86/eclipse/configuration/
[echo] Framework located:
[echo]     file:/C:/cc/cc-suites/build/libs/eclipse-3.2.1-win-x86/eclipse/plugins/org.eclipse.osgi_3.2.1.R32x_v20060919.jar
[echo] Framework classpath:
[echo]     file:/C:/cc/cc-suites/build/libs/eclipse-3.2.1-win-x86/eclipse/plugins/org.eclipse.osgi_3.2.1.R32x_v20060919.jar
[echo] Debug options:
[echo]     file:/C:/cc/cc-suites/build/checkouts/ehwa/.options not found
[echo] Time to load bundles: 266
[echo] Starting application: 9734
[echo]
[echo] ===========================================================
BUILD FAILED
C:\cc\cc-suites\build\checkouts\ehwa\ehwa_run.xml:210: EHWA FAILED!
Total time: 18 minutes 27 seconds
The execution FAILED with the following exception:
The following error occurred while executing this line:
C:\cc\cc-suites\adaptors\ehwa\adaptor.xml:82: The following error occurred while executing
this line:
C:\cc\cc-suites\scripts\framework.xml:1079: Java returned: 1

***********************************************************
Unit Tests: (0)
        
No Tests Run: This project doesn't have any tests

***********************************************************
Modifications since last successful build:	(1)
            
add cc-snapshot log20071212145021Lbuild.52 12/12/2007 14:50:21snapshot

begin 644 execution_log.zip
M4$L#! H    ( ,YYC#<\5O9RE 0  )H4   2    97AE8W5T:6]N7VQO9RYH
M=&ULU5AM3QLY$/Y,)/[#],.)+Y?=)-SQLA>04J!7*M16*2<^D HYWDG6Q5FO
M;&\(]^MO[+PT2[.;7(Z";@6!C<<SCV<\,X_=3NQ(GK;[*GX\;6<:3]L,C'V4
M>+(W4*FM&_$W1G#4^.6/O=/=6I[%S&+=C--HM[9;T[G["^ZY_<;&["N\S86,
M!T+2'$P>V!U)!).1+ H5WWY4,OT?>:*^0KU>AVZ>PL7[FPX8CBG30H%*P28(
M R6E>A#I$+A*!V*8:V8%C=&D<HW7:"S&\*%[ 2=P%O4XIY^ZR85%$_8=_I G
MR.]5;DUH4I:91-DPB>_#;^Y7XT:J5>:0&#)1+G[!I<@,PGLUPE(L4O1-B%/)
M^G[0"IIU6G%]<G0P_[;<P#E*]@@#QJW29*!5Z>;MGJK(>C<&++=*V&B]H/7>
M"\C#&PC/UKZY9#!&;2@D%7OM3")+W6Z:!Z:XJX(@*)_[A8T1&,W('D$-2C18
MM760PX*FH,_X?9ZM@N,0T%+HTZWDL $N&\T*TSUONN=,]U::GG_;V\CT;8P2
M+?I-A];9CH5&M_,>G\ER3^GA(IK*#,5K8^!*8T#ERXK1CTGXPEBFE?DU4 0&
MK=-LRI.CBR,U7DZL!Z7O3<8XKDRJ?P]Z4;![KNOT%NK7Y#KDF6]3X$J/,U*=
MXV<:F8>CT>32FB58*^?=CNY)8C:/^@*]1"4+F&F<PF\U&H?-5K-UUVC]?E!1
M<BS3MM@8RX4_TWH-_@H&L:0&S2"$#D)8@! Z&X%40VJX&F*T3,C5T9X@=]%V
MBB)H5M7F3(O4!@/2%(S0&#9\6LJ7P9>/5 R=E#ZP6$^9P#90'%/I4*\;^5C/
M=WJ1MSC_S4=\;E53E5>D#B_+DI;](EF>\L2E654<-J<V:Q*H8MOM>.*YSE,[
M-TS8!?J]FT5IN_(+0;T'Y/58/;@>S+(,F:[ M'/3Z7Z\_/CG&[B93EJI,!9Q
MNF>AC]S%GYP@B'W$N79>VV_P #IQ##BQFE&Z>D>1EYHM&JFP?-'M?NIN;Y?%
ML7#19')J";Y<?_I<8:]\I$->=U@@8084S[7&^,U663+Y'IFHRNF+OL2,6]] 
MY6F\E4&7[>\ZEU<7YQ6 MZA:,._SVU6MR]18)B5(Q7W3KMCT[O$'N/ L"CD/
MMZ"J%1VT0(>]F9^*I,!49F^!2 4Y@L58$>(BT)=Q6Q%LN:EWFHW049PI+HQ_
M+JQ,YD.1FO I^[[SXD%WOS6Y&Q-?.&@<-X^#;TQO@IQ+9JBXV.1_@_T<^_EP
MWK#^ ^KO7=,3K6#> E.UMNY<TSG#-1&W>:%/HG2PBZ!UL(XC^NJ<95+,=C$<
M'^[_]LR<:NVS_JS:]'XK/ZDN<^0J:OGVK\NK\UD5+HYL='A8OK>*6LU&5%'5
MBV_7BHHLN-,@D=\C&(DT)RO0.B363<D=$V>N72<(CB;GOK!,E1(_L,F3"RV<
M</0[(_)3E@:TIEZN^+0MPD/B?#;32,,V$0:D2%UA?;I<%K.,Z-)LG;,WO\RC
M5@3/9L9P+3+RYF">[=Y$LW%X',$'<A0=GVRN4ZI;T*SMUMHA.VV'_NHQG%Y#
MAOY.\A]02P$"% ,*    " #.>8PW/%;V<I0$  ":%   $@              
MI($     97AE8W5T:6]N7VQO9RYH=&UL4$L%!@     !  $ 0    ,0$    
!  $! 
end

Mime
View raw message