harmony-alerts mailing list archives

Site index · List index
Message view « Date » · « Thread »
Top « Date » · « Thread »
From nom...@intel.com
Subject [build-test alert] FAILED Windows 2003 x86: jdktools-test debug
Date Wed, 12 Dec 2007 01:06:59 GMT

BUILD FAILED:
	Ant Error Message:
D:\cc\cc-common\scripts\cc-exec-adaptor.xml:104: The following error occurred while executing
this line: D:\cc\cc-common\adaptors\jdktools-test\adaptor.xml:28: The following error occurred
while executing this line: D:\cc\cc-common\build\checkouts\hdk\working_jdktools\build.xml:242:
The following error occurred while executing this line: D:\cc\cc-common\build\checkouts\hdk\working_jdktools\make\build-test.xml:97:
There were test errors.

Date of build:	2007-12-12 06:45:20 +0600
Time to build:	21 minutes 30 seconds
Last changed:	12/12/2007 05:56:30
Last log entry:	hdk

***********************************************************
Errors/Warnings:	(229)
            
Result: 1
[cc-ant]: Test Suite 'jdktools-test' execution. Repository updated: ${repository.updated}
[cc-ant]: Check for 'run' failure of hdk = ${hdk.parameters.run.failed}
[cc-ant]: Result: failed.superiors = '${failed.superiors}'
========================================
Testing jdktools binaries...
========================================
Compiling JPDA tests
Since fork is false, ignoring memoryMaximumSize setting
----------
1. WARNING in D:\cc\cc-common\build\checkouts\hdk\working_jdktools\modules\jpda\test\common\unit\org\apache\harmony\jpda\tests\framework\DebuggeeRegister.java
(at line 58)
registered.add(debuggee);
^^^^^^^^^^^^^^^^^^^^^^^^
Type safety: The method add(Object) belongs to the raw type LinkedList. References to generic
type LinkedList<E> should be parameterized
----------
----------
2. WARNING in D:\cc\cc-common\build\checkouts\hdk\working_jdktools\modules\jpda\test\common\unit\org\apache\harmony\jpda\tests\framework\TestOptions.java
(at line 505)
internalProperties.put(name, value);
^^^^^^^^^^^^^^^^^^^^^^^^^^^^^^^^^^^
Type safety: The method put(Object, Object) belongs to the raw type HashMap. References to
generic type HashMap<K,V> should be parameterized
----------
----------
3. WARNING in D:\cc\cc-common\build\checkouts\hdk\working_jdktools\modules\jpda\test\common\unit\org\apache\harmony\jpda\tests\framework\jdwp\PacketDispatcher.java
(at line 114)
eventQueue.add(eventPacket);
^^^^^^^^^^^^^^^^^^^^^^^^^^^
Type safety: The method add(Object) belongs to the raw type List. References to generic type
List<E> should be parameterized
----------
4. WARNING in D:\cc\cc-common\build\checkouts\hdk\working_jdktools\modules\jpda\test\common\unit\org\apache\harmony\jpda\tests\framework\jdwp\PacketDispatcher.java
(at line 249)
replies.put(new Integer(replyPacket.getId()),
replyPacket);
^^^^^^^^^^^^^^^^^^^^^^^^^^^^^^^^^^^^^^^^^^^^^^^^^^^^^^^^^^^^^^^^^^^^^^^^^^^^^^^^^^^^^^^^^^^
Type safety: The method put(Object, Object) belongs to the raw type Hashtable. References
to generic type Hashtable<K,V> should be parameterized
----------
5. WARNING in D:\cc\cc-common\build\checkouts\hdk\working_jdktools\modules\jpda\test\common\unit\org\apache\harmony\jpda\tests\framework\jdwp\PacketDispatcher.java
(at line 284)
commands.put(Id, command);
^^^^^^^^^^^^^^^^^^^^^^^^^
Type safety: The method put(Object, Object) belongs to the raw type Hashtable. References
to generic type Hashtable<K,V> should be parameterized
----------
6. WARNING in D:\cc\cc-common\build\checkouts\hdk\working_jdktools\modules\jpda\test\common\unit\org\apache\harmony\jpda\tests\framework\jdwp\PacketDispatcher.java
(at line 355)
commands.put(Id, command);
^^^^^^^^^^^^^^^^^^^^^^^^^
Type safety: The method put(Object, Object) belongs to the raw type Hashtable. References
to generic type Hashtable<K,V> should be parameterized
----------
----------
7. WARNING in D:\cc\cc-common\build\checkouts\hdk\working_jdktools\modules\jpda\test\common\unit\org\apache\harmony\jpda\tests\framework\jdwp\VmMirror.java
(at line 1834)
frames.add(frame);
^^^^^^^^^^^^^^^^^
Type safety: The method add(Object) belongs to the raw type ArrayList. References to generic
type ArrayList<E> should be parameterized
----------
8. WARNING in D:\cc\cc-common\build\checkouts\hdk\working_jdktools\modules\jpda\test\common\unit\org\apache\harmony\jpda\tests\framework\jdwp\VmMirror.java
(at line 1902)
vars.add(var);
^^^^^^^^^^^^^
Type safety: The method add(Object) belongs to the raw type ArrayList. References to generic
type ArrayList<E> should be parameterized
----------
9. WARNING in D:\cc\cc-common\build\checkouts\hdk\working_jdktools\modules\jpda\test\common\unit\org\apache\harmony\jpda\tests\framework\jdwp\VmMirror.java
(at line 2122)
fields.add(superClassFields.toArray()[i]);
^^^^^^^^^^^^^^^^^^^^^^^^^^^^^^^^^^^^^^^^^
Type safety: The method add(Object) belongs to the raw type ArrayList. References to generic
type ArrayList<E> should be parameterized
----------
10. WARNING in D:\cc\cc-common\build\checkouts\hdk\working_jdktools\modules\jpda\test\common\unit\org\apache\harmony\jpda\tests\framework\jdwp\VmMirror.java
(at line 2132)
fields.add(field);
^^^^^^^^^^^^^^^^^
Type safety: The method add(Object) belongs to the raw type ArrayList. References to generic
type ArrayList<E> should be parameterized
----------
----------
11. WARNING in D:\cc\cc-common\build\checkouts\hdk\working_jdktools\modules\jpda\test\common\unit\org\apache\harmony\jpda\tests\jdwp\DebuggerOnDemand\OnthowDebuggerLaunchDebuggee.java
(at line 94)
class ExceptionForDebugger extends Exception {
^^^^^^^^^^^^^^^^^^^^
The serializable class ExceptionForDebugger does not declare a static final serialVersionUID
field of type long
----------
----------
12. WARNING in D:\cc\cc-common\build\checkouts\hdk\working_jdktools\modules\jpda\test\common\unit\org\apache\harmony\jpda\tests\jdwp\Events\ClassUnloadDebuggee.java
(at line 32)
import java.util.LinkedList;
^^^^^^^^^^^^^^^^^^^^
The import java.util.LinkedList is never used
----------
13. WARNING in D:\cc\cc-common\build\checkouts\hdk\working_jdktools\modules\jpda\test\common\unit\org\apache\harmony\jpda\tests\jdwp\Events\ClassUnloadDebuggee.java
(at line 97)
boolean isOutOfMemory = false;
^^^^^^^^^^^^^
The local variable isOutOfMemory is never read
----------
14. WARNING in D:\cc\cc-common\build\checkouts\hdk\working_jdktools\modules\jpda\test\common\unit\org\apache\harmony\jpda\tests\jdwp\Events\ClassUnloadDebuggee.java
(at line 171)
public Class loadClass(String name) throws ClassNotFoundException {
^^^^^
Type safety: The return type Class for loadClass(String) from the type ClassUnloadDebuggee.CustomLoader
needs unchecked conversion to conform to Class<?> from the type ClassLoader
----------
15. WARNING in D:\cc\cc-common\build\checkouts\hdk\working_jdktools\modules\jpda\test\common\unit\org\apache\harmony\jpda\tests\jdwp\Events\ClassUnloadDebuggee.java
(at line 179)
public Class findClass(String name) throws ClassNotFoundException {
^^^^^
Type safety: The return type Class for findClass(String) from the type ClassUnloadDebuggee.CustomLoader
needs unchecked conversion to conform to Class<?> from the type ClassLoader
----------
----------
16. WARNING in D:\cc\cc-common\build\checkouts\hdk\working_jdktools\modules\jpda\test\common\unit\org\apache\harmony\jpda\tests\jdwp\Events\CombinedEvents002Test.java
(at line 100)
boolean expectColocatedEvents = (testedMethodStartCodeIndex == testedMethodEndCodeIndex);
^^^^^^^^^^^^^^^^^^^^^
The local variable expectColocatedEvents is never read
----------
----------
17. WARNING in D:\cc\cc-common\build\checkouts\hdk\working_jdktools\modules\jpda\test\common\unit\org\apache\harmony\jpda\tests\jdwp\Events\CombinedEvents003Test.java
(at line 53)
private boolean eventMethodExitReceived = false;
^^^^^^^^^^^^^^^^^^^^^^^
The field CombinedEvents003Test.eventMethodExitReceived is never read locally
----------
18. WARNING in D:\cc\cc-common\build\checkouts\hdk\working_jdktools\modules\jpda\test\common\unit\org\apache\harmony\jpda\tests\jdwp\Events\CombinedEvents003Test.java
(at line 76)
int EXPECTED_EVENTS_COUNT = EXPECTED_EVENTS_ARRAY.length;
^^^^^^^^^^^^^^^^^^^^^
The local variable EXPECTED_EVENTS_COUNT is never read
----------
----------
19. WARNING in D:\cc\cc-common\build\checkouts\hdk\working_jdktools\modules\jpda\test\common\unit\org\apache\harmony\jpda\tests\jdwp\Events\CombinedEventsTest.java
(at line 84)
int EXPECTED_EVENTS_COUNT = EXPECTED_EVENTS_ARRAY.length;
^^^^^^^^^^^^^^^^^^^^^
The local variable EXPECTED_EVENTS_COUNT is never read
----------
20. WARNING in D:\cc\cc-common\build\checkouts\hdk\working_jdktools\modules\jpda\test\common\unit\org\apache\harmony\jpda\tests\jdwp\Events\CombinedEventsTest.java
(at line 212)
int EXPECTED_EVENTS_COUNT = EXPECTED_EVENTS_ARRAY.length;
^^^^^^^^^^^^^^^^^^^^^
The local variable EXPECTED_EVENTS_COUNT is never read
----------
21. WARNING in D:\cc\cc-common\build\checkouts\hdk\working_jdktools\modules\jpda\test\common\unit\org\apache\harmony\jpda\tests\jdwp\Events\CombinedEventsTest.java
(at line 348)
int EXPECTED_EVENTS_COUNT = EXPECTED_EVENTS_ARRAY.length;
^^^^^^^^^^^^^^^^^^^^^
The local variable EXPECTED_EVENTS_COUNT is never read
----------
22. WARNING in D:\cc\cc-common\build\checkouts\hdk\working_jdktools\modules\jpda\test\common\unit\org\apache\harmony\jpda\tests\jdwp\Events\CombinedEventsTest.java
(at line 732)
String failureMessage = "## FAILURE during checking events! !";
^^^^^^^^^^^^^^
The local variable failureMessage is never read
----------
23. WARNING in D:\cc\cc-common\build\checkouts\hdk\working_jdktools\modules\jpda\test\common\unit\org\apache\harmony\jpda\tests\jdwp\Events\CombinedEventsTest.java
(at line 894)
String failureMessage = "## FAILURE during checking events !";
^^^^^^^^^^^^^^
The local variable failureMessage is never read
----------
----------
24. WARNING in D:\cc\cc-common\build\checkouts\hdk\working_jdktools\modules\jpda\test\common\unit\org\apache\harmony\jpda\tests\jdwp\Events\CombinedEventsTestCase.java
(at line 135)
long methodStartCodeIndex = lineTableReply.getNextValueAsLong();
^^^^^^^^^^^^^^^^^^^^
The local variable methodStartCodeIndex is never read
----------
25. WARNING in D:\cc\cc-common\build\checkouts\hdk\working_jdktools\modules\jpda\test\common\unit\org\apache\harmony\jpda\tests\jdwp\Events\CombinedEventsTestCase.java
(at line 187)
long methodStartCodeIndex = reply.getNextValueAsLong();
^^^^^^^^^^^^^^^^^^^^
The local variable methodStartCodeIndex is never read
----------
----------
26. WARNING in D:\cc\cc-common\build\checkouts\hdk\working_jdktools\modules\jpda\test\common\unit\org\apache\harmony\jpda\tests\jdwp\Events\ExceptionTest.java
(at line 188)
long frameID = reply.getNextValueAsFrameID();
^^^^^^^
The local variable frameID is never read
----------
----------
27. WARNING in D:\cc\cc-common\build\checkouts\hdk\working_jdktools\modules\jpda\test\common\unit\org\apache\harmony\jpda\tests\jdwp\ThreadReference\FramesTest.java
(at line 450)
frames.add(new FrameStruct(frameID, loc));
^^^^^^^^^^^^^^^^^^^^^^^^^^^^^^^^^^^^^^^^^
Type safety: The method add(Object) belongs to the raw type Vector. References to generic
type Vector<E> should be parameterized
----------
----------
28. WARNING in D:\cc\cc-common\build\checkouts\hdk\working_jdktools\modules\jpda\test\common\unit\org\apache\harmony\jpda\tests\jdwp\share\JDWPUnitDebuggeeProcessWrapper.java
(at line 233)
argv.add(val);
^^^^^^^^^^^^^
Type safety: The method add(Object) belongs to the raw type Vector. References to generic
type Vector<E> should be parameterized
----------
29. WARNING in D:\cc\cc-common\build\checkouts\hdk\working_jdktools\modules\jpda\test\common\unit\org\apache\harmony\jpda\tests\jdwp\share\JDWPUnitDebuggeeProcessWrapper.java
(at line 253)
return (String[])argv.toArray(args);
^^^^^^^^^^^^^^^^^^
Type safety: The method toArray(Object[]) belongs to the raw type Vector. References to generic
type Vector<E> should be parameterized
----------
29 problems (29 warnings)
JPDA exclude list: D:\cc\cc-common\build\checkouts\hdk\working_classlib\deploy\build\jdktools.jpda.exclude
Running JPDA tests
Debugger JVM=D:\cc\cc-common\build\checkouts\hdk\target\hdk\jdk\jre/bin/java
Debuggee JVM=D:\cc\cc-common\build\checkouts\hdk\target\hdk\jdk\jre/bin/java
SAMSA exclude list: D:\cc\cc-common\build\checkouts\hdk\working_classlib\deploy\build\jdktools.samsa.exclude
Running SAMSA tests
test.jre.home=D:\cc\cc-common\build\checkouts\hdk\target\hdk\jdk\jre
Run jdk/bin/java -version in D:\cc\cc-common\build\checkouts\hdk\working_jdktools\build\test_report
java version "1.5.0"
pre-alpha : not complete or compatible
svn = r603418, (Dec 12 2007), Windows/ia32/msvc 1310, debug build
http://harmony.apache.org
Run jdk/bin/javac -version in D:\cc\cc-common\build\checkouts\hdk\working_jdktools\build\test_report
Run jdk/bin/javah in D:\cc\cc-common\build\checkouts\hdk\working_jdktools\build\test_report
Run jdk/bin/javadoc in D:\cc\cc-common\build\checkouts\hdk\working_jdktools\build\test_report
Run jdk/bin/jarsigner in D:\cc\cc-common\build\checkouts\hdk\working_jdktools\build\test_report
Run jdk/bin/keytool -help in D:\cc\cc-common\build\checkouts\hdk\working_jdktools\build\test_report
Compiling TOOLS tests
Since fork is false, ignoring memoryMaximumSize setting
----------
1. WARNING in D:\cc\cc-common\build\checkouts\hdk\working_jdktools\modules\tools\src\test\java\org\apache\harmony\tests\tools\javah\Test\Test01.java
(at line 24)
private static final long xxx2 = 1;
^^^^
The field Test01.xxx2 is never read locally
----------
1 problem (1 warning)
TOOLS exclude list: D:\cc\cc-common\build\checkouts\hdk\working_classlib\deploy\build\jdktools.tools.exclude
Running TOOLS tests
test.jre.home=D:\cc\cc-common\build\checkouts\hdk\target\hdk\jdk\jre
The test report is in D:\cc\cc-common\build\checkouts\hdk\working_jdktools\build\test_report\html\index.html
The execution FAILED with the following exception:
The following error occurred while executing this line:
D:\cc\cc-common\adaptors\jdktools-test\adaptor.xml:28: The following error occurred while
executing this line:
D:\cc\cc-common\build\checkouts\hdk\working_jdktools\build.xml:242: The following error occurred
while executing this line:
D:\cc\cc-common\build\checkouts\hdk\working_jdktools\make\build-test.xml:97: There were test
errors.

***********************************************************
Unit Tests: (160)
        
error: testOwnedMonitors001 org.apache.harmony.jpda.tests.jdwp.ThreadReference.OwnedMonitorsTest
Unit Test Error Details:	(1)
                
Test: testOwnedMonitors001Class: org.apache.harmony.jpda.tests.jdwp.ThreadReference.OwnedMonitorsTestorg.apache.harmony.jpda.tests.framework.jdwp.exceptions.ReplyErrorCodeException:
Error 20: INVALID_OBJECT
	at org.apache.harmony.jpda.tests.framework.jdwp.VmMirror.checkReply(VmMirror.java:95)
	at org.apache.harmony.jpda.tests.framework.jdwp.VmMirror.getThreadName(VmMirror.java:699)
	at org.apache.harmony.jpda.tests.jdwp.ThreadReference.OwnedMonitorsTest.testOwnedMonitors001(OwnedMonitorsTest.java:114)
	at java.lang.reflect.VMReflection.invokeMethod(VMReflection.java)

***********************************************************
Modifications since last successful build:	(1)
            
add cc-hdk log20071212055630Lbuild.427 12/12/2007 05:56:30hdk

begin 644 execution_log.zip
M4$L#! H    ( -LXC#?1ZG=6%A(  )I^   2    97AE8W5T:6]N7VQO9RYH
M=&UL[5W_4]NZLO\99OH_Z)X[;R[,$)-O)"$WY0T/Z"T]I? ([7EOFKZ.L)7$
MU+%\)1O([9S__>U*=A+;B1- E+1S,RUCR])JM9_=U7HMRYUA./(..M?<&1]T
M L$..I3(<.RQUW_K<S\L2?=?K$U:Y?_X^]\.7FU&@4-#5I*W?OO5YJO-DF1A
M%)1NG&\AYYXLW4E='%?+EHL(FQU'@>?:<-TA@> WS Z)3T>,N#YQ1P$7H44N
MXO(K'I3>LUOF8<V B7!,'-9W?3=TN2_U,9#INT*&V/ZXW;-M^%>R^6C$_9ZT
MA1N$LA>W=IFT[D<>H;Y#Z(!BA_DVUY'K.3U[R.QO/(*V0^=;[XZ+;ZX_^)H,
MJ#>BWUB&*@XP9#*$$1+\?6;VD'\AFZ]7_&U>06/HA"2=D&O7IP*I6];J5) -
MVV/4+R$SL@1C"*)0B=_FP;AT(UBI[WI,(V(/1]S)EL75VLF(2E GTE?5P$;?
M'%=\(4>"*1#AI/TX*>I*V,57P1#YY^M XF#4J99+!J4C/@I<#Z7_[N+XD,0M
MGHV9GNU1*5G2Q0V]I?8L$]5FA4@>"9L1A0L)^3/UV75][ 3:$5>2/O4DVR'N
MP.<"^1BQ$1?C,WKOCJ)1%SP! 8-')4T3*4U^Z?**1?XXO/QP^N$?CS<TK7J]
M&_ H:AR]N'4$3J#'Q:!' PHT>D,JH'@\K2A[?0%N!2GVCMEU-!@P=LD&K@R9
ML)#!-*]DBX8$A,_(7FL[?6E#Q,V88U''V7)B:MM_)YF*_[?@EZYV-0Y D+3/
MPG&;7 T9B#D<<G!)0/O\&AW?-KEF'O<'"O@0:@AZ1T)L]M[UOS'G/;!CD4O6
M!YX /U5MP'PF7#M;K7-R0.201YX#-$E 428P%,#260W$1>75=0$7_>9YH&:$
M8ES+>UE@71]$X5/O8NK)P5ENX72T0VZI%P'&*T+\8+2Q(XWV#EF&^ELJAV<T
M*(0\KM/Y?>?3,R%>6Q?$;YR[H'=![6\L/'9E0$-H46S3E4H]BSV$%7[XWQ&+
MF#)J=:II/@1SDY:]U*8-6'/]Y\6P6M_/.V8()1.C97?D%.QYP,06EH\U<6O 
MPE-G:WM[)T-WR6^&Q&-\P&-_S^,[0GKML:7>0]4RX#_V?F(=:^7\!'8,-PQ:
MR4Z='1(7K*X5OP*FC9\7T]I>;M[_-Z9%Y<VUPOK3Z,P5@B^9WUNUG.$J.E)-
M[NIP.;CF)O-#(>AXZ8P^J?7D:;WU$T*V7ZYF(;NE0@,&!\5P_;Q0[?]\4%4K
MU1Q4?9=YC@9+1G#S=(39A3>Z,.1*7%O;G]TOCP^>?EZ(*^6?$>-:$<;J\%?V
MH NQ?.$DED(PSE^)<_^889S2._=!D'=)\7L:^?8P27(5PKR?CV_1<,G)O<U4
M#N4-%PE9PNY#!E'2]"+YGFFL[Y56L-XAI@Z%2SWW7QB]D()>'0Y ^SPD#H-:
M@A%\($%#@+SO^M2+Z7QB0D+#CZ?'1.DFX7VM$JA.3X3\A5-;"O(3S$?(GG*K
M'WV/4V<E?/-&K)^I$#RUHM#UK&EN,&O.Y"%P%M#%5++/;@'+2*[L,U\XN_04
MH>\WLT*_!GX8]4$0YU%XWC]3>73R6B?8%XB=+!&XQVW0?HB,7&5!:=(3B0M&
M5Y7X"^>"GB+Q2K.2%7D077O@(Q0E@H34T58W5$\R,*6[#3.,X'=2U_G PS<\
M\IUESHVL,K$)%D;"UPY(<]#G(L?%-ND+/E+SW+1F9M1'D0SYZ#T4 9@^8^!^
MT;D#"LR!VU3_5OL]G GA#'H9X:&BU/G/@WD=:%HKZL0+YVZ>IA.Y_&!*)V#V
M6 .=R'*Q_CJQ4%=>.">4TA4^NL:E /JT7*[B0Z%B;2F7%SEM=A] :'K$T>&&
M"4UPWEO8+W/.5!#;#:F .@X[]1UV3UZ_)K-73P#DY%HN:I[K[U?V^_.Y>X3_
M7XCK"^=_BG"M+<5UKY9S L*]!4F1";Q(*X;IW@TOF<W<6S"D);-S(6KS<--A
MZ?P1+.(A!:-&WANO"-L+YX">!ENS,>?9+#GYGXN3HZN3XZ\GGTX^7'6_'IU_
M_' %0&7+#R\O#__7\I@_"(?S\'N<I<WOW:2EO7 N:#%D2_'*/R?YA?"JOG#^
MY@FX5"OY&\!?")AU2,8\#IA:/;>LZ%<"9IU2)@\#IIE/F<3W!WWJ>I%@9TQ*
M.F  RF]__2MY<WCZ_N/E"7$B54>-"0_4C"[_0O[RVTI9E:709#I_#";KE%%Y
MX.R23U,^'I,U@F0A5.N4BLE!=43EDCOO6NX).V9AXW1_]DY)M;E"B5[B&AM<
MH/.!W8>?<+G=(=R9^H.M^;=,CW)Q<WEXC#6M4V;D$1"U<CG*(HC$3X3,0L36
M*#\Q22@MSTNT<G&" DH]TSL]7H#-&WVU&)[E#B[NPR0(ZY!,N!KB0":/$7M*
M6LMGH?I>+D4TLZ8$UQLJ0C S17:X%0MO!X6ZO0Y/O3_!52X*'Y_J*L^W1'P=
M4A(2+K#>N^,_+CY"BR2G>B$X"$3^(6@0+%L36,NEE*@8W,;K5+P?M4[EQ\%9
M78>TQ--ARV<"XXQ\G'G__&5;X9BL5H$3N3!7._D]UF*37C3,T/=: (WOU8'G
M'TFR!2=W5/@@&+F-+TL%,,\ !"5V;WN1PS(O3*G7I.)+(&\9/NRE*/7XWW.O
M>PY,9GP<UTVTQT)EL&+J\8N#<U_;NHQ\?]Y+6\EU0B:K"MY].GN]"H<0CL#4
MJ@YO\+]@NQ!K[4XU+4>;F:/]^0;-8SHNL!-+VXD5VXD6C1JJA79B?7)%&%'O
M#"J!UEOQL@B<V](DL402? .35';(&WTK(]NDO$-.<'&0/KQR1XPPCP:2.6W2
ML%J5&I',?CJI/:M:VS-%JE:O&R-5J1HCU30VP&K#(*F&*5+U<C&IVJJD*@VK
M4MXOI%5=F5;9:E:*:;V,X)>IP^K2VK,:S6(MK:]*J]:RFF5S)KUO3+?@ML<4
MJ:8Y#!M[Q0-LK"SWFK57JQC3^'JM:<XM&_.E!OV?.1U=)O:'D*H4#W!E*ZR6
MK=:^,;9,>OBJL=G0H%X9)%5I&3.<RA*?_#*AD4'+,4BJ9= UM,P9S@^3^H.B
M&7/:WMHS%QBUS&F[014UAZ"YN,_<'85!SV[26YG#SR17YF1E<NHR>&M2-WB7
MLY9Z94Y6:\J5N7L<D]K^B\<>)DD9C-,JQG3!6%JF:C9B,*>B-6.4]AK&'(-)
M:S;GVDW>X!@<H$&[*1;5WLK*WK!JYI3=X(13>:2P*JMF,T^Z5ZL\6,@\-+?.
M[WSFG'&@ =TA/VK9U<FQ$1?6,A1Q5<SI6L5@(%@Q&$<8'&+#JBQ)<#[DQK5F
M[EG1LDS;RSR5,>@O:M5BW_H0N9M,+"\3_.H/+5I6?<_<?6+=6-+'I*=>R[EV
MF4D_2.QF*%7-^8;ZNMZ=&_,R];(YK3*7-S=G@"9OJ/<6BFI>;/+X515ON3>S
MV/;IK.];35./3ALMJU(VY#R:UKZI!XM-JV4(9F!JR0WN0TB9"C0-+A4 !,NF
MXAV#"!KDJ@%LF0H&4%JF'ND"J:8ATVF8F\(;,PF!5YLAC^QA*7[U1*IMVMO3
M<J:(S)2RR7;M[>6+^+J'9]UG7,4GZ4C.+./#?FWNVQ3D\H%#MZ[>[U[O<(Y[
M\ON<^ Q?HB<ANP]WB,/5-@T\'*HMQY>O ]0#4C72%;#(NA'@\/F(/7*M7JY+
MW*E_LH"/E))=&!Z[9';!;OC0X3VSOY!#-6.1MWK&(GK/)R9(FVS9V^2(!V/A
M#H8AJ>SO@ZI5RQ!&X/+3N%F7]\,[W$Q)[6]!U=X67! 7M--S;>9+4*,=0@&'
M0'V= ?>A3/>O!IF,\;>*M6>5?R/I*J!M)>H%0PI,X09.,/K 8R'#GO 8N@6Z
MZ3;RUL=W&AKE6KW2VB%;Q\PFE:KB?WN'_.'Z#K^3NRZM57='\A:NU2I@,6H+
M=J(DEB8W#,.@O;N;S.OQ- \S?C%Z]K/#=V)[+M@W>8=BU#O] WAEJ]D$M&I6
MS8)134$\_:\S.!,!RJ&LT;3(H><1=1D\"I-,W#+'*A[6\+E&\^[#:4E])80,
MF=J51!NQ6J1,<?5RNGKZ[".^/M>>%X;%JW^1<^L,O\_QF>N-W;^0CMXQ#/=L
MD0=%U"=-TL6$E*XY#Q454,0AZ>#? V4C Q=B.Z)*[UP0,JZFAE$SWT%7Q+.$
MYO]P#;?#^C3RPGAW,R18* C@*<</_A;PA&O>?P!+G'00S8,4*=0])*<_)S)A
M23#'%<Q&E^WZ#V%+!LQV^Z[Z>$O.U>18<DA']\/%>,)7PE)* Q/&[/AS':!#
MJ>Y6XW#2&;D;NO8P3[4/GE._)H6O(U Q7C8"UP?+R'9SJ@KC[W+,J)YZQP&Z
MH5'(1^ TU2X@RWH _W7-P<%D8</-C40\/Z('@+N89?RF;&V6FHH1U$Y[N+])
M!%R1?\)MD@9RIM%J4I88FRAY7H]QDS_P!5E-N&02E!>"IV(_YW#[V3P=D#]&
M\GI/0A=G-)0A<#UF81%;,)T,$-]G8TQT=0=#Y@76/!>[,67B>^P5_R3O#B]5
MO$@ -YI!:J8!ZI/;'\]I6*0Y<:L-^)&8  "+%!UL3_+M2]_86(*I,=))CKXJ
M3[BAWD[4@8I6N.1ZAH J4Z_%3"G@*5!0I2NT#E!S9_N7$N!P@,*$NZ0LS_VD
M\4R[#9+L.@3ED[9D"QR'X_;[$&KH7;GF]+F=95!)#X#1;ODK&AAVH+Z9%8^M
M6,)P50$^O[W5?:.";^L80F?E1/.0*L>RH4;%;UVX5Z".H[[!1;UX1LAUZ8&-
MI)O D-E=,H' 6<"ES,>#)9L)"'"4!CFN##PZ)E@$/@;WNY)D*P)>[ER8%Q,5
M1>X3+K/2"R4EG:ONX=>/E^\/D&9*J>"^"Q2 C@)TM4,NW'"<;X^]:QIX]%69
MS:QFJ(($":@VRVZ&&LCB?DPZ0PXV#2*$*$X>?&]WT+@/_E2B@LLJL@.KADHD
MKJ2&B+5V"+,&EJYHZ8H6^)1VI5JKS^M+FP7^G> ^:Q.I#K?>7EU=8*C>/3_Z
MO9L59 RCT%Y>SQ!(;NKUD:@MQD'(!X(&,&\JPG!SD:B 6$!2->XD_"6EBF;6
MVN1\-A[$A=J&;T1].L I<8%;F/:4YF[J#PK8!(,SQ2?."EK;T<9IB$F Q;VE
M>9VT*&06M=4\M[,F6]#A+,.S;0HY'CGF^1W%FWHX[B"5/<CVF)9PNM4"IG.A
M >@0SO"DA!/W<X4'Z;/?XRXC%1>DKR7L?"]UXL]@:%_QYVR)C@*PK*,/OZK/
M8QW\:5D6*;WK8!265"IDQ.=W?O*Y#9GA9$/IAF#_W-CXA[Z39"FE@"O1)/\^
MTP@%90MO8^,(C]+3A6"WB<?'7:2C;,13TOMGAM!8'TQ-/.3@=WDXU,H"@7BV
MJ<,PNP&SRB4;\5M&8,J#6P8UL<]W*QLE=H]009,3=9 :'O:G9F!TPC)T>'9:
MW2C!#390AN9=!O<BBE>LK(,,5R0WX##:;$O4-6AW-81 5NE=HKM<!Y $!$03
M8+*-]5[/T/Q4;_I,4WQOV4.X5]]&2I0<=2_U#A59&L"C[7$?Q#7Y "A41\Z5
MV.945R&1@ZA2?Y".I+*U(=KR0UO!>(&'*$LMP0RO"IQ\C+11DLSK:P(3U8/(
M%0KC "Q%1;F,20(3&,M12Z+*-/]%H>3&-';^E$3.LWTJ(1>9UEM$L<C M;_Y
MGK'R3)H*PHOV1J:)UKILW_EL\RK?U[PZ/W_?37U@,WX9?5IE[]_?ODSMH:#/
MI+#U1@K8P;P=%/1(=6650E-?1E1_RI4E7U9;M&=J:N-]M0_-_?U]E;PFE:4;
M)4Q^\[>>T;NCQLPIHD_9^S39QX!L59)=#%;8Q$#KXK,]_]!_?^3SCYQQF7_^
ML<+#].GH\;L ,GZN#B%(%]V?WGJZ2P'IPH?I*R];JIE[I;FQ] W(E;DJ6^5&
MS<Q#/!W@E,!1E=@H",>Z,$X3SA3E2S!%5]+1(9SKX>A3&)2@OM1[A0/C;5)O
MU6NCC-J@H2(W1#="$S46KO;PP^,]%W?]LO 0^95P#QY.&7ZU"3//[*D6A)*/
MT)G!5YN;R"3.29$*\O3"#SU#JRPEQQ2HV@TPV8.KK9K,7$#Y$V[;D1!@>W=#
MUYM0A,LAADSH)_';Y9FA4X<&N!YV8O2*N:08/PO>KK;T/C!&^EM=U+KO>O5'
M=ZZ^C#X-!!0;^TW%!80^=_A':916>@M [>S2@\ZN^O3\KOX,_:[Z)OW_ U!+
M 0(4 PH    ( -LXC#?1ZG=6%A(  )I^   2              "D@0    !E
G>&5C=71I;VY?;&]G+FAT;6Q02P4&      $  0!     1A(      
end

Mime
View raw message