harmony-alerts mailing list archives

Site index · List index
Message view « Date » · « Thread »
Top « Date » · « Thread »
From nom...@intel.com
Subject [build-test alert] FAILED Windows 2003 x86: jdktools-test debug
Date Mon, 10 Dec 2007 08:05:44 GMT

BUILD FAILED:
	Ant Error Message:
D:\cc\cc-common\scripts\cc-exec-adaptor.xml:104: The following error occurred while executing
this line: D:\cc\cc-common\adaptors\jdktools-test\adaptor.xml:28: The following error occurred
while executing this line: D:\cc\cc-common\build\checkouts\hdk\working_jdktools\build.xml:242:
The following error occurred while executing this line: D:\cc\cc-common\build\checkouts\hdk\working_jdktools\make\build-test.xml:97:
There were test errors.

Date of build:	2007-12-10 13:41:05 +0600
Time to build:	24 minutes 30 seconds
Last changed:	12/10/2007 12:50:25
Last log entry:	hdk

***********************************************************
Errors/Warnings:	(229)
            
Result: 1
[cc-ant]: Test Suite 'jdktools-test' execution. Repository updated: ${repository.updated}
[cc-ant]: Check for 'run' failure of hdk = ${hdk.parameters.run.failed}
[cc-ant]: Result: failed.superiors = '${failed.superiors}'
========================================
Testing jdktools binaries...
========================================
Compiling JPDA tests
Since fork is false, ignoring memoryMaximumSize setting
----------
1. WARNING in D:\cc\cc-common\build\checkouts\hdk\working_jdktools\modules\jpda\test\common\unit\org\apache\harmony\jpda\tests\framework\DebuggeeRegister.java
(at line 58)
registered.add(debuggee);
^^^^^^^^^^^^^^^^^^^^^^^^
Type safety: The method add(Object) belongs to the raw type LinkedList. References to generic
type LinkedList<E> should be parameterized
----------
----------
2. WARNING in D:\cc\cc-common\build\checkouts\hdk\working_jdktools\modules\jpda\test\common\unit\org\apache\harmony\jpda\tests\framework\TestOptions.java
(at line 505)
internalProperties.put(name, value);
^^^^^^^^^^^^^^^^^^^^^^^^^^^^^^^^^^^
Type safety: The method put(Object, Object) belongs to the raw type HashMap. References to
generic type HashMap<K,V> should be parameterized
----------
----------
3. WARNING in D:\cc\cc-common\build\checkouts\hdk\working_jdktools\modules\jpda\test\common\unit\org\apache\harmony\jpda\tests\framework\jdwp\PacketDispatcher.java
(at line 114)
eventQueue.add(eventPacket);
^^^^^^^^^^^^^^^^^^^^^^^^^^^
Type safety: The method add(Object) belongs to the raw type List. References to generic type
List<E> should be parameterized
----------
4. WARNING in D:\cc\cc-common\build\checkouts\hdk\working_jdktools\modules\jpda\test\common\unit\org\apache\harmony\jpda\tests\framework\jdwp\PacketDispatcher.java
(at line 249)
replies.put(new Integer(replyPacket.getId()),
replyPacket);
^^^^^^^^^^^^^^^^^^^^^^^^^^^^^^^^^^^^^^^^^^^^^^^^^^^^^^^^^^^^^^^^^^^^^^^^^^^^^^^^^^^^^^^^^^^
Type safety: The method put(Object, Object) belongs to the raw type Hashtable. References
to generic type Hashtable<K,V> should be parameterized
----------
5. WARNING in D:\cc\cc-common\build\checkouts\hdk\working_jdktools\modules\jpda\test\common\unit\org\apache\harmony\jpda\tests\framework\jdwp\PacketDispatcher.java
(at line 284)
commands.put(Id, command);
^^^^^^^^^^^^^^^^^^^^^^^^^
Type safety: The method put(Object, Object) belongs to the raw type Hashtable. References
to generic type Hashtable<K,V> should be parameterized
----------
6. WARNING in D:\cc\cc-common\build\checkouts\hdk\working_jdktools\modules\jpda\test\common\unit\org\apache\harmony\jpda\tests\framework\jdwp\PacketDispatcher.java
(at line 355)
commands.put(Id, command);
^^^^^^^^^^^^^^^^^^^^^^^^^
Type safety: The method put(Object, Object) belongs to the raw type Hashtable. References
to generic type Hashtable<K,V> should be parameterized
----------
----------
7. WARNING in D:\cc\cc-common\build\checkouts\hdk\working_jdktools\modules\jpda\test\common\unit\org\apache\harmony\jpda\tests\framework\jdwp\VmMirror.java
(at line 1834)
frames.add(frame);
^^^^^^^^^^^^^^^^^
Type safety: The method add(Object) belongs to the raw type ArrayList. References to generic
type ArrayList<E> should be parameterized
----------
8. WARNING in D:\cc\cc-common\build\checkouts\hdk\working_jdktools\modules\jpda\test\common\unit\org\apache\harmony\jpda\tests\framework\jdwp\VmMirror.java
(at line 1902)
vars.add(var);
^^^^^^^^^^^^^
Type safety: The method add(Object) belongs to the raw type ArrayList. References to generic
type ArrayList<E> should be parameterized
----------
9. WARNING in D:\cc\cc-common\build\checkouts\hdk\working_jdktools\modules\jpda\test\common\unit\org\apache\harmony\jpda\tests\framework\jdwp\VmMirror.java
(at line 2122)
fields.add(superClassFields.toArray()[i]);
^^^^^^^^^^^^^^^^^^^^^^^^^^^^^^^^^^^^^^^^^
Type safety: The method add(Object) belongs to the raw type ArrayList. References to generic
type ArrayList<E> should be parameterized
----------
10. WARNING in D:\cc\cc-common\build\checkouts\hdk\working_jdktools\modules\jpda\test\common\unit\org\apache\harmony\jpda\tests\framework\jdwp\VmMirror.java
(at line 2132)
fields.add(field);
^^^^^^^^^^^^^^^^^
Type safety: The method add(Object) belongs to the raw type ArrayList. References to generic
type ArrayList<E> should be parameterized
----------
----------
11. WARNING in D:\cc\cc-common\build\checkouts\hdk\working_jdktools\modules\jpda\test\common\unit\org\apache\harmony\jpda\tests\jdwp\DebuggerOnDemand\OnthowDebuggerLaunchDebuggee.java
(at line 94)
class ExceptionForDebugger extends Exception {
^^^^^^^^^^^^^^^^^^^^
The serializable class ExceptionForDebugger does not declare a static final serialVersionUID
field of type long
----------
----------
12. WARNING in D:\cc\cc-common\build\checkouts\hdk\working_jdktools\modules\jpda\test\common\unit\org\apache\harmony\jpda\tests\jdwp\Events\ClassUnloadDebuggee.java
(at line 32)
import java.util.LinkedList;
^^^^^^^^^^^^^^^^^^^^
The import java.util.LinkedList is never used
----------
13. WARNING in D:\cc\cc-common\build\checkouts\hdk\working_jdktools\modules\jpda\test\common\unit\org\apache\harmony\jpda\tests\jdwp\Events\ClassUnloadDebuggee.java
(at line 97)
boolean isOutOfMemory = false;
^^^^^^^^^^^^^
The local variable isOutOfMemory is never read
----------
14. WARNING in D:\cc\cc-common\build\checkouts\hdk\working_jdktools\modules\jpda\test\common\unit\org\apache\harmony\jpda\tests\jdwp\Events\ClassUnloadDebuggee.java
(at line 171)
public Class loadClass(String name) throws ClassNotFoundException {
^^^^^
Type safety: The return type Class for loadClass(String) from the type ClassUnloadDebuggee.CustomLoader
needs unchecked conversion to conform to Class<?> from the type ClassLoader
----------
15. WARNING in D:\cc\cc-common\build\checkouts\hdk\working_jdktools\modules\jpda\test\common\unit\org\apache\harmony\jpda\tests\jdwp\Events\ClassUnloadDebuggee.java
(at line 179)
public Class findClass(String name) throws ClassNotFoundException {
^^^^^
Type safety: The return type Class for findClass(String) from the type ClassUnloadDebuggee.CustomLoader
needs unchecked conversion to conform to Class<?> from the type ClassLoader
----------
----------
16. WARNING in D:\cc\cc-common\build\checkouts\hdk\working_jdktools\modules\jpda\test\common\unit\org\apache\harmony\jpda\tests\jdwp\Events\CombinedEvents002Test.java
(at line 100)
boolean expectColocatedEvents = (testedMethodStartCodeIndex == testedMethodEndCodeIndex);
^^^^^^^^^^^^^^^^^^^^^
The local variable expectColocatedEvents is never read
----------
----------
17. WARNING in D:\cc\cc-common\build\checkouts\hdk\working_jdktools\modules\jpda\test\common\unit\org\apache\harmony\jpda\tests\jdwp\Events\CombinedEvents003Test.java
(at line 53)
private boolean eventMethodExitReceived = false;
^^^^^^^^^^^^^^^^^^^^^^^
The field CombinedEvents003Test.eventMethodExitReceived is never read locally
----------
18. WARNING in D:\cc\cc-common\build\checkouts\hdk\working_jdktools\modules\jpda\test\common\unit\org\apache\harmony\jpda\tests\jdwp\Events\CombinedEvents003Test.java
(at line 76)
int EXPECTED_EVENTS_COUNT = EXPECTED_EVENTS_ARRAY.length;
^^^^^^^^^^^^^^^^^^^^^
The local variable EXPECTED_EVENTS_COUNT is never read
----------
----------
19. WARNING in D:\cc\cc-common\build\checkouts\hdk\working_jdktools\modules\jpda\test\common\unit\org\apache\harmony\jpda\tests\jdwp\Events\CombinedEventsTest.java
(at line 84)
int EXPECTED_EVENTS_COUNT = EXPECTED_EVENTS_ARRAY.length;
^^^^^^^^^^^^^^^^^^^^^
The local variable EXPECTED_EVENTS_COUNT is never read
----------
20. WARNING in D:\cc\cc-common\build\checkouts\hdk\working_jdktools\modules\jpda\test\common\unit\org\apache\harmony\jpda\tests\jdwp\Events\CombinedEventsTest.java
(at line 212)
int EXPECTED_EVENTS_COUNT = EXPECTED_EVENTS_ARRAY.length;
^^^^^^^^^^^^^^^^^^^^^
The local variable EXPECTED_EVENTS_COUNT is never read
----------
21. WARNING in D:\cc\cc-common\build\checkouts\hdk\working_jdktools\modules\jpda\test\common\unit\org\apache\harmony\jpda\tests\jdwp\Events\CombinedEventsTest.java
(at line 348)
int EXPECTED_EVENTS_COUNT = EXPECTED_EVENTS_ARRAY.length;
^^^^^^^^^^^^^^^^^^^^^
The local variable EXPECTED_EVENTS_COUNT is never read
----------
22. WARNING in D:\cc\cc-common\build\checkouts\hdk\working_jdktools\modules\jpda\test\common\unit\org\apache\harmony\jpda\tests\jdwp\Events\CombinedEventsTest.java
(at line 732)
String failureMessage = "## FAILURE during checking events! !";
^^^^^^^^^^^^^^
The local variable failureMessage is never read
----------
23. WARNING in D:\cc\cc-common\build\checkouts\hdk\working_jdktools\modules\jpda\test\common\unit\org\apache\harmony\jpda\tests\jdwp\Events\CombinedEventsTest.java
(at line 894)
String failureMessage = "## FAILURE during checking events !";
^^^^^^^^^^^^^^
The local variable failureMessage is never read
----------
----------
24. WARNING in D:\cc\cc-common\build\checkouts\hdk\working_jdktools\modules\jpda\test\common\unit\org\apache\harmony\jpda\tests\jdwp\Events\CombinedEventsTestCase.java
(at line 135)
long methodStartCodeIndex = lineTableReply.getNextValueAsLong();
^^^^^^^^^^^^^^^^^^^^
The local variable methodStartCodeIndex is never read
----------
25. WARNING in D:\cc\cc-common\build\checkouts\hdk\working_jdktools\modules\jpda\test\common\unit\org\apache\harmony\jpda\tests\jdwp\Events\CombinedEventsTestCase.java
(at line 187)
long methodStartCodeIndex = reply.getNextValueAsLong();
^^^^^^^^^^^^^^^^^^^^
The local variable methodStartCodeIndex is never read
----------
----------
26. WARNING in D:\cc\cc-common\build\checkouts\hdk\working_jdktools\modules\jpda\test\common\unit\org\apache\harmony\jpda\tests\jdwp\Events\ExceptionTest.java
(at line 188)
long frameID = reply.getNextValueAsFrameID();
^^^^^^^
The local variable frameID is never read
----------
----------
27. WARNING in D:\cc\cc-common\build\checkouts\hdk\working_jdktools\modules\jpda\test\common\unit\org\apache\harmony\jpda\tests\jdwp\ThreadReference\FramesTest.java
(at line 450)
frames.add(new FrameStruct(frameID, loc));
^^^^^^^^^^^^^^^^^^^^^^^^^^^^^^^^^^^^^^^^^
Type safety: The method add(Object) belongs to the raw type Vector. References to generic
type Vector<E> should be parameterized
----------
----------
28. WARNING in D:\cc\cc-common\build\checkouts\hdk\working_jdktools\modules\jpda\test\common\unit\org\apache\harmony\jpda\tests\jdwp\share\JDWPUnitDebuggeeProcessWrapper.java
(at line 233)
argv.add(val);
^^^^^^^^^^^^^
Type safety: The method add(Object) belongs to the raw type Vector. References to generic
type Vector<E> should be parameterized
----------
29. WARNING in D:\cc\cc-common\build\checkouts\hdk\working_jdktools\modules\jpda\test\common\unit\org\apache\harmony\jpda\tests\jdwp\share\JDWPUnitDebuggeeProcessWrapper.java
(at line 253)
return (String[])argv.toArray(args);
^^^^^^^^^^^^^^^^^^
Type safety: The method toArray(Object[]) belongs to the raw type Vector. References to generic
type Vector<E> should be parameterized
----------
29 problems (29 warnings)
JPDA exclude list: D:\cc\cc-common\build\checkouts\hdk\working_classlib\deploy\build\jdktools.jpda.exclude
Running JPDA tests
Debugger JVM=D:\cc\cc-common\build\checkouts\hdk\target\hdk\jdk\jre/bin/java
Debuggee JVM=D:\cc\cc-common\build\checkouts\hdk\target\hdk\jdk\jre/bin/java
SAMSA exclude list: D:\cc\cc-common\build\checkouts\hdk\working_classlib\deploy\build\jdktools.samsa.exclude
Running SAMSA tests
test.jre.home=D:\cc\cc-common\build\checkouts\hdk\target\hdk\jdk\jre
Run jdk/bin/java -version in D:\cc\cc-common\build\checkouts\hdk\working_jdktools\build\test_report
java version "1.5.0"
pre-alpha : not complete or compatible
svn = r602792, (Dec 10 2007), Windows/ia32/msvc 1310, debug build
http://harmony.apache.org
Run jdk/bin/javac -version in D:\cc\cc-common\build\checkouts\hdk\working_jdktools\build\test_report
Run jdk/bin/javah in D:\cc\cc-common\build\checkouts\hdk\working_jdktools\build\test_report
Run jdk/bin/javadoc in D:\cc\cc-common\build\checkouts\hdk\working_jdktools\build\test_report
Run jdk/bin/jarsigner in D:\cc\cc-common\build\checkouts\hdk\working_jdktools\build\test_report
Run jdk/bin/keytool -help in D:\cc\cc-common\build\checkouts\hdk\working_jdktools\build\test_report
Compiling TOOLS tests
Since fork is false, ignoring memoryMaximumSize setting
----------
1. WARNING in D:\cc\cc-common\build\checkouts\hdk\working_jdktools\modules\tools\src\test\java\org\apache\harmony\tests\tools\javah\Test\Test01.java
(at line 24)
private static final long xxx2 = 1;
^^^^
The field Test01.xxx2 is never read locally
----------
1 problem (1 warning)
TOOLS exclude list: D:\cc\cc-common\build\checkouts\hdk\working_classlib\deploy\build\jdktools.tools.exclude
Running TOOLS tests
test.jre.home=D:\cc\cc-common\build\checkouts\hdk\target\hdk\jdk\jre
The test report is in D:\cc\cc-common\build\checkouts\hdk\working_jdktools\build\test_report\html\index.html
The execution FAILED with the following exception:
The following error occurred while executing this line:
D:\cc\cc-common\adaptors\jdktools-test\adaptor.xml:28: The following error occurred while
executing this line:
D:\cc\cc-common\build\checkouts\hdk\working_jdktools\build.xml:242: The following error occurred
while executing this line:
D:\cc\cc-common\build\checkouts\hdk\working_jdktools\make\build-test.xml:97: There were test
errors.

***********************************************************
Unit Tests: (160)
        
error: testInvokeMethod002 org.apache.harmony.jpda.tests.jdwp.ObjectReference.InvokeMethodTest
Unit Test Error Details:	(1)
                
Test: testInvokeMethod002Class: org.apache.harmony.jpda.tests.jdwp.ObjectReference.InvokeMethodTestorg.apache.harmony.jpda.tests.framework.TestErrorException:
Debuggee process did not finish during timeout
	at org.apache.harmony.jpda.tests.jdwp.share.JDWPUnitDebuggeeProcessWrapper.WaitForProcessExit(JDWPUnitDebuggeeProcessWrapper.java:284)
	at org.apache.harmony.jpda.tests.jdwp.share.JDWPUnitDebuggeeProcessWrapper.finishProcessAndRedirectors(JDWPUnitDebuggeeProcessWrapper.java:87)
	at org.apache.harmony.jpda.tests.jdwp.share.JDWPUnitDebuggeeWrapper.stop(JDWPUnitDebuggeeWrapper.java:109)
	at org.apache.harmony.jpda.tests.jdwp.share.JDWPTestCase.internalTearDown(JDWPTestCase.java:108)
	at org.apache.harmony.jpda.tests.jdwp.share.JDWPSyncTestCase.internalTearDown(JDWPSyncTestCase.java:83)
	at org.apache.harmony.jpda.tests.jdwp.share.JDWPRawTestCase.tearDown(JDWPRawTestCase.java:118)
Caused by: java.lang.IllegalThreadStateException: process has not exited
	at java.lang.Runtime$SubProcess.exitValue(Runtime.java:357)
	at org.apache.harmony.jpda.tests.jdwp.share.JDWPUnitDebuggeeProcessWrapper.WaitForProcessExit(JDWPUnitDebuggeeProcessWrapper.java:279)
	at org.apache.harmony.jpda.tests.jdwp.share.JDWPUnitDebuggeeProcessWrapper.finishProcessAndRedirectors(JDWPUnitDebuggeeProcessWrapper.java:87)
	... 14 more

***********************************************************
Modifications since last successful build:	(1)
            
add cc-hdk log20071210125025Lbuild.422 12/10/2007 12:50:25hdk

begin 644 execution_log.zip
M4$L#! H    ( +-PBC==V2;:(A(  ))^   2    97AE8W5T:6]N7VQO9RYH
M=&UL[5U]4]N\LO^;SO0[Z#QG[AR8(28OY(6<E#M<H*?T*:67T#[W3M/;$;:2
M&!S+1[*!G,[SW>^N9">QG3@!1 F=DVD9OTBKU?YV5ZNU+'>&X<C;[UQR9[S?
M"03;[U BP[''WORMS_VP)-U_L39IE?_C[W_;?_TJ"AP:LI*\\=NO7[U^59(L
MC(+2E7,=<N[)TJW4E^-BV>LBPFI'4>"Y-MQW2"#X%;-#XM,1(ZY/W%' 16B1
M3_'U"QZ4/K ;YF')@(EP3!S6=WTW=+DO]3&0Z;M"AEC_J-VS;?A7LOEHQ/V>
MM(4;A+(7UW:9M.Y&'J&^0^B 8H/Y.I>1ZSD]>\CL:QY!W:%SW;OEXMKU!]^3
M#O5&])IEJ&('0R9#Z"'!WU=F#_DW\NK-BK]7%U 9&B%)(^32]:E ZI:U.A5D
MP_88]4O(C"Q!'X(H5.*W>3 N70E6ZKL>TXC8PQ%WLM?B8NVD1R4H$^F[JF.C
M:\<5W\BA8 I$.&D_3(JZ$#;Q73!$_ND:D-@9=:KEDD'ID(\"UT/IO_]T=$#B
M&D_&3,_VJ)0L:>**WE![EHEJLT(DCX3-B,*%A/R)VNRZ/C8"]8@K29]ZDFT3
M=^!S@7R,V(B+\2F]<T?1J N>@(#!HY*FB90FO_3UBD7^.#C_>/+Q'P\W-*UZ
MO2OP**H?O;AV!$Z@Q\6@1P,*-'I#*N#R>%I0]OH"W I2[!VQRV@P8.R<#5P9
M,F$A@VE>R28-"0B?D7IK*WUK0\35F&-1Q]ET8FI;?R>9@O^WX)<N=C$.0)"T
MS\)QFUP,&8@Y'')P24#[[!(=WQ:Y9![W!PKX$$H(>DM"K/;!]:^9\P'8L<@Y
MZP-/@)\J-F ^$ZZ=+=8YWB=RR"// 9HDH"@3Z I@Z:P&XJ+KU74!%_WF6:!&
MA&)<R_4LL*X/HO"I]VGJR<%9;N)PM$UNJ!<!QBM"?&^TL2&-]C99AOH[*H>G
M-"B$/"[3^7W[RQ,A7EL7Q*^<VZ#WB=K7+#QR94!#J%%LTY7*;A9[""O\\+\C
M%C%EU.I4T[P/YB8M>ZE-&[#FW9>+875W+^^8(91,C);=DA.PYP$3FWA]K(E;
M Q:>.)M;6]L9NDM^,R0>X@,>^GL:WQ'22X\M]1ZJE '_47_!.M;*^0EL&"8,
M6LE.G&T27UA=*WX%3!LO%]-:/3?N_QO3HNO-M<+ZR^C4%8(O&=];M9SA*CI2
M#>[J<#FXY@;S R'H>.F(/BGUZ&&]]0(AVRM7LY#=4*$!@X-BN%XN5'LO#ZIJ
MI9J#JN\RS]%@R0@F3X>877BK+X9<B6MSZZO[[>'!T\N%N%)^B1C7BC!6A[^R
M!UV(Y3,GL12"<?Y*G/E'#..4WID/@KQ-+G^@D6\/DR17(<Q[^?@6#9<<W]E,
MY5#><I&0)>PN9! E36^2'YG*>JZT@O4.,74H7.JY_\+HA12TZG  VN<A<1B4
M$HS@ PD: N1]UZ=>3.<+$Q(J?CXY(DHW">]KE4!U>B3DSYS:4I ?8SY"]I1;
M_>Q[G#HKX9LW8OU,A>"I%86N9TUS@UES)O>!LX NII)]=@-81G)EG_G,V:7'
M"'VOF17Z)?##J ^".(O"L_ZIRJ.3-SK!OD#L9(G /6Z#]D-DY"H+2I.>2%PP
MNJK$GSD7]!B)5YJ5K,B#Z-(#'Z$H$22DCC:[H7J2@2G=+1AA!+^5NLQ''K[E
MD>\L<VYDE8%-L# 2OG9 FH,^%SDNMDA?\)$:YZ8E,[T^C&3(1Q_@$H#I,P;N
M%YT[H, <F*;Z-]KOX4@(9]#*" \5I<Y_[L]K0--:42>>.7?S.)W(Y0=3.@&C
MQQKH1):+]=>)A;KRS#FAE*[PT24N!="GY7(5'PH5:TNYO,AIL[L 0M-#C@XW
M3&B"\][$=IESJH+8;D@%E''8B>^P._+F#9F]>PP@)_=R4?-<?[^RWY_/W0/\
M_T)<GSG_4X1K;2FN]5K."0CW!B1%)O BK1BF.S<\9S9S;\"0EHS.A:C-PTV'
MI?-[L(B'%(P:>6^\(FS/G -Z'&S-QIQGL^3X?SX='UX<'WT__G+\\:+[_?#L
M\\<+ "I[_>#\_.!_+8_Y@W X#[^'6=K\UDU:VC/G@A9#MA2O_'.27PBOZC/G
M;QZ!2[62GP#^0L"L0S+F8<#4=G/+BGXE8-8I97(_8)KYE$D\/^A3UXL$.V52
MT@$#4'[[ZU_)VX.3#Y_/CXD3J3*J3WB@1G3Y%_*7WU;*JBR%)M/X0S!9IXS*
M/4>7?)KRX9BL$20+H5JG5$P.JD,JE\R\:[DG[)B%C=/]V9F2JG.!$CW'-3:X
M0.<CNPN_X'*[ YB9^H/-^5.F![FXN3P\Q)K6*3/R (A:N1QE$43B!2&S$+$U
MRD],$DK+\Q*M7)R@@%+/]$Z.%F#S5M\MAF>Y@XO;, G".B03+H;8D<ECQ)Z2
MUO)1:+>>2Q'-K"G!]8:*$(Q,D1UNQL+;1J%NK<-3[R]PEXO"QZ>ZR-,M$5^'
ME(2$&ZSW_NB/3Y^A1I)3_20X"$3^(6@0+%L36,NEE*@8W,3K5+R?M4[EY\%9
M78>TQ.-ARV<"XXQ\G'G_^FU+X9BL5H$3N3!7._D]U&*35C3,T/9: (WOU8'G
M'TFR"2>W5/@@&+F%+TL%,,X !"5V9WN1PS(O3*G7I.);(&\9WN^E*/7XWW,O
M>PX,9GP<ETVTQT)EL&+J\8N#<U_;.H]\?]Y+6\E]0B:K"MY_.7VS"H<0CL#0
MJ@ZO\+]@.Q!K[4PU+4>;F:/]]0K-8]HOL!-+VXD5VXD6C>JJA79B?7%%&%'O
M% J!UEOQL@@<V](D\8HD^ 8FJ6R3MWHJ(]NDO$V.<7&0/KQP1XPPCP:2.6W2
ML)IU(IG]>$IUJUK;-46J5M\SQE6K8HRK2LT85^:D;JY_NXUBJ==6)55I6)5Z
MHY!6=65:9:MI$,)BKNXCK'(QJ=6%5;=:E6HAK=U5:=5:5K-BT'2*V;J7;S"F
M\,V]IBE2C25*VEA9[C6KWB@6UGT4?K=FK(O5LC&?U33GW\VYOWK%F$77=XNE
MOK(55LM6RQA7!HUPMVK.G@UZ&7.NH5IIK>&P6FF9X\J@"9IS#*T]8[(RJ0SF
M.KB,JT6^O9+S[:T]:W<>K>/NQ2I3 3VUG$P;K1/_AE\SO<H$^5'/28Z/U@Y4
M<UIKDI0Y53,8S9MST>MH2966L<C&H%LUR%6U;$Y!&^:""'.D:L8&?I/3:8,:
MVC1G@09'((.DS.G"LDG^\XB]TC08NIES5P:Y,B>K93/-E;,85:,3<X/3B]JN
M,8?<J!L<O(R1JBU)'OT"H[/!^5-Q4%1?6=T;1EVRL5#-Y.AES@:-)6DJ!MDR
M3LN0EB*MAB&%:%B58N]WGZRDP=RYP424P6<#!A^%[9E[^O&PU,-<2LUB%5W]
MD47+9(JZLFLN,EK/@-3@6&A05H;BHJI5JQKJWZ[)0<=DV&!NJ*^M95K-: +D
M9R2+YN4Y'[ZDXAWW9E;:/I[U/7-3A4;+,B50H+1D +@/J9HA/6Y:>RU#>FR0
ME+F8' '<,X>@,5*&>@<RKQL:*)%6U9!6@:0JYF)H4R-) ]UC+*W7KT(>V<-2
M_,J)5-NSMZ?7F2(R<Y5-MFEO+U^\USTX[3[AZCU)1W)F^1ZV:W/?IB"7CQR:
M=?4^]WIG<]R+W^?$9_CR/ G97;A-'*ZV9^#A4&TUOGS]G^Z0*I$N@)>L*P&^
MGH_8 ]?HY9K$'?HG"_=(*=E]X:%+91?L@@\-WC'[&SE0@Q5YIP<KHO=Z8H*T
MR::]10YY,!;N8!B2RMX>J%JU7&ZJ9:=QM2[OA[>XB9+:UX*J/2VX("YHI^?:
MS)>@1MN$ @Z!^BH#[C^9;E]U,NGC;Q6K;I5_(^DBH&TEZ@5#"DSAQDW0^\!C
M(<.6\!B:!;KI.O+&QW<9&N5J<P^F*9M'S(99B.)_:YO\X?H.OY4[+JU5=T;R
M!N[5*F Q:NMUHB26)C<,PZ"]LY,,Z?$(#X-],7KVD\-W;'LNV#=YCV+4._P#
M>&6KV02T:E;-@EY-03SYKU,X$P'*H:S1M,B!YQ%U&SP*DTS<,,<J[M;PJ7KS
M_N-)27T=A R9VHU$&[%:G$QQU7*Z>/KL,[XVUYX7@<6K?I%SZQ2_R_&5ZPW=
MOY&.WBD,]VJ1^T74)U72EPDI77(>*BJ@B$/2P;_[RD8&+H1U1%V]=4'(N(H:
M>LU\!UT1SQ*:_\.UVP[KT\@+XUW-D&"A(("G'#_X6\ 3KG7_"2QQTD$T]U.D
M4/>0G/Z,R(0EP1Q7,!M=MNO?ART9,-OMN^JC+3E7DV/)(1W=#A?C"5\)2RD-
M3!BSX\]T@ ZEFEN-PTECY';HVL,\U3YX3OUZ%+Z&0,5X60]<'RPCV\R)NAA_
MCV-&]=2[#= ,C4(^ J>I=O]8U@+XKTL.#B8+&VYJ).+Q$3T 3&"6\9NRM5EJ
M*D90.^SAOB81<$7^"3,D#>1,I=6D+#$V4?*\'./F?N +LIIPSB0H+P1/Q7[.
MX?:3>3H@?X3D]5Z$+HYH*$/@>LS"(K9@.!D@OD_&F.CJ!H;,"ZQY+G9CRL2/
MV"O^2=X?G*MXD0!N-(/43 74)[<_GE.Q2'/B6AOP(S$! !8I.EB?Y.N7KME8
M@JDQTDF.OBM/N*'>2M2!BE:XY'Z&@+JF7H>94L!3H*"NKE [0,V=;5]*@,,!
M"A/NDFMY[B>59^IMD&2W(;@^J4LVP7$X;K\/H8;>C6M.FUM9!I7T !CMEK^C
M@6$#ZEM9<=^*)0QW%>#SZUO=MRKXMHX@=%9.- ^I<BP;JE?\QH6Y G4<]>TM
MZL4C0JY)#VPD706ZS&Z3 03. BYE/AXLV4Q @*,TR'%EX-$QP4O@8W"?*TDV
M(^#EUH5Q,5%1Y#[A,BN]4%+2N>@>?/]\_F$?:::4"N9=H !T%*"K'7+AAN-\
M?6Q=T\"C[\IL9C5#74B0@&*S[&:H@2SNQJ0SY&#3($*(XN3^CW8'C7O_3R4J
MN*TB.[!J*$3B0JJ+6&J;,&M@Z8*6+FB!3VE7JK7=>6UIL\"_$]QG;2+5X.:[
MBXM/&*IWSPY_[V8%&<,HM)?7(P22FWI])&J+<1#R@: !C)N*,$PN$A40"TBJ
MRIV$O^2JHIFU-CF?C7MQH;;?&U&?#G!(7. 6IBVEN9OZ@P(VP>!,\8FC@M9V
MM'$:8A)@<6MI7B<U"IE%;37/[:S)%C0XR_!LG4*.1XYY?D?Q9AZ..TAE#[(M
MIB6<KK6 Z5QH #J$(SPIX<#]5.%!^NSWN,E(Q07I>PD[/TJ=^/,7VE?\.7M%
M1P%XK:,/OZO/8NW_:5D6*;WO8!26%"IDQ.>W?O*9#9GA9$/IAF#_W-CXAYY)
MLI12P)UHDGJ?J82"LH6WL7&(1^GA0K";Q./C[M%1-N(IZ7TS0ZBL#Z8F'G+P
MNSP<:F6!0#Q;U6&8W8!1Y9R-^ TC,.3!E$$-[//=RD:)W2%44.58':2ZA^VI
M$1B=L P=GAU6-THPP0;*4+W+8"ZB>,7".LAP13(!A]YF:Z*N0;V+(02R2N\2
MW>4Z@"0@()H DZVL]WB&ZB=ZLV>:XGO3'L)<?0LI47+8/=<[4V1I (^VQWT0
MU^3#GU <.5=BFU-<A40.HDK]03J2RI:&:,L/;07C)SQ$66H)9GA5X.1CI(V2
M9%Y?$YBH'D2N<#$.P%)4E,N8)#"!L1RU)*I,\U\42FY,8^<O2>0\VZ82<I%I
MO4,4BPQ<^YL?&2O/I*D@O&AO9*IHK<NVG<\VK_)=S8NSLP_=U(<UXY?0IT7J
M__[F96KO!'TFA:TW4, &YNV<H'NJ"ZL4FOHBHOI3KBSYHMJBO5)3&^ZK_6?N
M[NZJY VI+-T@8?*;O^6,WA4U9DX1?<R>I\G^!62SDNQ>L,+F!5H7G^SYA_[[
M,Y]_Y(S+_/./%9ZC3WN/WP.0\2-U"$&ZZ/[TEM-="D@7/D=?><U2S6J:>OC=
M6+JT9&6NRE8E>3C\V(=X.L I@:,JL5$0CO7%.$TX<RE_!5-T)1T=PKGNCCZ%
M3@GJ2[U'.##>)KO->GF441LT5.2&Z$IHHL;"U1Y^<+SGXFY?%AXBOQ+FX.&4
MX=>O8.29/=6"4/(1.C/X^M4K9!+'I$@%>7K-AQZA59:28PI4[0*8[+W55E5F
M;J#\";?M2 BPO=NAZTTHPNT00R;TD_C-\DS7J4-ACB'DQ.@5<\EE_!QXN]K2
M^[\8:6]U4>NV=ZL_NW'U1?1I(*#8V&LJ+B#TN<4_2J.TTEL :F>'[G=VU"?G
M=_3GYW?4M^C_'U!+ 0(4 PH    ( +-PBC==V2;:(A(  ))^   2        
M      "D@0    !E>&5C=71I;VY?;&]G+FAT;6Q02P4&      $  0!     
&4A(      
end

Mime
View raw message