harmony-alerts mailing list archives

Site index · List index
Message view « Date » · « Thread »
Top « Date » · « Thread »
From nom...@intel.com
Subject [build-test alert] FAILED Linux x86: JettyScenario
Date Mon, 10 Dec 2007 02:42:50 GMT
Jetty server JRE:

Apache Harmony Launcher : (c) Copyright 1991, 2007 The Apache Software Foundation or its licensors,
as applicable.
java version "1.5.0" 
pre-alpha : not complete or compatible
svn = r602572, (Dec  9 2007), Linux/ia32/gcc 4.1.0, release build
http://harmony.apache.org

Scenario framework JRE:

Apache Harmony Launcher : (c) Copyright 1991, 2007 The Apache Software Foundation or its licensors,
as applicable.
java version "1.5.0" 
pre-alpha : not complete or compatible
svn = r602572, (Dec  9 2007), Linux/ia32/gcc 4.1.0, release build
http://harmony.apache.org

================================================================================
Scenario results:

Testsuite: org.apache.harmony.test.jetty.JettyScenario
Tests run: 5, Failures: 1, Errors: 0, Time elapsed: 4.021 sec
------------- Standard Output ---------------
Setup completed.

==============================================================testInitialPage===
Starting initial page test case.
Loading page from server: http://localhost:7070/test/
Getting resource with name: initial_page.html
Found resource: /export/users.2/cc/cc-suites/build/checkouts/JettyScenario/resources/JettyScenario/initial_page.html
Saving content of downloaded page to: /export/users.2/cc/cc-suites/build/results/JettyScenario/JettyScenario/initial_page.html
Comparing page content with etalon: initial_page.html
Page is equal to etalon.
Initial page test case passed.

============================================================testStaticContent===
Starting static content page test case.
Loading page from server: http://localhost:7070/test/data.txt
Getting resource with name: static_content.txt
Found resource: /export/users.2/cc/cc-suites/build/checkouts/JettyScenario/resources/JettyScenario/static_content.txt
Saving content of downloaded page to: /export/users.2/cc/cc-suites/build/results/JettyScenario/JettyScenario/static_content.txt
Comparing page content with etalon: static_content.txt
Page have different number of lines than etalon.

=======================================================testSessionDumpServlet===
Starting servlet test case.
Loading page from server: http://localhost:7070/test/session/
Getting resource with name: session_dump.html
Found resource: /export/users.2/cc/cc-suites/build/checkouts/JettyScenario/resources/JettyScenario/session_dump.html
Saving content of downloaded page to: /export/users.2/cc/cc-suites/build/results/JettyScenario/JettyScenario/session_dump.html
Comparing page content with etalon: session_dump.html
Page is equal to etalon.
Session dump servlet page is OK.
Getting resource with name: session_dump_new.html
Found resource: /export/users.2/cc/cc-suites/build/checkouts/JettyScenario/resources/JettyScenario/session_dump_new.html
Saving content of downloaded page to: /export/users.2/cc/cc-suites/build/results/JettyScenario/JettyScenario/session_dump_new.html
Comparing page content with etalon: session_dump_new.html
Page is equal to etalon.
Session create page is OK.
Getting resource with name: session_dump_set.html
Found resource: /export/users.2/cc/cc-suites/build/checkouts/JettyScenario/resources/JettyScenario/session_dump_set.html
Saving content of downloaded page to: /export/users.2/cc/cc-suites/build/results/JettyScenario/JettyScenario/session_dump_set.html
Comparing page content with etalon: session_dump_set.html
Page is equal to etalon.
Session set page is OK.
Getting resource with name: session_dump_remove.html
Found resource: /export/users.2/cc/cc-suites/build/checkouts/JettyScenario/resources/JettyScenario/session_dump_remove.html
Saving content of downloaded page to: /export/users.2/cc/cc-suites/build/results/JettyScenario/JettyScenario/session_dump_remove.html
Comparing page content with etalon: session_dump_remove.html
Page is equal to etalon.
Session remove page is OK.
Getting resource with name: session_dump_invalidate.html
Found resource: /export/users.2/cc/cc-suites/build/checkouts/JettyScenario/resources/JettyScenario/session_dump_invalidate.html
Saving content of downloaded page to: /export/users.2/cc/cc-suites/build/results/JettyScenario/JettyScenario/session_dump_invalidate.html
Comparing page content with etalon: session_dump_invalidate.html
Page is equal to etalon.
Session invalidate page is OK.
Servlet test case passed.

===========================================================testRequestDumpJSP===
Starting JSP test case.
Loading page from server: http://localhost:7070/test/snoop.jsp
Getting resource with name: request_dump_JSP.html
Found resource: /export/users.2/cc/cc-suites/build/checkouts/JettyScenario/resources/JettyScenario/request_dump_JSP.html
Saving content of downloaded page to: /export/users.2/cc/cc-suites/build/results/JettyScenario/JettyScenario/request_dump_JSP.html
Comparing page content with etalon: request_dump_JSP.html
Page is equal to etalon.
JSP test case passed.

=====================================================testGZippedStaticContent===
Starting gzipped static content test case.
Loading page from server: http://localhost:7070/test/data.txt.gz
Unpacking content from archive.
Getting resource with name: static_content_ungzipped.txt
Found resource: /export/users.2/cc/cc-suites/build/checkouts/JettyScenario/resources/JettyScenario/static_content_ungzipped.txt
Saving content of downloaded page to: /export/users.2/cc/cc-suites/build/results/JettyScenario/JettyScenario/static_content_ungzipped.txt
Comparing page content with etalon: static_content_ungzipped.txt
Page is equal to etalon.
Gzipped static content test case passed.
------------- ---------------- ---------------

Testcase: testInitialPage took 1.141 sec
Testcase: testStaticContent took 0.236 sec
	FAILED
Content is not correct.
junit.framework.AssertionFailedError: Content is not correct.
	at org.apache.harmony.test.jetty.JettyScenario.testStaticContent(Unknown Source)
	at java.lang.reflect.VMReflection.invokeMethod(VMReflection.java)

Testcase: testSessionDumpServlet took 0.444 sec
Testcase: testRequestDumpJSP took 1.472 sec
Testcase: testGZippedStaticContent took 0.613 sec

================================================================================
Jetty server output:

2007-12-10 02:42:30.517::INFO:  Logging to STDERR via org.mortbay.log.StdErrLog
2007-12-10 02:42:30.826::INFO:  Statistics on = false for SelectChannelConnector @ 0.0.0.0:7070
2007-12-10 02:42:30.894::INFO:  jetty-6.1.2rc1
2007-12-10 02:42:31.005::INFO:  Deploy /export/users.2/cc/cc-suites/build/libs/jetty-6.1.2rc1/contexts/test.xml
-> org.mortbay.jetty.webapp.WebAppContext@29c18bcf{/test,/export/users.2/cc/cc-suites/build/libs/jetty-6.1.2rc1/webapps/test}
2007-12-10 02:42:31.039::INFO:  Deploy /export/users.2/cc/cc-suites/build/libs/jetty-6.1.2rc1/contexts/javadoc.xml
-> org.mortbay.jetty.servlet.Context@29c45c3d{/javadoc,file:/export/users.2/cc/cc-suites/build/libs/jetty-6.1.2rc1/javadoc/}
2007-12-10 02:42:35.056::WARN:  Unknown realm: Test JAAS Realm
2007-12-10 02:42:37.856::INFO:  Started SelectChannelConnector @ 0.0.0.0:7070

================================================================================

BUILD FAILED:
	Ant Error Message:
/export/users.2/cc/cc-suites/scripts/cc-exec-adaptor.xml:104: The following error occurred
while executing this line: /export/users.2/cc/cc-suites/adaptors/JettyScenario/adaptor.xml:183:
Jetty scenario failed

Date of build:	2007-12-10 08:42:18 +0600
Time to build:	27 seconds
Last changed:	12/10/2007 02:03:14
Last log entry:	snapshot

***********************************************************
Errors/Warnings:	(2)
            
The execution FAILED with the following exception:
The following error occurred while executing this line:
/export/users.2/cc/cc-suites/adaptors/JettyScenario/adaptor.xml:183: Jetty scenario failed

***********************************************************
Unit Tests: (5)
        
failure: testStaticContent org.apache.harmony.test.jetty.JettyScenario
Unit Test Error Details:	(1)
                
Test: testStaticContentClass: org.apache.harmony.test.jetty.JettyScenariojunit.framework.AssertionFailedError:
Content is not correct.
	at org.apache.harmony.test.jetty.JettyScenario.testStaticContent(Unknown Source)
	at java.lang.reflect.VMReflection.invokeMethod(VMReflection.java)

***********************************************************
Modifications since last successful build:	(1)
            
add cc-snapshot log20071210020314Lbuild.63 12/10/2007 02:03:14snapshot

begin 644 execution_log.zip
M4$L#! H    ( %=%BC=B$_?ON0$  #8#   2    97AE8W5T:6]N7VQO9RYH
M=&ULE5/+;MLP$+SK*_92Y&*1MMOFP2@"#"0!6O34^&;XP% KBP%%"N32CWY]
M2<M&ZP0H4$*"'KLS.YC=K3KJ35V]NN905X/'NI(0Z&#PX:IUELJ@?Z& V^FG
M^ZNZB$,C"<NPM:* ?%:X1[6&!8''K0[:6;B>SF^N[UA1E,KU@S98ZK:TB TV
MHBA\_ -5G5O#P]\'%HT<R'EHT_T=B0XO"JWTV@GX&2TPEK&K!@T2KN$Q/[7=
M"."X'YPG'@/ZP.9<J725(6K"P%^C-@WW&**AP"]H^5O^8L9M+D2]D/29>-0 
MB72+_IBQ>HM6TSJKL3G!^0V3@U0=LD[ZWMD#2R6)C;P7M2[PRY04(+L!7R?P
M++6)2:" V02>O'<^O4XGL-0] AHYA&0>?&'3^2R)41^8_D<&/"^^_7AZ+$:\
MQ^Q;8O'2AN1Z#Y1J"KB9S?MPZJ$+6%I'NM5*4FJQ>.>5&X8/7A7++BE/PQ$S
MXE03=IHZH!1IG3%NEU&X5SB,K,O+0+8!G%+1>VQ@UZ51.C.F,'4Z@-$61?'/
MYLMQHM[W_?2;[7LC9K>?Q5G]V:0V=02;HN*RKOAQ+?BX(ORX+[\!4$L! A0#
M"@    @ 5T6*-V(3]^^Y 0  -@,  !(              *2!     &5X96-U
C=&EO;E]L;V<N:'1M;%!+!08      0 ! $    #I 0     ! 
end

Mime
View raw message