harmony-alerts mailing list archives

Site index · List index
Message view « Date » · « Thread »
Top « Date » · « Thread »
From nom...@intel.com
Subject [build-test alert] FAILED Windows 2003 x86_64: vtsvm
Date Sun, 09 Dec 2007 11:13:56 GMT
svn.revision=602144
BUILD FAILED:
	Ant Error Message:
C:\cc\cc-suites\scripts\cc-exec-adaptor.xml:104: The following error occurred while executing
this line: C:\cc\cc-suites\adaptors\vtsvm\adaptor.xml:36: The following error occurred while
executing this line: C:\cc\cc-suites\scripts\framework.xml:892: The following error occurred
while executing this line: C:\cc\cc-suites\scripts\framework.xml:906: ... ------ ERROR: While
SVN path creation ------  tests/tools for BTI workspace:         C:\cc\cc-suites the following
error has occured: ------ SVN reported error while updating of:     tests/tools ------

Date of build:	2007-12-09 14:06:58 +0300
Time to build:	5 minutes 51 seconds
Last changed:	12/08/2007 19:41:13
Last log entry:	snapshot

***********************************************************
Errors/Warnings:	(4)
            
svn: PROPFIND request failed on '/repos/asf/harmony/enhanced/buildtest/branches/2.0/tests'
svn: PROPFIND of '/repos/asf/harmony/enhanced/buildtest/branches/2.0/tests': could not connect
to server (https://svn.apache.org)
The execution FAILED with the following exception:
The following error occurred while executing this line:
C:\cc\cc-suites\adaptors\vtsvm\adaptor.xml:36: The following error occurred while executing
this line:
C:\cc\cc-suites\scripts\framework.xml:892: The following error occurred while executing this
line:
C:\cc\cc-suites\scripts\framework.xml:906: ...
------
ERROR: While SVN path creation
------  tests/tools
for BTI workspace:
        C:\cc\cc-suites
the following error has occured:
------
SVN reported error while updating of:
    tests/tools
------

***********************************************************
Unit Tests: (4294)
        
All Tests Passed

***********************************************************
Modifications since last successful build:	(1)
            
add cc-snapshot log20071208194113Lbuild.51 12/08/2007 19:41:13snapshot

begin 644 execution_log.zip
M4$L#! H    ( )IQB3<G?$WU>0(  +4%   2    97AE8W5T:6]N7VQO9RYH
M=&ULM51;3]LP%'Z/U/]P7J:"ML3I)2GUNDJ,@M0- 0JP/:Q[<),38BV-,]M)
MZ7[]3E*0:,68M(N5A]CG\_>=F\\DLZM\.EFJ9#.=E!JG$P'&;G)\UTU585TC
M?R"'(__5V^ZTXU1E(BRZIBYXQ^DX!FU5TA\TZPO>8_P5KH3-.%@TUBRL4KG9
M-=]&YQPR:TO#&2,>3Y0BSM!3^HYI+)5APJ0L$WJEB@W#(A-%C E;5C)/&E*V
MU'22H6%]SV>M#'M&)FJHI%5Z Y%2]O>2O[Q^>SN?<>@-TM$X& 3N<+1<NOZ@
MY[OC<1"Z:2J&@8\)IN'1/D4MC50%A]#O#WJC7>N%2A ^RB+AD$B-<2.UB[@F
M%Y,JI^072J]$OFL]%\;""27G#A,XKFRF- =9BSH7B5Q)_0*:'.,0!/XH#%Y 
MS:C.'/J^/W+]T.V'T!OR7L#[(WCM#WT?#FXJ? -T_J$J6MCA+MGNKFD8N(HN
MK\[F%S/0^+VBPD$J9$Y2JH#NG]:^^Y*.2O^"F$.LJCRA[%OZ*PJJ$5@%!G6-
M&@Z>[Z?#_1XP54[-U^LXSDV&T)Q6EIH"SH[GYZ<S6$N;@25+JO)<K65Q1Y@8
MRP;#VRM/#%HK#2J.*ZTI:^N,DO?(2&:;20.Y+)#>XPE?Q#%]KJDD1;,0B2BI
MP\RBMJ9>/6Z]^U7.!R&'?Z9C8BU+>O>I%BM<*_VME3@:]_^[QMBG.#S/<]QV
M.:=1=!EQ^-P27W^Z@)+&$L0:19/:!Q3 D_GAI.31^YLY-)R&*HI\6TM:>SXX
M]IE@,F&V 6'"'[UHA)O^TY:"W,*VH;9SM+FKTH?Q^=23A]L=9\+$=,+:J<RV
M$YJUX_HG4$L! A0#"@    @ FG&)-R=\3?5Y @  M04  !(             
M *2!     &5X96-U=&EO;E]L;V<N:'1M;%!+!08      0 ! $    "I @  
"   ! 
end

Mime
View raw message