harmony-alerts mailing list archives

Site index · List index
Message view « Date » · « Thread »
Top « Date » · « Thread »
From nom...@intel.com
Subject [build-test alert] FAILED Linux x86_64: reliability
Date Sun, 09 Dec 2007 09:25:20 GMT
svn.revision=602144
BUILD FAILED:
	Ant Error Message:
/export/users/cc/cc-reliability/scripts/cc-exec-adaptor.xml:104: The following error occurred
while executing this line: /export/users/cc/cc-reliability/adaptors/reliability/adaptor.xml:98:
Some reliability tests failed on /export/users/cc/cc-reliability/build/checkouts/snapshot/hdk/jdk/jre/bin/java

Date of build:	2007-12-08 22:47:54 +0600
Time to build:	997 minutes 15 seconds
Last changed:	12/08/2007 22:18:56
Last log entry:	snapshot

***********************************************************
Errors/Warnings:	(59)
            
[java] Java Result: 104
[java] Java Result: 104
[java] Java Result: 104
[java] Java Result: 104
[java] Java Result: 104
[java] Java Result: 104
[java] Java Result: 104
[java] Java Result: 104
[java] Java Result: 104
[java] Java Result: 104
[java] Java Result: 104
[java] Java Result: 104
[java] Java Result: 104
[java] Java Result: 104
[java] Java Result: 104
[java] Java Result: 104
[java] Java Result: 104
[java] Java Result: 104
[java] Java Result: 104
[java] Java Result: 104
[java] Java Result: 104
[java] Java Result: 104
[java] Java Result: 104
[java] Java Result: 104
[java] Java Result: 104
[java] Java Result: 104
[java] Java Result: 104
[java] Java Result: 104
[java] Java Result: 104
[java] Java Result: 104
[java] Java Result: 104
[java] Java Result: 104
[java] Java Result: 139
[java] Java Result: 139
[java] Java Result: 104
[java] Java Result: 104
[java] Java Result: 104
[java] Java Result: 104
[java] Java Result: 104
[java] Java Result: 104
[java] Java Result: 104
[java] Java Result: 104
[java] Java Result: 104
[java] Java Result: 104
[java] Java Result: 104
[java] Java Result: 104
[java] Java Result: 104
[java] Java Result: 104
[java] Java Result: 104
[java] Java Result: 104
[java] Java Result: 104
[java] Java Result: 104
[java] Java Result: 104
[java] Java Result: 104
[java] Java Result: 104
[java] Java Result: 104
[java] Java Result: 104
[java] Java Result: 104
The execution FAILED with the following exception:
The following error occurred while executing this line:
/export/users/cc/cc-reliability/adaptors/reliability/adaptor.xml:98: Some reliability tests
failed on /export/users/cc/cc-reliability/build/checkouts/snapshot/hdk/jdk/jre/bin/java

***********************************************************
Unit Tests: (58)
        
error: test api.nio.charset.EncDecTest
error: test api.nio.charset.EncodingModesTest
Unit Test Error Details:	(2)
                
Test: testClass: api.nio.charset.EncDecTestSIGSEGV in VM code.
Stack trace:
  0: Jitrino::Node::prependInst(Jitrino::CFGInst*, Jitrino::CFGInst*) (walkers.cpp:-1)
  1: Jitrino::SSABuilder::createPhiInst(Jitrino::VarOpnd*, Jitrino::Node*) (walkers.cpp:-1)
  2: Jitrino::SSABuilder::insertPhi(Jitrino::DefSites AMP) (walkers.cpp:-1)
  3: ?? (??:-1)
  4: Jitrino::SSABuilder::convertSSA(Jitrino::MethodDesc AMP) (walkers.cpp:-1)
  5: ?? (??:-1)
  6: ?? (??:-1)
  7: Jitrino::DomFrontier::DomFrontier(Jitrino::MemoryManager AMP, Jitrino::DominatorTree
AMP, Jitrino::ControlFlowGraph*) (walkers.cpp:-1)
  8: std::basic_ostreamLTchar, std::char_traitsLTcharGT GT::put(char) (??:-1)
  9: ?? (??:-1)
 10: Jitrino::SSAPass::_run(Jitrino::IRManager AMP) (walkers.cpp:-1)
 11: ?? (??:-1)
 12: Jitrino::IAction::log(Jitrino::LogStream::SID) const (walkers.cpp:-1)
 13: ?? (??:-1)
 14: Jitrino::OptPass::run() (walkers.cpp:-1)
 15: ?? (??:-1)
 16: ?? (??:-1)
 17: Jitrino::runPipeline(Jitrino::CompilationContext*) (walkers.cpp:-1)
 18: ?? (??:-1)
 19: java/lang/EMThreadSupport.onTimeout()V (EMThreadSupport.java:-2)
 20: java/lang/EMThreadSupport.run()V (EMThreadSupport.java:68)
 21: java/lang/EMThreadSupport$1.run()V (EMThreadSupport.java:44)
 22: java/lang/Thread.run()V (Thread.java:657)
 23: java/lang/Thread.runImpl()V (Thread.java:668)
LTend of stack traceGT
Test: testClass: api.nio.charset.EncodingModesTestSIGSEGV in VM code.
Stack trace:
  0: Jitrino::Node::prependInst(Jitrino::CFGInst*, Jitrino::CFGInst*) (walkers.cpp:-1)
  1: Jitrino::SSABuilder::createPhiInst(Jitrino::VarOpnd*, Jitrino::Node*) (walkers.cpp:-1)
  2: Jitrino::SSABuilder::insertPhi(Jitrino::DefSites AMP) (walkers.cpp:-1)
  3: ?? (??:-1)
  4: Jitrino::SSABuilder::convertSSA(Jitrino::MethodDesc AMP) (walkers.cpp:-1)
  5: ?? (??:-1)
  6: ?? (??:-1)
  7: Jitrino::DomFrontier::DomFrontier(Jitrino::MemoryManager AMP, Jitrino::DominatorTree
AMP, Jitrino::ControlFlowGraph*) (walkers.cpp:-1)
  8: std::basic_ostreamLTchar, std::char_traitsLTcharGT GT::put(char) (??:-1)
  9: ?? (??:-1)
 10: Jitrino::SSAPass::_run(Jitrino::IRManager AMP) (walkers.cpp:-1)
 11: ?? (??:-1)
 12: Jitrino::IAction::log(Jitrino::LogStream::SID) const (walkers.cpp:-1)
 13: ?? (??:-1)
 14: Jitrino::OptPass::run() (walkers.cpp:-1)
 15: ?? (??:-1)
 16: ?? (??:-1)
 17: Jitrino::runPipeline(Jitrino::CompilationContext*) (walkers.cpp:-1)
 18: ?? (??:-1)
 19: java/lang/EMThreadSupport.onTimeout()V (EMThreadSupport.java:-2)
 20: java/lang/EMThreadSupport.run()V (EMThreadSupport.java:68)
 21: java/lang/EMThreadSupport$1.run()V (EMThreadSupport.java:44)
 22: java/lang/Thread.run()V (Thread.java:657)
 23: java/lang/Thread.runImpl()V (Thread.java:668)
LTend of stack traceGT

***********************************************************
Modifications since last successful build:	(1)
            
add cc-snapshot log20071208221856Lbuild.33 12/08/2007 22:18:56snapshot

begin 644 execution_log.zip
M4$L#! H    ( "5[B3=.'G*3"P4  /LA   2    97AE8W5T:6]N7VQO9RYH
M=&ULQ5I?3^,X$'_G4_CEM$\DT%T=T..0(&W9KLJR:F"1%B'D.M/&U+$CVRF4
M3[_CI' M%+8I3:YJ&SOV^#?_;,\X.8QM(HX.!RJ:'AVF&HX.*3%V*N#?3T,E
M[;;AC] D^SM__?/I:"M+(VIAVTQD<VM+9_A/W.?ZCD[H#3G)N(B&7&!_;/,>
M$K'0G!>3<<3U#0DTX$ 1P4J3^/"0*FW]S( V/F/XW=8@.!UPP>W4'[AQ?0TF
M$];X\RV-G9V][=W&]L[^;:/Q96\!;J'B^*$I]QYYVGS%%+D&%JL;TL^DY')$
M+!C;)+/NWG$D0 ?]X'/C N\O(2[*W_"?]',>FV1WYTM)E--?/.W*\\R&%E63
M5 G5E4/1@J$X!8N#@*T2JSZI?@D^<%*A6^D:<%!O+<XL5Y+J:=5X;GS4((HV
MFO9@ J_GU8;!?E*-<TQ #^3(QNNA+9U_8] 2A$?UR)29AW-DWG&:_CP+>C^H
MKLZAYO':#\#:<E('5"Z75BEHR\&LC_B>Z@'%::[<.U9JO(ZE<CI<.J-^$L8V
MNI=?W8UJ)%*#.V!V#28+0N\\OP1"2:C8R N '2ZIP,VU3DQ<\IF@QGRE)F8J
M^@#V>P9)V7BTNHL9JY'Q-<Q7$.)V9D :;OFD:E4^ ^(6(VO%BG'WC+!>#VB8
M7SXJYGLVM[E :]B\($0.*1M?:,IRD[^H5JB@ GZD599Z;9DEX/;D6C"]P@?"
MS*0@(S=@ LON5<](0 7+,,S"T"<OUR-^.)4LUDKRQP)Y5O_?P1O5HU\!'?=A
M"!HD RJCPNJYX[_=5,F<5?<N*%Q]:4^HI"-(0*ZS._]'C/HV%A)D6F6:P;GF
M>!,J$I.I),445J_!\1.I]XW;8%:NA,D5+&#AH93277_O!+UGW+5N55/Z]EB(
MGF)4@*G"QW/ %C">4-%1.J'VMFJT$=CC">4BSVP*K-M B36SJ:5JEUQY+*8:
MT\,RVI\C\P(E+>7R \'RZEAMR= $)9 ^'ZR/I%P$<X919QG1U@:\PO5Z%!25
M[S39=*@[@Y(X&TOE1_-TGCLKFU6\H+AVNN=AQ99?@JW2:0?K5?O<:V2'.I/\
MC*85V&B0#7%[+&VB&9EW,K5PDI>I$+AD6&AQC8E4E8IZC>TV$UHWZ(_,%H4Z
M8-U$+=!"P:L+XY=#7FF:GE9W#OHV:!V(+97A=E>[H!VAJ*T=%7/6VC%[N,_4
M#AK&2F]*U+?6SA6BS)>=WA< ^>^>;YK/DH$61@;?P0;"I1 ;8F.2>,8=0/Q!
M7]@M/WO#B1&5./!Z0>8%KA)0LTF#(\:P.(W,\]L2K,V3>4\GFA4F:@@)#PQ2
MA[?RIKY Y+6?BYOE:\1*\#-B3[E[)3%7@7 :;%3"%=:#S')19CJZ_B[A89G6
MZ"H;7AL,X+C<3LMP]$3CA;-"/M_ZX)XK;OK$P8#F;TRZE_W?:3VY[/9:)+P,
M@G88=BY["XT7RE)!+$^@20X.]DC"98;"D@."@BH9Y<GV=00"+-R0EKLZ?>SN
M[A$7IALRU"KYP -Z5-Z3QA@F&3?$I1H%PM\S!*L^.O[610S$/=?*G"))Y[C;
M:[?(/;<QL=@RQ!1?W3O0YU6@F9/,-6BM-%$L]\.(W,?(V=.(SCUB;HC@$II;
M?V*51C2U2B]R.;OIWHAH'NPW2:@2(',=<O]#75.$C0B*L)I"6 QLK#)4B9$T
M-;&R?AR-_3OWT^ /N/2=%VP=^O3HT,_?[?"+]SS\_*6/WU!+ 0(4 PH    (
M "5[B3=.'G*3"P4  /LA   2              "D@0    !E>&5C=71I;VY?
>;&]G+FAT;6Q02P4&      $  0!     .P4      
end

Mime
View raw message