harmony-alerts mailing list archives

Site index · List index
Message view « Date » · « Thread »
Top « Date » · « Thread »
From nom...@intel.com
Subject [build-test alert] FAILED Linux x86_64: jdktools-test debug
Date Sun, 09 Dec 2007 00:11:55 GMT

BUILD FAILED:
	Ant Error Message:
/export/users/cc/cc-common/scripts/cc-exec-adaptor.xml:104: The following error occurred while
executing this line: /export/users/cc/cc-common/adaptors/jdktools-test/adaptor.xml:23: The
following error occurred while executing this line: /export/users/cc/cc-common/build/checkouts/hdk/working_jdktools/build.xml:242:
The following error occurred while executing this line: /export/users/cc/cc-common/build/checkouts/hdk/working_jdktools/make/build-test.xml:97:
There were test errors.

Date of build:	2007-12-09 05:54:13 +0600
Time to build:	17 minutes 37 seconds
Last changed:	12/09/2007 03:14:39
Last log entry:	hdk

***********************************************************
Errors/Warnings:	(226)
            
Result: 1
========================================
Testing jdktools binaries...
========================================
Compiling JPDA tests
Since fork is false, ignoring memoryMaximumSize setting
----------
1. WARNING in /export/users/cc/cc-common/build/checkouts/hdk/working_jdktools/modules/jpda/test/common/unit/org/apache/harmony/jpda/tests/framework/DebuggeeRegister.java
(at line 58)
registered.add(debuggee);
^^^^^^^^^^^^^^^^^^^^^^^^
Type safety: The method add(Object) belongs to the raw type LinkedList. References to generic
type LinkedList<E> should be parameterized
----------
----------
2. WARNING in /export/users/cc/cc-common/build/checkouts/hdk/working_jdktools/modules/jpda/test/common/unit/org/apache/harmony/jpda/tests/framework/TestOptions.java
(at line 505)
internalProperties.put(name, value);
^^^^^^^^^^^^^^^^^^^^^^^^^^^^^^^^^^^
Type safety: The method put(Object, Object) belongs to the raw type HashMap. References to
generic type HashMap<K,V> should be parameterized
----------
----------
3. WARNING in /export/users/cc/cc-common/build/checkouts/hdk/working_jdktools/modules/jpda/test/common/unit/org/apache/harmony/jpda/tests/framework/jdwp/PacketDispatcher.java
(at line 114)
eventQueue.add(eventPacket);
^^^^^^^^^^^^^^^^^^^^^^^^^^^
Type safety: The method add(Object) belongs to the raw type List. References to generic type
List<E> should be parameterized
----------
4. WARNING in /export/users/cc/cc-common/build/checkouts/hdk/working_jdktools/modules/jpda/test/common/unit/org/apache/harmony/jpda/tests/framework/jdwp/PacketDispatcher.java
(at line 249)
replies.put(new Integer(replyPacket.getId()),
replyPacket);
^^^^^^^^^^^^^^^^^^^^^^^^^^^^^^^^^^^^^^^^^^^^^^^^^^^^^^^^^^^^^^^^^^^^^^^^^^^^^^^^^^^^^^^^^^
Type safety: The method put(Object, Object) belongs to the raw type Hashtable. References
to generic type Hashtable<K,V> should be parameterized
----------
5. WARNING in /export/users/cc/cc-common/build/checkouts/hdk/working_jdktools/modules/jpda/test/common/unit/org/apache/harmony/jpda/tests/framework/jdwp/PacketDispatcher.java
(at line 284)
commands.put(Id, command);
^^^^^^^^^^^^^^^^^^^^^^^^^
Type safety: The method put(Object, Object) belongs to the raw type Hashtable. References
to generic type Hashtable<K,V> should be parameterized
----------
6. WARNING in /export/users/cc/cc-common/build/checkouts/hdk/working_jdktools/modules/jpda/test/common/unit/org/apache/harmony/jpda/tests/framework/jdwp/PacketDispatcher.java
(at line 355)
commands.put(Id, command);
^^^^^^^^^^^^^^^^^^^^^^^^^
Type safety: The method put(Object, Object) belongs to the raw type Hashtable. References
to generic type Hashtable<K,V> should be parameterized
----------
----------
7. WARNING in /export/users/cc/cc-common/build/checkouts/hdk/working_jdktools/modules/jpda/test/common/unit/org/apache/harmony/jpda/tests/framework/jdwp/VmMirror.java
(at line 1834)
frames.add(frame);
^^^^^^^^^^^^^^^^^
Type safety: The method add(Object) belongs to the raw type ArrayList. References to generic
type ArrayList<E> should be parameterized
----------
8. WARNING in /export/users/cc/cc-common/build/checkouts/hdk/working_jdktools/modules/jpda/test/common/unit/org/apache/harmony/jpda/tests/framework/jdwp/VmMirror.java
(at line 1902)
vars.add(var);
^^^^^^^^^^^^^
Type safety: The method add(Object) belongs to the raw type ArrayList. References to generic
type ArrayList<E> should be parameterized
----------
9. WARNING in /export/users/cc/cc-common/build/checkouts/hdk/working_jdktools/modules/jpda/test/common/unit/org/apache/harmony/jpda/tests/framework/jdwp/VmMirror.java
(at line 2122)
fields.add(superClassFields.toArray()[i]);
^^^^^^^^^^^^^^^^^^^^^^^^^^^^^^^^^^^^^^^^^
Type safety: The method add(Object) belongs to the raw type ArrayList. References to generic
type ArrayList<E> should be parameterized
----------
10. WARNING in /export/users/cc/cc-common/build/checkouts/hdk/working_jdktools/modules/jpda/test/common/unit/org/apache/harmony/jpda/tests/framework/jdwp/VmMirror.java
(at line 2132)
fields.add(field);
^^^^^^^^^^^^^^^^^
Type safety: The method add(Object) belongs to the raw type ArrayList. References to generic
type ArrayList<E> should be parameterized
----------
----------
11. WARNING in /export/users/cc/cc-common/build/checkouts/hdk/working_jdktools/modules/jpda/test/common/unit/org/apache/harmony/jpda/tests/jdwp/DebuggerOnDemand/OnthowDebuggerLaunchDebuggee.java
(at line 94)
class ExceptionForDebugger extends Exception {
^^^^^^^^^^^^^^^^^^^^
The serializable class ExceptionForDebugger does not declare a static final serialVersionUID
field of type long
----------
----------
12. WARNING in /export/users/cc/cc-common/build/checkouts/hdk/working_jdktools/modules/jpda/test/common/unit/org/apache/harmony/jpda/tests/jdwp/Events/ClassUnloadDebuggee.java
(at line 32)
import java.util.LinkedList;
^^^^^^^^^^^^^^^^^^^^
The import java.util.LinkedList is never used
----------
13. WARNING in /export/users/cc/cc-common/build/checkouts/hdk/working_jdktools/modules/jpda/test/common/unit/org/apache/harmony/jpda/tests/jdwp/Events/ClassUnloadDebuggee.java
(at line 97)
boolean isOutOfMemory = false;
^^^^^^^^^^^^^
The local variable isOutOfMemory is never read
----------
14. WARNING in /export/users/cc/cc-common/build/checkouts/hdk/working_jdktools/modules/jpda/test/common/unit/org/apache/harmony/jpda/tests/jdwp/Events/ClassUnloadDebuggee.java
(at line 171)
public Class loadClass(String name) throws ClassNotFoundException {
^^^^^
Type safety: The return type Class for loadClass(String) from the type ClassUnloadDebuggee.CustomLoader
needs unchecked conversion to conform to Class<?> from the type ClassLoader
----------
15. WARNING in /export/users/cc/cc-common/build/checkouts/hdk/working_jdktools/modules/jpda/test/common/unit/org/apache/harmony/jpda/tests/jdwp/Events/ClassUnloadDebuggee.java
(at line 179)
public Class findClass(String name) throws ClassNotFoundException {
^^^^^
Type safety: The return type Class for findClass(String) from the type ClassUnloadDebuggee.CustomLoader
needs unchecked conversion to conform to Class<?> from the type ClassLoader
----------
----------
16. WARNING in /export/users/cc/cc-common/build/checkouts/hdk/working_jdktools/modules/jpda/test/common/unit/org/apache/harmony/jpda/tests/jdwp/Events/CombinedEvents002Test.java
(at line 100)
boolean expectColocatedEvents = (testedMethodStartCodeIndex == testedMethodEndCodeIndex);
^^^^^^^^^^^^^^^^^^^^^
The local variable expectColocatedEvents is never read
----------
----------
17. WARNING in /export/users/cc/cc-common/build/checkouts/hdk/working_jdktools/modules/jpda/test/common/unit/org/apache/harmony/jpda/tests/jdwp/Events/CombinedEvents003Test.java
(at line 53)
private boolean eventMethodExitReceived = false;
^^^^^^^^^^^^^^^^^^^^^^^
The field CombinedEvents003Test.eventMethodExitReceived is never read locally
----------
18. WARNING in /export/users/cc/cc-common/build/checkouts/hdk/working_jdktools/modules/jpda/test/common/unit/org/apache/harmony/jpda/tests/jdwp/Events/CombinedEvents003Test.java
(at line 76)
int EXPECTED_EVENTS_COUNT = EXPECTED_EVENTS_ARRAY.length;
^^^^^^^^^^^^^^^^^^^^^
The local variable EXPECTED_EVENTS_COUNT is never read
----------
----------
19. WARNING in /export/users/cc/cc-common/build/checkouts/hdk/working_jdktools/modules/jpda/test/common/unit/org/apache/harmony/jpda/tests/jdwp/Events/CombinedEventsTest.java
(at line 84)
int EXPECTED_EVENTS_COUNT = EXPECTED_EVENTS_ARRAY.length;
^^^^^^^^^^^^^^^^^^^^^
The local variable EXPECTED_EVENTS_COUNT is never read
----------
20. WARNING in /export/users/cc/cc-common/build/checkouts/hdk/working_jdktools/modules/jpda/test/common/unit/org/apache/harmony/jpda/tests/jdwp/Events/CombinedEventsTest.java
(at line 212)
int EXPECTED_EVENTS_COUNT = EXPECTED_EVENTS_ARRAY.length;
^^^^^^^^^^^^^^^^^^^^^
The local variable EXPECTED_EVENTS_COUNT is never read
----------
21. WARNING in /export/users/cc/cc-common/build/checkouts/hdk/working_jdktools/modules/jpda/test/common/unit/org/apache/harmony/jpda/tests/jdwp/Events/CombinedEventsTest.java
(at line 348)
int EXPECTED_EVENTS_COUNT = EXPECTED_EVENTS_ARRAY.length;
^^^^^^^^^^^^^^^^^^^^^
The local variable EXPECTED_EVENTS_COUNT is never read
----------
22. WARNING in /export/users/cc/cc-common/build/checkouts/hdk/working_jdktools/modules/jpda/test/common/unit/org/apache/harmony/jpda/tests/jdwp/Events/CombinedEventsTest.java
(at line 732)
String failureMessage = "## FAILURE during checking events! !";
^^^^^^^^^^^^^^
The local variable failureMessage is never read
----------
23. WARNING in /export/users/cc/cc-common/build/checkouts/hdk/working_jdktools/modules/jpda/test/common/unit/org/apache/harmony/jpda/tests/jdwp/Events/CombinedEventsTest.java
(at line 894)
String failureMessage = "## FAILURE during checking events !";
^^^^^^^^^^^^^^
The local variable failureMessage is never read
----------
----------
24. WARNING in /export/users/cc/cc-common/build/checkouts/hdk/working_jdktools/modules/jpda/test/common/unit/org/apache/harmony/jpda/tests/jdwp/Events/CombinedEventsTestCase.java
(at line 135)
long methodStartCodeIndex = lineTableReply.getNextValueAsLong();
^^^^^^^^^^^^^^^^^^^^
The local variable methodStartCodeIndex is never read
----------
25. WARNING in /export/users/cc/cc-common/build/checkouts/hdk/working_jdktools/modules/jpda/test/common/unit/org/apache/harmony/jpda/tests/jdwp/Events/CombinedEventsTestCase.java
(at line 187)
long methodStartCodeIndex = reply.getNextValueAsLong();
^^^^^^^^^^^^^^^^^^^^
The local variable methodStartCodeIndex is never read
----------
----------
26. WARNING in /export/users/cc/cc-common/build/checkouts/hdk/working_jdktools/modules/jpda/test/common/unit/org/apache/harmony/jpda/tests/jdwp/Events/ExceptionTest.java
(at line 188)
long frameID = reply.getNextValueAsFrameID();
^^^^^^^
The local variable frameID is never read
----------
----------
27. WARNING in /export/users/cc/cc-common/build/checkouts/hdk/working_jdktools/modules/jpda/test/common/unit/org/apache/harmony/jpda/tests/jdwp/ThreadReference/FramesTest.java
(at line 450)
frames.add(new FrameStruct(frameID, loc));
^^^^^^^^^^^^^^^^^^^^^^^^^^^^^^^^^^^^^^^^^
Type safety: The method add(Object) belongs to the raw type Vector. References to generic
type Vector<E> should be parameterized
----------
----------
28. WARNING in /export/users/cc/cc-common/build/checkouts/hdk/working_jdktools/modules/jpda/test/common/unit/org/apache/harmony/jpda/tests/jdwp/share/JDWPUnitDebuggeeProcessWrapper.java
(at line 233)
argv.add(val);
^^^^^^^^^^^^^
Type safety: The method add(Object) belongs to the raw type Vector. References to generic
type Vector<E> should be parameterized
----------
29. WARNING in /export/users/cc/cc-common/build/checkouts/hdk/working_jdktools/modules/jpda/test/common/unit/org/apache/harmony/jpda/tests/jdwp/share/JDWPUnitDebuggeeProcessWrapper.java
(at line 253)
return (String[])argv.toArray(args);
^^^^^^^^^^^^^^^^^^
Type safety: The method toArray(Object[]) belongs to the raw type Vector. References to generic
type Vector<E> should be parameterized
----------
29 problems (29 warnings)
JPDA exclude list: /export/users/cc/cc-common/build/checkouts/hdk/working_classlib/deploy/build/jdktools.jpda.exclude
Running JPDA tests
Debugger JVM=/export/users/cc/cc-common/build/checkouts/hdk/target/hdk/jdk/jre/bin/java
Debuggee JVM=/export/users/cc/cc-common/build/checkouts/hdk/target/hdk/jdk/jre/bin/java
SAMSA exclude list: /export/users/cc/cc-common/build/checkouts/hdk/working_classlib/deploy/build/jdktools.samsa.exclude
Running SAMSA tests
test.jre.home=/export/users/cc/cc-common/build/checkouts/hdk/target/hdk/jdk/jre
Run jdk/bin/java -version in /export/users/cc/cc-common/build/checkouts/hdk/working_jdktools/build/test_report
java version "1.5.0"
pre-alpha : not complete or compatible
svn = r602545, (Dec  9 2007), Linux/em64t/gcc 4.1.0, debug build
http://harmony.apache.org
Run jdk/bin/javac -version in /export/users/cc/cc-common/build/checkouts/hdk/working_jdktools/build/test_report
Run jdk/bin/javah in /export/users/cc/cc-common/build/checkouts/hdk/working_jdktools/build/test_report
Run jdk/bin/javadoc in /export/users/cc/cc-common/build/checkouts/hdk/working_jdktools/build/test_report
Run jdk/bin/jarsigner in /export/users/cc/cc-common/build/checkouts/hdk/working_jdktools/build/test_report
Run jdk/bin/keytool -help in /export/users/cc/cc-common/build/checkouts/hdk/working_jdktools/build/test_report
Compiling TOOLS tests
Since fork is false, ignoring memoryMaximumSize setting
----------
1. WARNING in /export/users/cc/cc-common/build/checkouts/hdk/working_jdktools/modules/tools/src/test/java/org/apache/harmony/tests/tools/javah/Test/Test01.java
(at line 24)
private static final long xxx2 = 1;
^^^^
The field Test01.xxx2 is never read locally
----------
1 problem (1 warning)
TOOLS exclude list: /export/users/cc/cc-common/build/checkouts/hdk/working_classlib/deploy/build/jdktools.tools.exclude
Running TOOLS tests
test.jre.home=/export/users/cc/cc-common/build/checkouts/hdk/target/hdk/jdk/jre
The test report is in /export/users/cc/cc-common/build/checkouts/hdk/working_jdktools/build/test_report/html/index.html
The execution FAILED with the following exception:
The following error occurred while executing this line:
/export/users/cc/cc-common/adaptors/jdktools-test/adaptor.xml:23: The following error occurred
while executing this line:
/export/users/cc/cc-common/build/checkouts/hdk/working_jdktools/build.xml:242: The following
error occurred while executing this line:
/export/users/cc/cc-common/build/checkouts/hdk/working_jdktools/make/build-test.xml:97: There
were test errors.

***********************************************************
Unit Tests: (160)
        
error: testNestedTypes001 org.apache.harmony.jpda.tests.jdwp.ReferenceType.NestedTypesTest
Unit Test Error Details:	(1)
                
Test: testNestedTypes001Class: org.apache.harmony.jpda.tests.jdwp.ReferenceType.NestedTypesTestorg.apache.harmony.jpda.tests.framework.TestErrorException:
org.apache.harmony.jpda.tests.framework.jdwp.exceptions.TimeoutException: Connection was closed
	at org.apache.harmony.jpda.tests.framework.jdwp.VmMirror.performCommand(VmMirror.java:1590)
	at org.apache.harmony.jpda.tests.jdwp.ReferenceType.NestedTypesTest.testNestedTypes001(NestedTypesTest.java:75)
	at java.lang.reflect.VMReflection.invokeMethod(VMReflection.java)
Caused by: org.apache.harmony.jpda.tests.framework.jdwp.exceptions.TimeoutException: Connection
was closed
	at org.apache.harmony.jpda.tests.framework.jdwp.PacketDispatcher.run(PacketDispatcher.java:600)

***********************************************************
Modifications since last successful build:	(1)
            
add cc-hdk log20071209031439Lbuild.467 12/09/2007 03:14:39hdk

begin 644 execution_log.zip
M4$L#! H    ( 'DQB3?9HLM->Q(  -Q^   2    97AE8W5T:6]N7VQO9RYH
M=&UL[5U[<]LXDO_;^A38V;I:N\JBWL]1?.6SG8TS<9RUG,Q>I7(IF(0D.A3!
M!4C;VM1\]^L&2$FD)$JR88^26E7BX@-H-/K7W6@T0; W"L?>4>^&.Y.C7B#8
M48\2&4X\]NIO ^Z'1>G^FW5)N_Q?O_[MJ! %#@U94=[YW4*A*%D8!<5;YUO(
MN2>+]Q(OQD725T4$%4ZCP'-MN.F00/!;9H?$IV-&7)^XXX"+T"(?XNO7/"B^
M8W?,PY(!$^&$.&S@^F[H<E_J8R S<(4,L7Z)/2"!4B29D"7;AG]%FX_'W"])
M6[A!*$LQ(9=)ZV'L$>H[A XIMIU;_29R/:=DCYC]C4= 9N1\*]US\<WUAU^3
M/I;&]!O+-% HA$R&W0+!WV=FC_@74GBUX:]P#76A!9*T0&Y<GPHD;5F;4RG8
M'J-^$1F11> ^B("A@LV#2?%6L.+ ]1B"8X_&W$E?B8MT=2^*<#]2=U1GQM\<
M5WPA)X(I+.&D^V0)ZD+8V%?!D-)+-"4+!76B)93&ZH2/ ]=##-Y^.#TFNOA+
M\%2R/2HEBQN[I7?4GN>FVJH0R2-A,Z+0(B%_]M;[KH_-037B2C*@GF2'Q!WZ
M7"!'8S;F8G)!']QQ-.Z#MR#@%U![4S2*TU_J<L4BOQ]?O3]__W<C=JCUM'0+
M/DCUIQ37CL!SE+@8EFA @49I1 5<GLP*RM) @"]"BJ53=A,-AXQ=L:$K0R8L
MY#7%-=FG(0$X&&FT#U)W]D1<B3D6=9Q])Z9U\"M)E_N_%;]4J>M) -*D Q9.
MNN1ZQ$#6X8B#XP+*ES?H*0_(#?.X/U1Z$$()0>])B-7>N?XWYKP#9BQRQ0; 
M$8"HB@V9SX1K9XOUSHZ('/'(<X F"2C* SH"@#J;(+GB<G4' 4;O>AFHH207
MVW(C Z[K@T!\ZGV8N7KPJ?LXBAV2.^I%@/-F,&^+.#:C$3\DZY!_0^7H@@:Y
ML,=E>K\=?GH.U&L[B/JM<Q^4/E#[&PM/71G0$&KDVG:E4L_@#Q&)'_XC8A%3
MQJU.-<4M<#=HX6MM^\E67?\9@*S6.PM>&D+1Q'K9/3D'PQXRL8_7)YJT-63A
MN;-_<'"8IKKF-T?A$;[@D;]G<2$AO?'86B>B2CW9C31^"C5K9_T%-@L3#:UG
MY\XAB2]LK!D_/+#-GP'86B,;"/P'V!676[N*]Z?QA2L$SQ_PV[6L!2LJ4HWV
MZG MP,9&]V,AZ&3M$#\M]<1QOOU#X]8I5S.XW5&A48.#7,Q^4+PZ/S)>U4HU
MB]? 99ZC$9,1S*U., WQ6E\,N9+:_L%G]\NC8ZH?%.=*^<<&NI8#M#K\61WJ
M*CQW)^&E4(QS7>+2/V48P)0N?1#H?7+Y'8U\>Y0DQ/*@[BS$OFC!Y.S!9BK3
M\IJ+A"AA#R&#X&EVDWQ/U]53J?5F/,)<HW"IY_X;@QJ2TZ;# 6R?A\1A4$HP
M@D\Y: BP#UR?>C&=3P #5/QX?DJ4=A(^T&J!*O44V'<G#:9@/\/,A2PI+_O1
M]SAU-L%XP9CU8QN"IU84NIXURR;^N@S1S2#-H8KY9Y_= 9X@NLT<Z.ZDHIX@
M^4XK(_D;X(91'^1Q&867@PN5@R>O=')^N>Q)OM0];H,90+CD*E-*$YZ*73"Z
MF=AW)W'T!+%76I6,W(/HQ@.?H>@0)*..]ONA>A2"B> #&'4$OY>ZS'L>ON:1
M[ZQQ=62#H4ZP,!*^=D>Z_0$7"SP<D('@8S7RS4IF>GP2R9"/W\$E0-1G#%PQ
MNGE @#DPD_7OM!?$L1'.H)4Q'BI*O?\^6M: IK618NQ.JN=)BI'-**84 X:4
M/UTQLCSLNF*LTI?=R2"E](6/;W )@CXMEZOX3"E78\KE%2X<>@1QZPE'!QPF
M%,&5[V.KS+E0$6X_I +*..S<=]@#>?6*S-\] ZB3>]F >JGWWW046,[;UJ/!
M*FQW)UN4AVUM';:-6M89"/<.Y$6F$".E&*H'-[QB-G/OP*3RQ^M<Y)9@IR/6
MY=ROXB %I4;?FVR$W>YDC)Z$7:NY^(R7G/WSP]G)]=GIU[-/9^^O^U]/+C^^
MOP:TLM>/KZZ._]?RF#\,1TM ?)3)+6_;F,GM3N)H-6SK,%MXSO*38%;=G63/
MX\&I5A9FB3\).CN6NGD4.K5Z=L'2SX+.CF98MD*GM9!AB></ ^IZD6 73$HZ
M9(#,+W_]*WE]?/[NX]49<2)51O4(#]18+_]"_O++)DF8=?ADFMX>F!U-P&PW
MXBRD-Q\/S([@L@JN'4W<+,!U0F7^%+V6?6B/.=SX@4%V.J6J7*-<KW#]#J[]
M><\>PD^XI.\8)K'^<'_IO.HQ#F\I!]N;U8[F4;;'J9W-;>;A)'X0>%:AMIO9
MC&D2:FT6HYT-'Q18ZM'@^>D*?%[KN[D0K?5V<0O&@-BQU,/U"#LT?2Y94C);
M.RS5&]FDTMQZ%5S7J,C 4!79X7XLPD,4[<&?_QS]$]SE(O=9K"[R3.O2=RQ_
M(>$&*[T]_?W#1ZB19&0_" Z"D;\+&@1K%A_6LDDH*H9W\1(8[V66P+P4I-4=
M2V(\&;N%!&*<TH]3]Y^_'"@PDX4P<")7I7FGOT>:;M*&QAI:W@&T\25 & 3&
MDNS#R3T5/@A%'A0* 0PW(/HB>["]R&'I-[C4>UOQ'9"S#!_]FI9:5N"Y-R4'
M1C<^B<LF^F.A.EAQ0^I5QV7ODUU%OK_D;;+D-B'3E0IO/UV\VI)1"%9@R%6'
MM_@?M!&BL-)4Y19:8<_1RN=;-)A95\%R+&TY5FPY6E2J]Q9:CO7)%6%$O0LH
M!(9@Q<LO<-A+4<0+DN!+I*1R2%[KF8_LDO(A.<,U2/KPVATSPCP:2.9T2=.J
MEFM$,OO)E&I6JU4W1*E9-D6IW6X:H52W*JV6$4I5J]ZL&N*I9DQ.K78N3[5-
M*54J5B67I^JFE%I6O=$PU+M&LV.$4LLJ5W.U8"LY57-5L[ZQ0M6M1J5B2E)5
M,S('+:^;X:D.'LJ,EH.<:KF4FAO+J6S5\E5J"S6O-(VYS;H95]ZV:O6V*9X:
MIH:71M.4DC=KN3QM;'F5NM6IF/)1]8Z9D0H$53;F-\MFU* .WL#,F%>UFBTS
MOAPDWC"FY(9Z!Y2JIGK7,!2O0&Q@3C--";S1-D?)D!MOYT<&V\2LIL3=KIA2
MRW;5F+SKNZ?@S8HI2HVVL>&@:4H+FOE!SS8\M4SI4[UE+"JH&@M]C<47#6/8
MF9L!Y4\VMC(68SI@+$HQI9:-ZJ/4LK)LCK\$N;/^]2;IGFFJ$+./UGNU@A4/
MU8,.]=C\[-2(7S#ET^LM<U[/F%\PIJ;&;-"4F&#64<UUZ1MG(:I5F,"8FJ;7
M#'F]NM7.GY]MDZ[I&)M;FPI;FFUS$V)C\Y>:J=&A53'%4[N6*_'&QCK> <,S
M-AY7S G*6&Q>,V/!;:MF*):JH$:9\745<\J)I/+]YG:D3(4O]?R@8XLI:+EC
M*LW=,#0C:EA50[./NM4R9,4P4K5S>[>QQ)LP>AHCE.LW-W^N4+,Z95,^RE@2
MN&YHI,*XVAA+9O2R:LRIF)L55T###;E?JV-L+FMNEM"HFY%XPZKG/ZS<IG>&
MIK-UJVQ,GSKFQJB5^=8ET]''KVQXP[VY-;$&(IIZPXP$FBVK9NBY0]/8D B4
M3(WWU889EH"2(1]6MQKY2Q*VP<[4'!ZTH&Q&H9"2L>X94RA4!#/P@6X:>MB#
MSP[-#$%-3/ I2H601_:H&+\<(M6.[MWD*E/UI]?8=&?W[IJE=/WCB_[+K*63
M="QGB^F0 YO[-@6YO.? @*NWQ=<[G^,6_CXGODHCDI ]A(?$X6J[!1Z.< /R
M=8OQ=+]4@=1]O&+="O#N?,R>ODPNVS9NZS]=.D>*R:X*!I:R+M]&'YI^8/87
M<JR&+/)&#UE$;^[$!.F2??N G/!@(MSA*"253@=4KUH&CX K0^-J?3X([W'G
M)+5O!55[5G!!7-!6S[69+T&W#@D%7 +UG0?<BS+5O.IMTME?*E;#*O]"4B5 
M"8O4"T846,*]FJ#K@<="ANW@,30*5%-5Y)V/KQTTR^#H&X=D_Y39A'04\P>'
MN+MY]%!BXV8]+ UM&Q>[66 ]:E=VHH25(C8*PZ!;2M;Y)D,\C/:Y"-HO".&9
M[;E@\^0MRE)_%0  +,,4$A"K637LW0S(\_^Y@#,1H#C*&E&+''L>4;?!RS!@
M\HXY5F[_1L_?K;?OSXOJHR-DQ-3F(]K"U6)BBJN,4Z53)Q_Q];?NLI L7IV+
M/; N\$L?G[G>]/T+Z>F=PG!;%GFTFO:T0NHJ(<4;SD-% E1R1'KX]TC9RM"%
M((^HJ_<N"!H7/$-_F>^@B^(9.LM_N,K:80,:>6&\HQG2RQ$!,+3 #/Y6,(3K
MT9^;'TYZ".%1BA!J'A+3GR*9\B.8XPIFHQ-W_2UXD@&SW8&KO@.3]359?AS2
MTXUP,9DRE?"3TKF$*SO^O@?H3:JQC=B;MD7N1ZX]6B0Z +^I7V;"=P2HF.2S
M[_I@"-E&SM7%^(,=<^JF7CN 1F@4\C&X3+6G1SY]\%\W'-Q*%B[<KDC$@R5:
M.TQ@\GE-&=8\+14UJ.WT<*>2"#@B_X+YD<9OKM)&XI48JRA!WDQP(S^P^PS^
M5TR"ND((E>O9'&Z_@&^#ADZQ(;W_H(M#&@H2N)^P,(<_&%*&B/ +<"CZNJD1
M\P)KB7O=FW'S/?:)?Y"WQU<JEB0 (TT#-U<>=<L=3);46ZU%<9T]^)&X.J",
M]!RL319J%[^QB01[8Z27''U5?G!/O4BH8Q6M>\G]='UU2;VS,B. IT! 75U?
M.4 5GF]=2H#! 0)3WI)K"ZQ/Z\Y5VR/)+D)P?5J5[(/K<-S! /1 [[>UI,F#
M#'M*<("(]LE?T<Z0OOKX5MRQ7.'"387S\NI6_[4*Q:U3B*65#UW 4OF6/=4E
M?N?"%((ZCOJ4%_7BP2#;H <&DJX!W67WR= !9P&7<B$:+-I,0%RC%,=Q9>#1
M"<%+X&9P RM)]L&"P%7":)CH);*>\)@17"@IZ5WWC[]^O'IWA"13N@0S,$">
MC@-TM",NW'"R4!W;UB3PZ*LRE'F-4!<2#*#8/+-I8B"'APGIC3B8,$@/(C=Y
M]+W;0UL^^D.)"6ZK: ZL& J1N)#J'Y8Z),P:6KJ@I0M:X$*Z%9AC+VE*VP+^
MG0(^;PBI]O;?7%]_P!B]?WGR6_]@@1H"*+2/U^,#4IOY?*1IBTD0\J&@ 8R7
MBBY,*1+PQ7**JFXOX2ZYJDAF+$PN9V(K'M2F>F/JTR$.ALL=P:RA-&\S#[":
M23 R4URB^]=*CF9-0\P$K&PLS>FT0AZKJ*3F>9VWT]7MS;,[7R6/W[%CGMMQ
MO.^&XP[GTP?9!M/235=:SO)"( #*@X,X*>+@_/S!0.KDM[CM2$4!J5L)6]^+
MO?CC%]I1_#%_18_Y>*VG#[^JKV0=_6%9%BF^[6$0EA3*X<+G]W[RB0V99F-/
M:8=@_]K;^[N>+;*46L"=*,FXS]5!"=G"V]L[P:/T&"'87>+G<8OH2&8KJXTP
M0ZBK#V;F'7)PMSP<:6V!V#M3TV&8S8"1Y(J-^1TC,,C!%$$-XTL=REY10PTU
MSM1!JFO8FAIPT?7*T.%1MCV8/P-=J-UG,/-0C&)9'5"X(IE?0T\S%5'5H-KU
M"()6I7:)YG(=(Q*0#4T0R=35VS=#[7.]CS--,;UOCV J?H"$*#GI7^D=(S(D
M@$';XSY(:OK-4"B-;"N)+996H8^#:%)_F(Z8,H4AJ/)#6\'W 0]1BEIV&485
M*@NQT%Y1,F^@ZT_U#6)3N!C'62DBRE5,TY; 5I98$CFFF<\)%_=FL?&G)#*>
M;U&)=[4IO4'P<JQ9.YGO&9-.IZ @C.CN96IH34NWF\DP;_"IS>O+RW?]^6]M
MQJ^ STHT_O/QRW7;&.@S*6R]EP&VM6P3 ]UC75CER-1G$=6?<B7_:VHK=CM-
M[:>O]H5Y>'BHDE>DLFZO@NEOZ58P>E_3F#%%\O&[EB9;"9#]2K*1P+I]!+12
MOL3##_WWI1Y^9(WM.1]^;/  ?28"W/-?QL_2(0#IHS/4^TCW*8">]P!]XW5)
M%:ME;(UI+?\1\\8\E:URI?.TIW@ZL"F"MRJR<1!.\%*<$)Q>R)YC,JZH \%N
M0?.OSZ 7@OI2;_,-G'9)O=-JC]/:@@:*/!!=!TWS.4+4$GZEO.3B9EP6'A8*
M$J;<X93O @Q LQ,M!24:H1.!A0(RB@-3I ([O;A#C\\J(\DQV:DVZ4OVPNJJ
M*G,W4.Z$VW8D!)C<_<CUIA3A=HBQ$CK(;B&G]]2A,,<0<FKTBLOD,GXXO%NM
MZ0U9#+>\N=PU%_7JG\>&^I[Z+%Y0#'5:BA^(B^[QC](Y;0I6H5>B1[V2^GA]
M27_(7NG+T?\#4$L! A0#"@    @ >3&)-]FBRTU[$@  W'X  !(         
M     *2!     &5X96-U=&EO;E]L;V<N:'1M;%!+!08      0 ! $    "K
%$@     ! 
end

Mime
View raw message