harmony-alerts mailing list archives

Site index · List index
Message view « Date » · « Thread »
Top « Date » · « Thread »
From nom...@intel.com
Subject [build-test alert] FAILED Linux x86_64: ehwa
Date Sat, 08 Dec 2007 21:08:18 GMT
svn.revision=602144
BUILD FAILED:
	Ant Error Message:
/export/users/cc/cc-suites/scripts/cc-exec-adaptor.xml:104: The following error occurred while
executing this line: /export/users/cc/cc-suites/adaptors/ehwa/adaptor.xml:82: The following
error occurred while executing this line: /export/users/cc/cc-suites/scripts/framework.xml:1079:
Java returned: 1

Date of build:	2007-12-09 02:58:19 +0600
Time to build:	9 minutes 54 seconds
Last changed:	12/08/2007 23:11:27
Last log entry:	snapshot

***********************************************************
Errors/Warnings:	(91)
            
[exec] Result: 25
[echo]
[echo]
[echo] ========================== EHWA.log =======================
[echo]
[echo] Eclipse Home = /export/users/cc/cc-suites/build/libs/eclipse-3.2.1-lnx-x86_64/eclipse
[echo] Tested JRE = /export/users/cc/cc-suites/build/checkouts/snapshot/hdk/jdk/jre
[echo] Tested JRE options for Eclipse launching =
[echo] Delay factor = 2
[echo]
[echo] --- Automated EHWA scenario for Eclipse 3.2.1 ---
[echo]
[echo] Start:
[echo]
[echo] Run Eclipse
[echo] Select workspace
[echo]  wait window 'Workspace Launcher' to appear ...
[echo]  window 'Workspace Launcher' appeared
[echo] Press 'OK' button
[echo]  wait window '' to close ...
[echo]  window '' successfully closed
[echo] Close Welcome page
[echo]  wait window 'Java - Eclipse SDK' to appear ...
[echo]  window 'Java - Eclipse SDK' appeared
[echo] Create new project
[echo]  wait window 'New' to appear ...
[echo]  window 'New' appeared
[echo] Select new Java project
[echo]  wait window 'New Java Project' to appear ...
[echo]  window 'New Java Project' appeared
[echo] Type 'EHWA' as project name
[echo] Press 'Finish' button
[echo]  wait window 'New Java Project ' to close ...
[echo]  window 'New Java Project ' successfully closed
[echo] Create new Java class
[echo]  wait window 'Java - Eclipse SDK' to appear ...
[echo]  window 'Java - Eclipse SDK' appeared
[echo]  wait window 'New' to appear ...
[echo]  window 'New' appeared
[echo] Select new Java class for 'EHWA' project
[echo]  wait window 'Java Class' to appear ...
[echo]  window 'Java Class' appeared
[echo] Type 'EHWA' as class name, press 'Finish' button
[echo] Select the 'public static void main(String[] args)' checkbox
[echo] Press 'Finish' button
[echo]  wait window 'New Java Class ' to close ...
[echo]  window 'New Java Class ' successfully closed
[echo] Put System.out.println("Hello, world"); into EHWA class
[echo]  wait window 'Java - EHWA.java - Eclipse SDK' to appear ...
[echo]  window 'Java - EHWA.java - Eclipse SDK' appeared
[echo] Save EHWA class
[echo] Run EHWA class
[echo] Exit Eclipse
[echo]  wait window 'Java - EHWA.java - Eclipse SDK' to appear ...
[echo]  window 'Java - EHWA.java - Eclipse SDK' appeared
[echo]  wait window 'Java - EHWA.java - Eclipse SDK ' to close ...
[echo] ERROR: Failed to close 'Java - EHWA.java - Eclipse SDK ' window during 240 sec!
[echo]
[echo] Print error screen picture:
[echo] 	Picture was saved to /export/users/cc/cc-suites/build/results/ehwa/20071209_0258/error.xwd.
Use 'xwud -in error.xwd' to view the saved file.
[echo]
[echo] Kill Eclipse:
[echo] 	Found 1 Eclipse processes
[echo] 	Process 0:
[echo] 	Eclipse process was killed
[echo]
[echo]
[echo] EHWA FAILED!
[echo]
[echo] ======================= eclipse.log =======================
[echo] Install location:
[echo]     file:/export/users/cc/cc-suites/build/libs/eclipse-3.2.1-lnx-x86_64/eclipse/
[echo] Configuration file:
[echo]     file:/export/users/cc/cc-suites/build/libs/eclipse-3.2.1-lnx-x86_64/eclipse/configuration/config.ini
loaded
[echo] Configuration location:
[echo]     file:/export/users/cc/cc-suites/build/libs/eclipse-3.2.1-lnx-x86_64/eclipse/configuration/
[echo] Framework located:
[echo]     file:/export/users/cc/cc-suites/build/libs/eclipse-3.2.1-lnx-x86_64/eclipse/plugins/org.eclipse.osgi_3.2.1.R32x_v20060919.jar
[echo] Framework classpath:
[echo]     file:/export/users/cc/cc-suites/build/libs/eclipse-3.2.1-lnx-x86_64/eclipse/plugins/org.eclipse.osgi_3.2.1.R32x_v20060919.jar
[echo] Debug options:
[echo]     file:/export/users/cc/cc-suites/build/checkouts/ehwa/.options not found
[echo] Time to load bundles: 106
[echo] Starting application: 3108
[echo] Application Started: 58937
[echo]
[echo] ===========================================================
BUILD FAILED
/export/users/cc/cc-suites/build/checkouts/ehwa/ehwa_run.xml:210: EHWA FAILED!
Total time: 9 minutes 52 seconds
The execution FAILED with the following exception:
The following error occurred while executing this line:
/export/users/cc/cc-suites/adaptors/ehwa/adaptor.xml:82: The following error occurred while
executing this line:
/export/users/cc/cc-suites/scripts/framework.xml:1079: Java returned: 1

***********************************************************
Unit Tests: (0)
        
No Tests Run: This project doesn't have any tests

***********************************************************
Modifications since last successful build:	(1)
            
add cc-snapshot log20071208231127Lbuild.53 12/08/2007 23:11:27snapshot

begin 644 execution_log.zip
M4$L#! H    (  <9B3=I\4TF) 8  $H@   2    97AE8W5T:6]N7VQO9RYH
M=&ULU5I;;]I*$'XNOV).I2-:J=A FAM-(Z6Y*+WH-"*I^A!5T;(>8)/%:WG7
M7,ZO/[-KDP2"#::Y]%@)"O'LSC?CN7P[L-<W [F_UU'!9'\OBG%_CX$V$XD?
MJUT5FIH6_V(+=NI_?ZCN5Y(H8 9K>ABV*I4XH5>PU^4U&[)?\"D1,N@*2?+8
M'[$K$O#& SDC,_/FP0[IW\C[ZA?4:C5H)R$<G_X\ ,TQ9+%0H$(P?82NDE*-
M1-@#KL*NZ"4Q,X+NT:+<#2]0&PS@2_L8/H*/XTC%QD\TQMKGG'YJ.A$&M=^Q
M9OB\C_Q&)4;[.F21[BOC]X,;_]K^QKB*$A592)J4Y4H?<RDBC7"J!K@**"DZ
MVL=T46W#:WJ-F@S'M?'.UM76^^F-7&U'*-D$NHP;%9.V9I'KU[OR'[5SI\<2
MHX1I+1,SSHD>^7FI:&;SJG+>D#Q+3R4_[ XELM &UO39S :8YWFY2\_9$('1
M@F@"JINS@5&/])C]F7V]#N,W2;0 FX5#9M&KM6J[ 39#]3/CN Q0HD$7@V@L
MD$#$: -Q\B0P?!7W;I^YTCWQ1P'B*D:/BI\1@P?9^J+ TOK^XI \C<;JT;FI
MUL:!&M[/TI&*;W3$."[*T-\RX*X1V*;FWRHJKB"01*X)@JUE5EUAY3B,D3E<
M,>I$&GT/WZ)EEX,;$LB64;>A-ZWEAF1[IV8TZ_7M1K.^>U5O;N[D5S3#8C/;
M@7-ES\ALC>] (_X.%M]J\Z3J48^/(4##A%P8!V/DU$#;[>_M%IR0$/F!:AJ7
MBJ*A^H4DH>:0>]?9WUFDG!]]A2H0=PC4"((DMFYOOJ\3;OX7, .> W651>:5
M"UDODB!%B"2XL? I.C!M9U0+FIOYW2@B?<;K$EYO@%JS'N:WHMP;^7<^YEYP
MZ]<\@?(XGI>^O!1_LW$XM52R).1]&S(%_IKG66MXUI+? R)+ Y??LQ3X/A[G
M1"==7H=+[M8:"QTKSP#D[TZEEIM[=3D_FD=,F&E"5G_>+OCF?(UQU>8UBR)D
MQ46T<(MT/0;YY8M*DH;J]Z]5Z"3&$%-;$7#UKNRLA*X*.N&<E'43*2?IRB!?
MV:';^2=*;I,LHH*Q*K O#^K><D_.DL64*ZY$%>\7].4^6 1MZ1-*NQV$.*(J
MJJYM=*WHB7]P5#J(W)JEF+(HMYB<3>6!I>O.TG7KH)S;8"GDBTE$#=*6%!+6
MMXA#-BB(K"P[3D0H=+]LALR#A+(ILV"#<CET%SEN&RX96?.$:?08X?Y2(9PZ
MQS:9+$A*QK3;Y-!NLIZ?LJ5EXSB%;:/X'2$N%:V9!^Q<J1HE'2DX:$-\G,-0
MB0 &3(1OSHTEBI>_@,4]_;::3A4Z:OS4*>.\L7["3)>72I>SQ,#YA'C0P","
MY3G**L,WKT]12O7.MG09O'[[ >C?*N4F:R748FZ^=G+E;;<\ >S89A4S;J>1
M2^2.QV3M4H+T9SNE#+I5P_.Q#VOEF>N9#67 .*;JIGF,&$(DN$EB+.#!K\Y2
M$7*)!DW!$I1F1'-'7 ? &X\"#WY8!XQ'20 U$<+M#>?1H: TME4I56JYF+>&
MT5^%E%.'%IEYHI(P(,XW]3W5?5LSL"#27YVE,E OVGAN0^?'&P)55(/6.(S:
MS#PY^/SM^*@@-,J?G6$Z'%OK[/PYI%9"_I>*N]E6_FG?7N[#DT<:J>6SH9EY
MM%/Y;*!FYWSI.X\Z)/F'!47<?P;S\SMS%G>NVI.8^(<]\J80,7@^A)%,>B+4
M#P;?V0"KO=$<7PVI#&W5=QN[5&;C%8QP?2YBIO]_-.,(.TEO.L1Y# /F!L'>
M=#X4*D-TF6IG/E45 W>*MD%.1# ,).H6-.I;Q;,9V^RH41,?3:,=-AKU_%GM
MP9UDNIRB#S9W=C>V'W6.N/3*GWU^^O'YVU%6HF=NE'7]_4^76\T&-9_[Q3\?
MP(6B6@SV4Y<6[,) A FI@,VFI1,J#'2E<D'=U@YS$^?&=$.B'Z8_]ZDSCCE&
M:0FZF+WAN(7B/(F)7L&H;P<HV8YTV_2%=I/D5J7 :!:PR*@XLS9[YXS=:;;@
M"102%Q(1>;<[37VGK%'?WFVEYX@8B0&%-J(:E3V?[>_Y[JL"?OJU =]]A^ _
M4$L! A0#"@    @ !QF)-VGQ328D!@  2B   !(              *2!    
I &5X96-U=&EO;E]L;V<N:'1M;%!+!08      0 ! $    !4!@     ! 
end

Mime
View raw message