harmony-alerts mailing list archives

Site index · List index
Message view « Date » · « Thread »
Top « Date » · « Thread »
From nom...@intel.com
Subject [build-test alert] FAILED Windows 2003 x86: jdktools-test debug
Date Sat, 08 Dec 2007 17:02:10 GMT

BUILD FAILED:
	Ant Error Message:
D:\cc\cc-common\scripts\cc-exec-adaptor.xml:104: The following error occurred while executing
this line: D:\cc\cc-common\adaptors\jdktools-test\adaptor.xml:28: The following error occurred
while executing this line: D:\cc\cc-common\build\checkouts\hdk\working_jdktools\build.xml:242:
The following error occurred while executing this line: D:\cc\cc-common\build\checkouts\hdk\working_jdktools\make\build-test.xml:97:
There were test errors.

Date of build:	2007-12-08 22:37:30 +0600
Time to build:	24 minutes 32 seconds
Last changed:	12/08/2007 20:21:34
Last log entry:	hdk

***********************************************************
Errors/Warnings:	(229)
            
Result: 1
[cc-ant]: Test Suite 'jdktools-test' execution. Repository updated: ${repository.updated}
[cc-ant]: Check for 'run' failure of hdk = ${hdk.parameters.run.failed}
[cc-ant]: Result: failed.superiors = '${failed.superiors}'
========================================
Testing jdktools binaries...
========================================
Compiling JPDA tests
Since fork is false, ignoring memoryMaximumSize setting
----------
1. WARNING in D:\cc\cc-common\build\checkouts\hdk\working_jdktools\modules\jpda\test\common\unit\org\apache\harmony\jpda\tests\framework\DebuggeeRegister.java
(at line 58)
registered.add(debuggee);
^^^^^^^^^^^^^^^^^^^^^^^^
Type safety: The method add(Object) belongs to the raw type LinkedList. References to generic
type LinkedList<E> should be parameterized
----------
----------
2. WARNING in D:\cc\cc-common\build\checkouts\hdk\working_jdktools\modules\jpda\test\common\unit\org\apache\harmony\jpda\tests\framework\TestOptions.java
(at line 505)
internalProperties.put(name, value);
^^^^^^^^^^^^^^^^^^^^^^^^^^^^^^^^^^^
Type safety: The method put(Object, Object) belongs to the raw type HashMap. References to
generic type HashMap<K,V> should be parameterized
----------
----------
3. WARNING in D:\cc\cc-common\build\checkouts\hdk\working_jdktools\modules\jpda\test\common\unit\org\apache\harmony\jpda\tests\framework\jdwp\PacketDispatcher.java
(at line 114)
eventQueue.add(eventPacket);
^^^^^^^^^^^^^^^^^^^^^^^^^^^
Type safety: The method add(Object) belongs to the raw type List. References to generic type
List<E> should be parameterized
----------
4. WARNING in D:\cc\cc-common\build\checkouts\hdk\working_jdktools\modules\jpda\test\common\unit\org\apache\harmony\jpda\tests\framework\jdwp\PacketDispatcher.java
(at line 249)
replies.put(new Integer(replyPacket.getId()),
replyPacket);
^^^^^^^^^^^^^^^^^^^^^^^^^^^^^^^^^^^^^^^^^^^^^^^^^^^^^^^^^^^^^^^^^^^^^^^^^^^^^^^^^^^^^^^^^^^
Type safety: The method put(Object, Object) belongs to the raw type Hashtable. References
to generic type Hashtable<K,V> should be parameterized
----------
5. WARNING in D:\cc\cc-common\build\checkouts\hdk\working_jdktools\modules\jpda\test\common\unit\org\apache\harmony\jpda\tests\framework\jdwp\PacketDispatcher.java
(at line 284)
commands.put(Id, command);
^^^^^^^^^^^^^^^^^^^^^^^^^
Type safety: The method put(Object, Object) belongs to the raw type Hashtable. References
to generic type Hashtable<K,V> should be parameterized
----------
6. WARNING in D:\cc\cc-common\build\checkouts\hdk\working_jdktools\modules\jpda\test\common\unit\org\apache\harmony\jpda\tests\framework\jdwp\PacketDispatcher.java
(at line 355)
commands.put(Id, command);
^^^^^^^^^^^^^^^^^^^^^^^^^
Type safety: The method put(Object, Object) belongs to the raw type Hashtable. References
to generic type Hashtable<K,V> should be parameterized
----------
----------
7. WARNING in D:\cc\cc-common\build\checkouts\hdk\working_jdktools\modules\jpda\test\common\unit\org\apache\harmony\jpda\tests\framework\jdwp\VmMirror.java
(at line 1834)
frames.add(frame);
^^^^^^^^^^^^^^^^^
Type safety: The method add(Object) belongs to the raw type ArrayList. References to generic
type ArrayList<E> should be parameterized
----------
8. WARNING in D:\cc\cc-common\build\checkouts\hdk\working_jdktools\modules\jpda\test\common\unit\org\apache\harmony\jpda\tests\framework\jdwp\VmMirror.java
(at line 1902)
vars.add(var);
^^^^^^^^^^^^^
Type safety: The method add(Object) belongs to the raw type ArrayList. References to generic
type ArrayList<E> should be parameterized
----------
9. WARNING in D:\cc\cc-common\build\checkouts\hdk\working_jdktools\modules\jpda\test\common\unit\org\apache\harmony\jpda\tests\framework\jdwp\VmMirror.java
(at line 2122)
fields.add(superClassFields.toArray()[i]);
^^^^^^^^^^^^^^^^^^^^^^^^^^^^^^^^^^^^^^^^^
Type safety: The method add(Object) belongs to the raw type ArrayList. References to generic
type ArrayList<E> should be parameterized
----------
10. WARNING in D:\cc\cc-common\build\checkouts\hdk\working_jdktools\modules\jpda\test\common\unit\org\apache\harmony\jpda\tests\framework\jdwp\VmMirror.java
(at line 2132)
fields.add(field);
^^^^^^^^^^^^^^^^^
Type safety: The method add(Object) belongs to the raw type ArrayList. References to generic
type ArrayList<E> should be parameterized
----------
----------
11. WARNING in D:\cc\cc-common\build\checkouts\hdk\working_jdktools\modules\jpda\test\common\unit\org\apache\harmony\jpda\tests\jdwp\DebuggerOnDemand\OnthowDebuggerLaunchDebuggee.java
(at line 94)
class ExceptionForDebugger extends Exception {
^^^^^^^^^^^^^^^^^^^^
The serializable class ExceptionForDebugger does not declare a static final serialVersionUID
field of type long
----------
----------
12. WARNING in D:\cc\cc-common\build\checkouts\hdk\working_jdktools\modules\jpda\test\common\unit\org\apache\harmony\jpda\tests\jdwp\Events\ClassUnloadDebuggee.java
(at line 32)
import java.util.LinkedList;
^^^^^^^^^^^^^^^^^^^^
The import java.util.LinkedList is never used
----------
13. WARNING in D:\cc\cc-common\build\checkouts\hdk\working_jdktools\modules\jpda\test\common\unit\org\apache\harmony\jpda\tests\jdwp\Events\ClassUnloadDebuggee.java
(at line 97)
boolean isOutOfMemory = false;
^^^^^^^^^^^^^
The local variable isOutOfMemory is never read
----------
14. WARNING in D:\cc\cc-common\build\checkouts\hdk\working_jdktools\modules\jpda\test\common\unit\org\apache\harmony\jpda\tests\jdwp\Events\ClassUnloadDebuggee.java
(at line 171)
public Class loadClass(String name) throws ClassNotFoundException {
^^^^^
Type safety: The return type Class for loadClass(String) from the type ClassUnloadDebuggee.CustomLoader
needs unchecked conversion to conform to Class<?> from the type ClassLoader
----------
15. WARNING in D:\cc\cc-common\build\checkouts\hdk\working_jdktools\modules\jpda\test\common\unit\org\apache\harmony\jpda\tests\jdwp\Events\ClassUnloadDebuggee.java
(at line 179)
public Class findClass(String name) throws ClassNotFoundException {
^^^^^
Type safety: The return type Class for findClass(String) from the type ClassUnloadDebuggee.CustomLoader
needs unchecked conversion to conform to Class<?> from the type ClassLoader
----------
----------
16. WARNING in D:\cc\cc-common\build\checkouts\hdk\working_jdktools\modules\jpda\test\common\unit\org\apache\harmony\jpda\tests\jdwp\Events\CombinedEvents002Test.java
(at line 100)
boolean expectColocatedEvents = (testedMethodStartCodeIndex == testedMethodEndCodeIndex);
^^^^^^^^^^^^^^^^^^^^^
The local variable expectColocatedEvents is never read
----------
----------
17. WARNING in D:\cc\cc-common\build\checkouts\hdk\working_jdktools\modules\jpda\test\common\unit\org\apache\harmony\jpda\tests\jdwp\Events\CombinedEvents003Test.java
(at line 53)
private boolean eventMethodExitReceived = false;
^^^^^^^^^^^^^^^^^^^^^^^
The field CombinedEvents003Test.eventMethodExitReceived is never read locally
----------
18. WARNING in D:\cc\cc-common\build\checkouts\hdk\working_jdktools\modules\jpda\test\common\unit\org\apache\harmony\jpda\tests\jdwp\Events\CombinedEvents003Test.java
(at line 76)
int EXPECTED_EVENTS_COUNT = EXPECTED_EVENTS_ARRAY.length;
^^^^^^^^^^^^^^^^^^^^^
The local variable EXPECTED_EVENTS_COUNT is never read
----------
----------
19. WARNING in D:\cc\cc-common\build\checkouts\hdk\working_jdktools\modules\jpda\test\common\unit\org\apache\harmony\jpda\tests\jdwp\Events\CombinedEventsTest.java
(at line 84)
int EXPECTED_EVENTS_COUNT = EXPECTED_EVENTS_ARRAY.length;
^^^^^^^^^^^^^^^^^^^^^
The local variable EXPECTED_EVENTS_COUNT is never read
----------
20. WARNING in D:\cc\cc-common\build\checkouts\hdk\working_jdktools\modules\jpda\test\common\unit\org\apache\harmony\jpda\tests\jdwp\Events\CombinedEventsTest.java
(at line 212)
int EXPECTED_EVENTS_COUNT = EXPECTED_EVENTS_ARRAY.length;
^^^^^^^^^^^^^^^^^^^^^
The local variable EXPECTED_EVENTS_COUNT is never read
----------
21. WARNING in D:\cc\cc-common\build\checkouts\hdk\working_jdktools\modules\jpda\test\common\unit\org\apache\harmony\jpda\tests\jdwp\Events\CombinedEventsTest.java
(at line 348)
int EXPECTED_EVENTS_COUNT = EXPECTED_EVENTS_ARRAY.length;
^^^^^^^^^^^^^^^^^^^^^
The local variable EXPECTED_EVENTS_COUNT is never read
----------
22. WARNING in D:\cc\cc-common\build\checkouts\hdk\working_jdktools\modules\jpda\test\common\unit\org\apache\harmony\jpda\tests\jdwp\Events\CombinedEventsTest.java
(at line 732)
String failureMessage = "## FAILURE during checking events! !";
^^^^^^^^^^^^^^
The local variable failureMessage is never read
----------
23. WARNING in D:\cc\cc-common\build\checkouts\hdk\working_jdktools\modules\jpda\test\common\unit\org\apache\harmony\jpda\tests\jdwp\Events\CombinedEventsTest.java
(at line 894)
String failureMessage = "## FAILURE during checking events !";
^^^^^^^^^^^^^^
The local variable failureMessage is never read
----------
----------
24. WARNING in D:\cc\cc-common\build\checkouts\hdk\working_jdktools\modules\jpda\test\common\unit\org\apache\harmony\jpda\tests\jdwp\Events\CombinedEventsTestCase.java
(at line 135)
long methodStartCodeIndex = lineTableReply.getNextValueAsLong();
^^^^^^^^^^^^^^^^^^^^
The local variable methodStartCodeIndex is never read
----------
25. WARNING in D:\cc\cc-common\build\checkouts\hdk\working_jdktools\modules\jpda\test\common\unit\org\apache\harmony\jpda\tests\jdwp\Events\CombinedEventsTestCase.java
(at line 187)
long methodStartCodeIndex = reply.getNextValueAsLong();
^^^^^^^^^^^^^^^^^^^^
The local variable methodStartCodeIndex is never read
----------
----------
26. WARNING in D:\cc\cc-common\build\checkouts\hdk\working_jdktools\modules\jpda\test\common\unit\org\apache\harmony\jpda\tests\jdwp\Events\ExceptionTest.java
(at line 188)
long frameID = reply.getNextValueAsFrameID();
^^^^^^^
The local variable frameID is never read
----------
----------
27. WARNING in D:\cc\cc-common\build\checkouts\hdk\working_jdktools\modules\jpda\test\common\unit\org\apache\harmony\jpda\tests\jdwp\ThreadReference\FramesTest.java
(at line 450)
frames.add(new FrameStruct(frameID, loc));
^^^^^^^^^^^^^^^^^^^^^^^^^^^^^^^^^^^^^^^^^
Type safety: The method add(Object) belongs to the raw type Vector. References to generic
type Vector<E> should be parameterized
----------
----------
28. WARNING in D:\cc\cc-common\build\checkouts\hdk\working_jdktools\modules\jpda\test\common\unit\org\apache\harmony\jpda\tests\jdwp\share\JDWPUnitDebuggeeProcessWrapper.java
(at line 233)
argv.add(val);
^^^^^^^^^^^^^
Type safety: The method add(Object) belongs to the raw type Vector. References to generic
type Vector<E> should be parameterized
----------
29. WARNING in D:\cc\cc-common\build\checkouts\hdk\working_jdktools\modules\jpda\test\common\unit\org\apache\harmony\jpda\tests\jdwp\share\JDWPUnitDebuggeeProcessWrapper.java
(at line 253)
return (String[])argv.toArray(args);
^^^^^^^^^^^^^^^^^^
Type safety: The method toArray(Object[]) belongs to the raw type Vector. References to generic
type Vector<E> should be parameterized
----------
29 problems (29 warnings)
JPDA exclude list: D:\cc\cc-common\build\checkouts\hdk\working_classlib\deploy\build\jdktools.jpda.exclude
Running JPDA tests
Debugger JVM=D:\cc\cc-common\build\checkouts\hdk\target\hdk\jdk\jre/bin/java
Debuggee JVM=D:\cc\cc-common\build\checkouts\hdk\target\hdk\jdk\jre/bin/java
SAMSA exclude list: D:\cc\cc-common\build\checkouts\hdk\working_classlib\deploy\build\jdktools.samsa.exclude
Running SAMSA tests
test.jre.home=D:\cc\cc-common\build\checkouts\hdk\target\hdk\jdk\jre
Run jdk/bin/java -version in D:\cc\cc-common\build\checkouts\hdk\working_jdktools\build\test_report
java version "1.5.0"
pre-alpha : not complete or compatible
svn = r602475, (Dec  8 2007), Windows/ia32/msvc 1310, debug build
http://harmony.apache.org
Run jdk/bin/javac -version in D:\cc\cc-common\build\checkouts\hdk\working_jdktools\build\test_report
Run jdk/bin/javah in D:\cc\cc-common\build\checkouts\hdk\working_jdktools\build\test_report
Run jdk/bin/javadoc in D:\cc\cc-common\build\checkouts\hdk\working_jdktools\build\test_report
Run jdk/bin/jarsigner in D:\cc\cc-common\build\checkouts\hdk\working_jdktools\build\test_report
Run jdk/bin/keytool -help in D:\cc\cc-common\build\checkouts\hdk\working_jdktools\build\test_report
Compiling TOOLS tests
Since fork is false, ignoring memoryMaximumSize setting
----------
1. WARNING in D:\cc\cc-common\build\checkouts\hdk\working_jdktools\modules\tools\src\test\java\org\apache\harmony\tests\tools\javah\Test\Test01.java
(at line 24)
private static final long xxx2 = 1;
^^^^
The field Test01.xxx2 is never read locally
----------
1 problem (1 warning)
TOOLS exclude list: D:\cc\cc-common\build\checkouts\hdk\working_classlib\deploy\build\jdktools.tools.exclude
Running TOOLS tests
test.jre.home=D:\cc\cc-common\build\checkouts\hdk\target\hdk\jdk\jre
The test report is in D:\cc\cc-common\build\checkouts\hdk\working_jdktools\build\test_report\html\index.html
The execution FAILED with the following exception:
The following error occurred while executing this line:
D:\cc\cc-common\adaptors\jdktools-test\adaptor.xml:28: The following error occurred while
executing this line:
D:\cc\cc-common\build\checkouts\hdk\working_jdktools\build.xml:242: The following error occurred
while executing this line:
D:\cc\cc-common\build\checkouts\hdk\working_jdktools\make\build-test.xml:97: There were test
errors.

***********************************************************
Unit Tests: (160)
        
error: testInvokeMethod002 org.apache.harmony.jpda.tests.jdwp.ObjectReference.InvokeMethodTest
Unit Test Error Details:	(1)
                
Test: testInvokeMethod002Class: org.apache.harmony.jpda.tests.jdwp.ObjectReference.InvokeMethodTestorg.apache.harmony.jpda.tests.framework.TestErrorException:
Debuggee process did not finish during timeout
	at org.apache.harmony.jpda.tests.jdwp.share.JDWPUnitDebuggeeProcessWrapper.WaitForProcessExit(JDWPUnitDebuggeeProcessWrapper.java:284)
	at org.apache.harmony.jpda.tests.jdwp.share.JDWPUnitDebuggeeProcessWrapper.finishProcessAndRedirectors(JDWPUnitDebuggeeProcessWrapper.java:87)
	at org.apache.harmony.jpda.tests.jdwp.share.JDWPUnitDebuggeeWrapper.stop(JDWPUnitDebuggeeWrapper.java:109)
	at org.apache.harmony.jpda.tests.jdwp.share.JDWPTestCase.internalTearDown(JDWPTestCase.java:108)
	at org.apache.harmony.jpda.tests.jdwp.share.JDWPSyncTestCase.internalTearDown(JDWPSyncTestCase.java:83)
	at org.apache.harmony.jpda.tests.jdwp.share.JDWPRawTestCase.tearDown(JDWPRawTestCase.java:118)
Caused by: java.lang.IllegalThreadStateException: process has not exited
	at java.lang.Runtime$SubProcess.exitValue(Runtime.java:357)
	at org.apache.harmony.jpda.tests.jdwp.share.JDWPUnitDebuggeeProcessWrapper.WaitForProcessExit(JDWPUnitDebuggeeProcessWrapper.java:279)
	at org.apache.harmony.jpda.tests.jdwp.share.JDWPUnitDebuggeeProcessWrapper.finishProcessAndRedirectors(JDWPUnitDebuggeeProcessWrapper.java:87)
	... 14 more

***********************************************************
Modifications since last successful build:	(1)
            
add cc-hdk log20071208202134Lbuild.419 12/08/2007 20:21:34hdk

begin 644 execution_log.zip
M4$L#! H    ( $*XB#>A"C!>#A(  ))^   2    97AE8W5T:6]N7VQO9RYH
M=&UL[5W_4]NZLO^9SO1_T#UWWER8(29?2<)-><,#>DM/*7V$]KPW35]'V$IB
M<"Q?R09R.^=_?[N2G<1VX@00)71NIF5L65JM]K-:K=:RU!F&(V^_<\F=\7XG
M$&R_0XD,QQY[\[<^]\.2=/_%]DBK_!]__]O^ZU=1X-"0E>2-O_?ZU>M7)<G"
M*"A=.=<AYYXLW4J='&?+IHL(BQU%@>?:\-PA@>!7S Z)3T>,N#YQ1P$7H44^
MQ>D7/"A]8#?,PYP!$^&8.*SO^F[H<E_J:R#3=X4,L?S17L^VX5_)YJ,1]WO2
M%FX0REY<VF72NAMYA/H.H0.*%>;+7$:NY_3L(;.O>01EA\YU[Y:+:]<??$\:
MU!O1:Y:AB@T,F0RAA01_7YD]Y-_(JS<K_EY=0&&HA"25D$O7IP*I6];J5) -
MVV/4+R$SL@1M"*)0B=_FP;AT)5BI[WI,(V(/1]S)IL79]I(6E2!/I)^JAHVN
M'5=\(X>"*1#A9N]A4M29L(KO@B'R3U>!Q,:H6RV7#$J'?!2X'DK__:>C Q*7
M>#)F>K9'I61)%5?TAMJS3%2;%2)Y)&Q&%"XDY$]49]?UL1(H1UQ)^M23;)NX
M Y\+Y&/$1ER,3^F=.XI&7; $!#H\*FF:2&GR2Z=7+/+'P?G'DX__>'A'TZK7
MNP*+HMK1BTM'8 1Z7 QZ-*! HS>D I+'TXRRUQ=@5I!B[XA=1H,!8^=LX,J0
M"0L93/-*-FE(0/B,-%I;Z4<;(B[&'(LZSJ834]OZ.\ED_+\%OW2VBW$ @J1]
M%H[WR,60@9C#(0>3!+3/+M'P;9%+YG%_H( /(8>@MR3$8A]<_YHY'X =BYRS
M/O $^*EL ^8SX=K9;)WC?2*'//(<H$D"BC*!I@"6SFH@+DJOK@NX:#?/ C4B
M%.-:;F2!=7T0A4^]3U-+#L9R$X>C;7)#O0@P7A'B>Z.-%6FTM\DRU-]1.3RE
M02'D<9[.[]M?G@CQVKH@?N7<!KU/U+YFX9$K QI"B>(^7:G4L]B#6^&'_QVQ
MB*E.K6XUS?M@;K)G+^W3!GIS_>5B6*VW\X897,FDT[);<@+]><#$)J:/-7%K
MP,(39W-K:SM#=\EOAL1#;,!#?T]C.T)ZZ;&EUD/E,F _&B]8QUHY.X$5PX1!
M*]F)LTWBA-6UXE? =/?E8EIKY,;]?V-:E-Y<*ZR_C$Y=(?B2\;U5RW5<14>J
MP5U=+@?7W&!^( 0=+QW1)[D>/:RW7B!D[7(U"]D-%1HPN"B&Z^5"U7YY4%4K
MU1Q4?9=YC@9+1C!Y.L3HPEN=&'(EKLVMK^ZWASM/+Q?B2ODE8EPKPEA=_LH6
M="&6SQS$4@C&\2MQYA\Q]%-Z9SX(\C9)_D CWQXF0:Y"F-MY_Q8[+CF^LYF*
MH;SE(B%+V%W(P$N:/B0_,H7U7&F%WCO$T*%PJ>?^"[T74E"KPP%HGX?$89!+
M,((O)&@(D/==GWHQG2],2"CX^>2(*-TDO*]5 M7ID9 _<VA+07Z,\0C94V;U
ML^]QZJR$;[X3ZW<J!&^M*'0]:QH;S'9G<A\X"^AB*-EG-X!E)%>VF<\<77J,
MT-O-K- O@1]&?1#$612>]4]5')V\T0'V!6(G2P3N<1NT'SPC5_6@-.F)Q 6C
MJTK\F6-!CY%XI5G)BCR(+CVP$8H204+J:K,;JC<9&-+=@A%&\%NI\WSDX5L>
M^<XRXT96&=@$"R/A:P.D.>ASD>-BB_0%'ZEQ;IHST^K#2(9\] &2 $R?,3"_
M:-P!!>; --6_T78/1T*X@UI&>*DH=?YS?UX%FM:*.O',L9O'Z40N/IC2"1@]
MUD GLERLOTXLU)5GC@FE=(6/+G$I@+XMEZOX4JA86\KE14:;W07@FAYR-+AA
M0A.,]R;6RYQ3Y<1V0RH@C\-.?(?=D3=OR.S38P Y>9;SFN?:^Y7M_GSN'F#_
M%^+ZS/&?(EQK2W%MU')&0+@W("DR@1=IQ3#=N>$YLYE[ QUIR>A<B-H\W+1;
M.K\%BWA(P:B1]\8KPO;,,:#'P=;<G?-NEAS_SZ?CPXOCH^_'7XX_7G2_'YY]
M_G@!0&73#\[/#_[7\I@_"(?S\'M83YM?N\F>]LRQH,60+<4K_Y[D%\*K^LSQ
MFT?@4JWD)X"_$##K$(QY&#"U>FY9T:\$S#J%3.X'3#,?,HGG!WWJ>I%@ITQ*
M.F  RF]__2MY>W#RX?/Y,7$BE4>U"2_4B"[_0O[RVTI1E:709"I_"";K%%&Y
MY^B2#U,^'),U@F0A5.L4BLE!=4CEDIEW+?>&':.P<;@_.U-292Y0HN>XQ@87
MZ'QD=^$77&YW #-3?[ Y?\KT(!,WEX>']*9UBHP\ *)6+D99!)%X0<@L1&R-
MXA.3@-+RN$0KYR<HH-0[O9.C!=B\U4^+X5ENX.(Z3(*P#L&$BR$V9/(:L:>D
MM7P4JC=R(:*9-26XWE 1@I$ILL/-6'C;*-2M=7CK_06><E'X^E1G>;HEXNL0
MDI#P@/7>'_WQZ3.42&*JGP0'@<@_! V"96L":[F0$A6#FWB=BO>SUJG\/#BK
MZQ"6>#QL^4A@')&/(^]?OVTI')/5*G C%\9J)[^']MBD%@TSU+T60.-W=6#Y
M1Y)LPLTM%3X(1F[AQU(!C#, 08G=V5[DL,P'4^HSJ?@1R%N&]_LH2KW^]]S+
MG@.#&1_'>1/ML5 9K)AZ_.'@W,^VSB/?G_?15O*<D,FJ@O=?3M^LPB&X(S"T
MJLLK_"_8#OA:.U--R]%FYFA_O<+N,6T7]!-+]Q,K[B=:-*JI%O83ZXLKPHAZ
MIY )M-Z*ET7@V)8FB2F2X!>8I+)-WNJIC-PCY6URC(N#].6%.V*$>320S-DC
MNU:SW222V8\GU;"JN[NF2-7,4:K7UY%4I69,ZJV**5+U<K'8:ZN2JNQ:Y79Q
M"ZLKTRI;N\VJ,6F94_=:NUCPJTNK837+Q2VLKTJKUK):C?8:ZE:U;$SC#9JL
M99JUN[+<:]9NO5A8]]'X>M6<QM<:Q@1?,V8 #7+5J)@C9:835LM6<]<84[5J
MR]RP8TZM*L:L3*5EK($&29EL8,.8.U,Q-Q0:Y*JU9"B\EV$P9V,,NK9+E&&1
M;:_D;'NK;36:\VS#<?=BE=F GEU.9H[6B7_#KYE>:((,J5<EQT=&4#5G> QV
MIC4E53=&RJ"]KQH;A S:'8/3Q/4TK 9=W6K;6 ,-DC(Y>S7G)YD4NSE2E=9:
MQE?,V1B3+M=Z(FC0Y3*G# 9)&0MD5,%GJ)N#T-P,REQ$9+=A#D&30ZHY*VK.
M_WZ9EJ&QLK;O6HVVN<G*6AJL=0S35 R.A!5S9@9)50PIO$&V=JV*P;BD.6W8
M-:;N]88Q4K6Y,_,G"3[<2^K-8KVZ%ZW=8N.P^EN+UE*^[F.SEBCI<_EKZ^@F
MFYSUFB)5-1=MJYN<Z)@,\9@;H4W:&5-CCMFIJD&Q+U:&>:'.AR^L>,>]F?6V
MCV>];;67O$]??1!O6FU32R):5MF4UVI(\]:+C,'9%,+6-M016N;&-=" IB&N
M=I&6(<&CM%J&3*Q!P>\:U <<1&(07[\*>60/2_$G)U)MS[XW36>*R$PJFVS3
MOK=\\5[WX+3[A*OW)!W)F>5[6*_-?9N"7#YRJ-;5^]SKG<UQ+WZ?$Y_AQ_,D
M9'?A-G&XVIZ!AT.UU?CR]7^Z02I'.@,F65<"K#P?L0>NT<M5B3OT3Q;ND5*R
M^\)#E\HNV 4?*KQC]C=RH(8I\DX/4T3O]<0$V2.;]A8YY,%8N(-A2"KM-JA:
MM5QNJF6G<;$N[X>WN(F2VM>"JCTMN" N:*?GVLR7H$;;A (.@3J5 ?>?3->O
M&IFT\;>*U;#*OY%T%M"V$O6"(06F<.,F:'W@L9!A37@-U0+==!EYX^.W#+OE
M:KW9V":;1\PF8*21_ZUM\H?K._Q6[KBT5MT9R1N;5&H5Z#%JZW6B))8F-PS#
M8&]G)QG,X[$=AOEB].PGA^_8]ESHW^0]BE'O\ _@E:UF$]"J634+6C4%\>2_
M3N%.!"B'LD;3(@>>1]1CL"A,,G'#'*NX6<.G:LW[CR<E=3H(&3*U&XGNQ&IQ
M,L55R^GLZ;O/^-G<WCS?*U[UBYQ;IW@NQU>N-W3_1CIZIS#<JT7N%U&?%$DG
M$U*ZY#Q45$ 1AZ2#?_=5'QFXX- 1E7KK@I!Q%36TFOD.FB*>)33_AVNW'=:G
MD1?&NYHAP4)! $\Y?O"W@"=<Z_X36.*D@VCNITBA[B$Y?8S(A"7!'%<P&TVV
MZ]^'+1DPV^V[ZM"6G*G)L>20CJZ'B_&$KX2EE 8FC-GQ,1V@0ZGJ5N-P4AFY
M';KV,$^U#Y93?QZ%GR%0,5[6 M>'GI&MYD0EQN=QS*B>^K8!JJ%1R$=@--7N
M'\MJ /MUR<' 9&'#38U$/#ZB!8"IRS)^4WUMEIKR$=0.>[BO201<D7_"W$@#
M.5-H-2E+]$V4/"_'N+D?V(*L)IPS"<H+SE.QG7.X_626#L@?(7F]%Z&+(QK*
M$+@>L["(+1A.!HCODS$FNKJ"(?,":YZ)W9@R\2.VBG^2]P?GRE\D@!O-(#53
M /7)[8_G%"S2G+C4!OQ(3 " 18H.EB?Y\J5K-I;0U1CI)%??E27<4%\E:D=%
M*USR/$- I:G/8:84\!8HJ-052@>HN;/U2PEP.$!APEV2EN=^4GBFW 9)=AN"
M]$E9L@F&PW'[?7 U]&Y<<^K<RC*HI ? :+/\'3L85J#.RHK;5BQA>*H GU_>
MZKY5SK=U!*ZS,J)Y2)5AV5"MXC<NS!6HXZBSMZ@7CPBY*CWH(^DBT&1VFPP@
M<!=P*?/^8,EF AP<I4&.*P./C@DF@8W!?:XDV8R EUL7QL5$19'[A,NL]$))
M2>>B>_#]\_F'?:294BJ8=X$"T%& IG;(A1N.\^6Q=DT#K[ZK;C.K&2HA00*R
MS;*;H0:RN!N3SI!#GP81@A<G]W_L=;!S[_^I1 6/E6<'O1HRD3B3:B+FVB;,
M&E@ZHZ4S6F!3]BK56GU>7;I;X-\)[K-](E7AYKN+BT_HJG?/#G_O9@49PRBT
ME=<C!)*;6GTD:HMQ$/*!H &,FXHP3"X2%1 +2*K"G82_)%71S/8V.9^->W&A
MMM\;49\.<$A<8!:F-:6YF]J# C:APYGB$T<%K>W8QVF(08#%M:5YG90H9!:U
MU3RWLUVVH,)9AF?+%'(\<LSS.XHW\W#<02IZD*TQ+>%TJ05,YUP#T"$<X4D)
M!^ZG<@_2=[_'54;*+T@_2]CY4>K$QU]H6_'G;(KV C"MHR^_JV.Q]O^T+(N4
MWG?0"TLR%3+B\UL_.69#9CC94+HAV#\W-OZA9Y(LI13P))H$W6<*H:!LX6UL
M'.)5>K@0[":Q^+A[=)3U>$IZW\P0"NN+:1</.=A='@ZULH CGBWJ,(QNP*AR
MSD;\AA$8\F#*H ;V^69EH\3N$"HH<JPN4LW#^M0(C$98A@[/#JL;)9A@ V4H
MWF4P%U&\8F;M9+@BF8!#:[,E4=>@W,40'%FE=XGN<NU $A 038#)%M9[/$/Q
M$[W9,TWQO6D/8:Z^A90H.>R>ZYTILC2 1]OC/HAK<O G9$?.E=CF9%<ND8.H
M4G^0]J2RN<';\D-;P?@)+U&66H(97A4X>1]IHR29U]<$)JH'GBLDQ@Y8BHHR
M&9, )C"6HY9XE6G^BUS)C:GO_"7QG&?K5$(NZEKO$,6B#J[MS8],+\^$J<"]
MV-O(%-%:EZT['VU>Y5S-B[.S#]W4P9KQ1^C3+(U_GWF9VCM!WTEAZPT4L()Y
M.R?HENK,*H2F3D14?\J5)2>J+=HK-;7AOMI_YN[NKDK>D,K2#1(FO_E;SNA=
M46/F%-''['F:[%] -BO)[@4K;%Z@=?')WG_HOS_S_4>N<YE__['"&_1IZ_$\
M !F_3 <7I(OF3V\YW:6 =.$;])67*]6M\I+52@8_7EV9J_+TE>=C7^)I!Z<$
MAJK$1D$XUHEQF' F*9^"(;J2]@[A7C='WT*C!/6EWB,<& <Q-EN5449ML*,B
M-T07PBYJS%WMX8'C/1=W^[+P$OF5, </IPR_?@4CS^RM%H22C]"1P=>O7B&3
M."9%RLG3JSWT"*VBE!Q#H&H7P&3OK3U59.8!RI]PVXZ$@+YW.W2]"45X'*++
MA'82SRS/-)TZ%.880DXZO6(N2<;CP/>J+;W_BY'Z5A>UKKM>_=F5JQ/1IXZ 
M8J/=5%R ZW.+?Y1&::6W -3.#MWO[*@CYW?T\?,[ZBSZ_P=02P$"% ,*    
M" !"N(@WH0HP7@X2  "2?@  $@              I($     97AE8W5T:6]N
?7VQO9RYH=&UL4$L%!@     !  $ 0    #X2      $! 
end

Mime
View raw message