harmony-alerts mailing list archives

Site index · List index
Message view « Date » · « Thread »
Top « Date » · « Thread »
From nom...@intel.com
Subject [build-test alert] FAILED Linux x86_64: reliability
Date Fri, 07 Dec 2007 01:44:50 GMT
svn.revision=601490
BUILD FAILED:
	Ant Error Message:
/export/users/cc/cc-reliability/scripts/cc-exec-adaptor.xml:104: The following error occurred
while executing this line: /export/users/cc/cc-reliability/adaptors/reliability/adaptor.xml:98:
Some reliability tests failed on /export/users/cc/cc-reliability/build/checkouts/snapshot/hdk/jdk/jre/bin/java

Date of build:	2007-12-06 15:16:42 +0600
Time to build:	987 minutes 56 seconds
Last changed:	12/06/2007 14:47:17
Last log entry:	snapshot

***********************************************************
Errors/Warnings:	(59)
            
[java] Java Result: 104
[java] Java Result: 104
[java] Java Result: 104
[java] Java Result: 104
[java] Java Result: 104
[java] Java Result: 104
[java] Java Result: 104
[java] Java Result: 104
[java] Java Result: 104
[java] Java Result: 104
[java] Java Result: 104
[java] Java Result: 104
[java] Java Result: 104
[java] Java Result: 104
[java] Java Result: 104
[java] Java Result: 104
[java] Java Result: 104
[java] Java Result: 104
[java] Java Result: 104
[java] Java Result: 139
[java] Java Result: 104
[java] Java Result: 104
[java] Java Result: 104
[java] Java Result: 104
[java] Java Result: 104
[java] Java Result: 104
[java] Java Result: 104
[java] Java Result: 104
[java] Java Result: 104
[java] Java Result: 104
[java] Java Result: 104
[java] Java Result: 104
[java] Java Result: 104
[java] Java Result: 104
[java] Java Result: 104
[java] Java Result: 104
[java] Java Result: 104
[java] Java Result: 105
[java] Java Result: 104
[java] Java Result: 104
[java] Java Result: 104
[java] Java Result: 104
[java] Java Result: 104
[java] Java Result: 104
[java] Java Result: 104
[java] Java Result: 104
[java] Java Result: 104
[java] Java Result: 104
[java] Java Result: 104
[java] Java Result: 104
[java] Java Result: 104
[java] Java Result: 104
[java] Java Result: 104
[java] Java Result: 104
[java] Java Result: 104
[java] Java Result: 104
[java] Java Result: 104
[java] Java Result: 104
The execution FAILED with the following exception:
The following error occurred while executing this line:
/export/users/cc/cc-reliability/adaptors/reliability/adaptor.xml:98: Some reliability tests
failed on /export/users/cc/cc-reliability/build/checkouts/snapshot/hdk/jdk/jre/bin/java

***********************************************************
Unit Tests: (58)
        
error: test api.kernel.thread.StackTraceTest.StackTraceTest
error: test api.nio.channels.filechannel.FileChannelMapTest
Unit Test Error Details:	(2)
                
Test: testClass: api.kernel.thread.StackTraceTest.StackTraceTestOK
OK
OK
OK
OK
OK
OK
OK
OK
OK
OK
OK
OK
OK
OK
OK
OK
OK
OK
OK
OK
OK
OK
OK
OK
OK
OK
OK
OK
OK
OK
OK
OK
OK
OK
OK
OK
OK
OK
OK
OK
OK
OK
OK
OK
OK
OK
OK
OK
OK
OK
OK
OK
OK
OK
OK
OK
OK
OK
OK
OK
OK
OK
OK
OK
OK
OK
OK
OK
OK
OK
OK
OK
OK
OK
OK
OK
OK
OK
OK
OK
OK
OK
OK
OK
OK
OK
OK
OK
OK
OK
OK
OK
OK
OK
OK
OK
OK
OK
OK
OK
OK
OK
OK
OK
OK
OK
OK
OK
OK
OK
OK
OK
OK
OK
OK
OK
OK
OK
OK
OK
OK
OK
OK
OK
OK
OK
OK
OK
OK
OK
OK
OK
OK
OK
OK
OK
OK
OK
OK
OK
OK
OK
OK
OK
OK
OK
OK
OK
OK
OK
OK
OK
OK
OK
OK
OK
OK
OK
OK
OK
OK
OK
OK
OK
OK
OK
OK
OK
OK
OK
OK
OK
OK
OK
OK
OK
OK
OK
OK
OK
OK
OK
OK
OK
OK
OK
OK
OK
OK
OK
OK
OK
OK
OK
OK
OK
OK
OK
OK
OK
OK
OK
OK
OK
OK
OK
OK
OK
OK
OK
OK
OK
OK
OK
OK
OK
OK
OK
OK
OK
OK
OK
OK
OK
OK
OK
OK
OK
OK
OK
OK
OK
OK
OK
OK
OK
OK
OK
OK
OK
OK
OK
OK
OK
OK
OK
OK
OK
OK
OK
OK
OK
OK
OK
OK
OK
OK
OK
OK
OK
OK
OK
OK
OK
OK
OK
OK
OK
OK
OK
OK
OK
OK
OK
OK
OK
OK
OK
OK
OK
OK
OK
OK
OK
OK
OK
OK
OK
OK
OK
OK
OK
OK
OK
OK
OK
OK
OK
OK
OK
OK
OK
OK
OK
OK
OK
OK
OK
OK
OK
OK
OK
OK
OK
OK
OK
OK
OK
OK
OK
OK
OK
OK
OK
OK
OK
OK
OK
OK
OK
OK
OK
OK
OK
OK
OK
OK
OK
OK
OK
OK
OK
OK
OK
OK
OK
OK
OK
OK
OK
OK
OK
OK
OK
OK
OK
OK
OK
OK
OK
OK
OK
OK
OK
OK
OK
OK
OK
OK
OK
OK
OK
OK
OK
OK
OK
OK
OK
OK
OK
OK
OK
OK
OK
OK
OK
OK
OK
OK
OK
OK
OK
OK
OK
OK
OK
OK
OK
OK
OK
OK
OK
OK
OK
OK
OK
OK
OK
OK
OK
OK
OK
OK
OK
OK
OK
OK
OK
OK
OK
OK
OK
OK
OK
OK
OK
OK
OK
OK
OK
OK
OK
OK
OK
OK
OK
OK
OK
OK
OK
OK
OK
OK
OK
OK
OK
OK
OK
OK
OK
OK
OK
OK
OK
OK
OK
OK
OK
OK
OK
OK
OK
OK
OK
OK
OK
OK
OK
OK
OK
OK
OK
OK
OK
OK
OK
OK
OK
OK
OK
OK
OK
OK
OK
OK
OK
OK
OK
OK
OK
OK
OK
OK
OK
OK
OK
OK
OK
OK
OK
OK
OK
OK
OK
OK
OK
OK
OK
OK
OK
OK
OK
OK
OK
OK
OK
OK
OK
OK
OK
OK
OK
OK
OK
OK
OK
OK
OK
OK
OK
OK
OK
OK
OK
OK
OK
OK
OK
OK
OK
OK
OK
OK
OK
OK
OK
OK
OK
OK
OK
OK
OK
OK
OK
OK
OK
OK
OK
OK
OK
OK
OK
OK
OK
OK
OK
OK
OK
OK
OK
OK
OK
OK
OK
OK
OK
OK
OK
OK
OK
OK
OK
OK
OK
OK
OK
OK
OK
OK
OK
OK
OK
OK
OK
OK
OK
OK
OK
OK
OK
OK
OK
OK
OK
OK
OK
OK
OK
OK
OK
OK
OK
OK
OK
OK
OK
OK
OK
OK
OK
OK
OK
OK
OK
OK
OK
OK
OK
OK
OK
OK
OK
OK
OK
OK
OK
OK
OK
OK
OK
SIGSEGV in VM code.
Stack trace:
  0: method_get_name (??:-1)
  1: Java_org_apache_harmony_vm_VMStack_getThreadStackTrace (??:-1)
  2: 0x00002AAAAC29E187  LTGenerated stubGT
  3: java/lang/Thread.getStackTrace()[Ljava/lang/StackTraceElement; (Thread.java:530)
  4: java/lang/Thread.getAllStackTraces()Ljava/util/Map; (Thread.java:462)
  5: org/apache/harmony/test/reliability/api/kernel/thread/StackTraceTest/StackTraceTest.test(Z)Z
(StackTraceTest.java:118)
  6: org/apache/harmony/test/reliability/api/kernel/thread/StackTraceTest/StackTraceTest.test([Ljava/lang/String;)I
(StackTraceTest.java:58)
  7: org/apache/harmony/test/reliability/share/LongRunningTestStarter.test([Ljava/lang/String;)I
(LongRunningTestStarter.java:85)
  8: org/apache/harmony/test/reliability/share/ReliabilityTestStarter.test([Ljava/lang/String;)I
(ReliabilityTestStarter.java:51)
  9: org/apache/harmony/test/reliability/share/ReliabilityTestStarter.main([Ljava/lang/String;)V
(ReliabilityTestStarter.java:64)
 10: ?? (??:-1)
 11: JIT_execute_method_default (??:-1)
addr2line: '[stack]': No such file
 12: ?? (IT_execute_method_default:-1)
 13: ?? (??:-1)
 14: vm_alloc_and_report_ti(unsigned int, unsigned long long, void*, Class*) (apr_strtok.c:-1)
 15: ?? (??:-1)
addr2line: '[stack]': No such file
 16: ?? (m_alloc_and_report_ti(unsigned int, unsigned long long, void*, Class*):-1)
 17: vm_execute_java_method_array (apr_strtok.c:-1)
LTend of stack traceGT
Test: testClass: api.nio.channels.filechannel.FileChannelMapTestUncaught exception in Thread-9:
java.lang.NullPointerException
	at org.apache.harmony.luni.platform.AbstractMemorySpy.orphanedMemory(AbstractMemorySpy.java:113)
	at org.apache.harmony.luni.platform.RuntimeMemorySpy.alloc(RuntimeMemorySpy.java:31)
	at org.apache.harmony.luni.platform.PlatformAddressFactory.allocMap(PlatformAddressFactory.java:39)
	at org.apache.harmony.nio.internal.FileChannelImpl.mapImpl(FileChannelImpl.java:192)
	at org.apache.harmony.nio.internal.ReadOnlyFileChannel.map(ReadOnlyFileChannel.java:89)
	at org.apache.harmony.test.reliability.api.nio.channels.filechannel.FileChannelThread.run(FileChannelMapTest.java:194)
	at java.lang.Thread.run(Thread.java:657)
thread #0 returned not PASS status
*** iteration: 0
test result is 105
Test FAILED

***********************************************************
Modifications since last successful build:	(1)
            
add cc-snapshot log20071206144717Lbuild.31 12/06/2007 14:47:17snapshot

begin 644 execution_log.zip
M4$L#! H    ( )0]AS?1"@)O#@4  /PA   2    97AE8W5T:6]N7VQO9RYH
M=&ULQ5IM3^,X$/[.K_"7TWXBH>S!0H]#@K1ENRK+JH%%6H20ZTP;4\>.;*=0
M?OV.D\*UO&U3FES5-G;L\3-OMF><',0V$8<' Q5-#P]2#8<'E!@[%?#OIZ&2
M=M/P!VB2O:V__OETN)&E$;6P:2:RN;&A,_PG[G-U2R?TFAQG7$1#+K _MGGW
MB5AHSHO)..+ZF@0:<*"(8*5)?+A/E;9^9D ;GS'\;FH0G ZXX';J#]RXO@:3
M"6O\^9;MK:TOFXWMS:W=F\9.8W<!;J'B^*$I]QYXVGS!%+D"%JMKTL^DY')$
M+!C;)+/NWE$D0 ?]X//V.=Y_A;@H?\-_TL]Y;)+&UM\E44Y^\;0KSS(;6E1-
M4B545PY%"X;B!"P. K9*K/JD^B7XP$F%;J5KP$&]M3BS7$FJIU7CN?%1@RC:
M:-J#";R<5VL&^TDUSC$!/9 C&Z^&]NK\&X.6(#RJ1Z;,/)PC\X[2].=IT/M!
M=74.-8_7O@?6EI,ZH'*YM$I!6PYF=<3W5 \H3G/IWK%2XU4LE=/ATAGUDS"V
MT9W\ZFY4(Y$:W *S*S!9$'IG^2402D+%1EX ['!)!6ZN=6+BDL\$->8K-3%3
MT0>PWS-(RL:CY5W,6(V,KV"^@A"W,P/2<,LG5:OR"1"W&%DK5HR[9X3U>D##
M_/)1,=^SN<T%6L'F!2%R2-GX7%.6F_Q9=4EV/^^O"C_2*DN]MLP2<'MRQ4:9
MB5SX0)B9%&3D!DS@M7O5,Q)0P3(,LS#TR<OUB!].)8NUDORA0)[5_W?P[>K1
M+X&.^S $#9(!E5%A]=SQWVZJ9,ZJ.Q<4+K^T)U32$20@5]F=_R-&?1L+"3*M
M,LW@3'.\"16)R5228@JK5^#XD=3[QFTP*U?"Y!(6L'!?2NFNOW>,WC/N6K>J
M*7US)$1/,2K 5.'C.6 +&$^HZ"B=4'M3-=H([-&$<I%G-@763:#$BMG4JVJ7
M7'DLIAK3PS+:GR/S B4MY?(#P?+R6&W)T 0U(2D7P9QBU%F+:)>X7H^"HO*=
M)NL.=6=0$F=CJ?QHGLYS9V6SBA<4UT[W+*Q8/:]@JW3:P7K5AGF)[%!GDI_2
MM S\SG(V&F1#W!Y+FVA&YAU/+1SG92H$+AD66EQC(E6EHEYBN\V$U@WZ([-%
MH0Y8-U$+M%#P4F'\&B O-4U/JCL'?1NT#L26RG"[JUW0CE#4UHZ*.6OMF#W<
M9VH'#6.EUR7J6VOG$E'F\T[O"X#\=\_6S6?)0 LC@^]@ ^%2B#6Q,4D\XPX@
M_J O[):?O>'$B$H<>#TC\P)7":A9I\$18UB<1N;Y;0G6YLF\QQ/-"A,UA(1[
M!JG#6WI37R#RVD_%]?(U8B7X&;''W+V2F*M . G6*N$2ZT%FN2@S'5U_E_"P
M3&MTE36O#09P7&ZG93AZI/'"62&?;WUPSQ77?>)@0/,W)MWS_N^T'E]T>RT2
M7@1!.PP[%[V%QG-EJ2"6)] D^WM?2,)EAL*2G09!296,\FS[*@(!%JY)RUV=
M0AJ-+\3%Z88,M4H^\(0>M?>H,H99QC5QN4:!L#M#L.JCXV^<QT#<@ZW,:9)T
MCKJ]=HO<<1L3BRU#S/'5G0-]6@::.<E<@]9*$\5R1XS(78R</8[H_"/FA@@N
MH;GQ)U9I1%.K]"*7LYONE8CF_EZ3A"H!,M<A=T#4-478B* (RRF$Q<#&*D.5
M&$E3$ROKQ]'8OW4_#?Z 2]^YP<:!3P\/_/SE#K]XT<//W_KX#5!+ 0(4 PH 
M   ( )0]AS?1"@)O#@4  /PA   2              "D@0    !E>&5C=71I
A;VY?;&]G+FAT;6Q02P4&      $  0!     /@4      
end

Mime
View raw message