harmony-alerts mailing list archives

Site index · List index
Message view « Date » · « Thread »
Top « Date » · « Thread »
From nom...@intel.com
Subject [build-test alert] FAILED Linux x86_64: eut33
Date Wed, 05 Dec 2007 19:41:03 GMT
================================================
Eclipse Unit Tests 3.3 on linux gtk x86_64
================================================
Tested JRE information:
Apache Harmony Launcher : (c) Copyright 1991, 2007 The Apache Software Foundation or its licensors, as applicable.
java version "1.5.0" 
pre-alpha : not complete or compatible
svn = r601041, (Dec  5 2007), Linux/em64t/gcc 4.1.0, release build
http://harmony.apache.org

JRE options: -showversion -Xmx1024m
================================================
Runner JRE information:
java version "1.5.0_09"
Java(TM) 2 Runtime Environment, Standard Edition (build 1.5.0_09-b01)
Java HotSpot(TM) 64-Bit Server VM (build 1.5.0_09-b01, mixed mode)
================================================

Total run tests     : 40984
Relative passrate   : 82.70%
Unexpected crashes  : 3
Unexpected errors   : 349
Unexpected failures : 7

================================================
Unexpected crashes  : 3
org.eclipse.core.tests.resources.AutomatedTests(862)
org.eclipse.jdt.debug.tests.AutomatedSuite(598)
org.eclipse.swt.tests.junit.AllGtkTests(5276)

================================================
Unexpected errors   : 349

org.eclipse.jdt.core.tests.builder.CopyResourceTests.test2ProjectWith1Bin
null
java.lang.ArrayIndexOutOfBoundsException
	at java.util.TreeMap$SmallValueIterator.next(TreeMap.java:334)
	at org.eclipse.core.internal.resources.AliasManager$LocationMap.matchingPrefixDo(AliasManager.java:174)
	at org.eclipse.core.internal.resources.AliasManager.computeDeepAliases(AliasManager.java:445)
	at org.eclipse.core.internal.resources.AliasManager.updateAliases(AliasManager.java:648)
	at org.eclipse.core.internal.resources.Resource.delete(Resource.java:717)
	at org.eclipse.core.internal.resources.Project.delete(Project.java:297)
	at org.eclipse.jdt.core.tests.builder.TestingEnvironment.removeProject(TestingEnvironment.java:839)
	at org.eclipse.jdt.core.tests.builder.TestingEnvironment.resetWorkspace(TestingEnvironment.java:859)
	at org.eclipse.jdt.core.tests.builder.BuilderTests.tearDown(BuilderTests.java:433)
	at org.eclipse.test.EclipseTestRunner.run(EclipseTestRunner.java:354)
	at org.eclipse.test.EclipseTestRunner.run(EclipseTestRunner.java:206)
	at org.eclipse.test.CoreTestApplication.runTests(CoreTestApplication.java:35)
	at org.eclipse.test.CoreTestApplication.run(CoreTestApplication.java:31)
	at java.lang.reflect.VMReflection.invokeMethod(VMReflection.java)
	at org.eclipse.equinox.internal.app.EclipseAppContainer.callMethod(EclipseAppContainer.java:533)
	at org.eclipse.equinox.internal.app.EclipseAppHandle.run(EclipseAppHandle.java:155)
	at org.eclipse.core.runtime.internal.adaptor.EclipseAppLauncher.runApplication(EclipseAppLauncher.java:106)
	at org.eclipse.core.runtime.internal.adaptor.EclipseAppLauncher.start(EclipseAppLauncher.java:76)
	at org.eclipse.core.runtime.adaptor.EclipseStarter.run(EclipseStarter.java:363)
	at org.eclipse.core.runtime.adaptor.EclipseStarter.run(EclipseStarter.java:176)
	at java.lang.reflect.VMReflection.invokeMethod(VMReflection.java)
	at org.eclipse.equinox.launcher.Main.invokeFramework(Main.java:504)
	at org.eclipse.equinox.launcher.Main.basicRun(Main.java:443)
	at org.eclipse.equinox.launcher.Main.run(Main.java:1169)
	at org.eclipse.equinox.launcher.Main.main(Main.java:1144)
	at org.eclipse.core.launcher.Main.main(Main.java:30)

org.eclipse.jdt.core.tests.builder.OutputFolderTests.test2ProjectWith1Bin
null
java.lang.ArrayIndexOutOfBoundsException
	at java.util.TreeMap$SmallValueIterator.next(TreeMap.java:334)
	at org.eclipse.core.internal.resources.AliasManager$LocationMap.matchingPrefixDo(AliasManager.java:174)
	at org.eclipse.core.internal.resources.AliasManager.computeDeepAliases(AliasManager.java:445)
	at org.eclipse.core.internal.resources.AliasManager.updateAliases(AliasManager.java:648)
	at org.eclipse.core.internal.resources.Resource.delete(Resource.java:717)
	at org.eclipse.core.internal.resources.Project.delete(Project.java:297)
	at org.eclipse.jdt.core.tests.builder.TestingEnvironment.removeProject(TestingEnvironment.java:839)
	at org.eclipse.jdt.core.tests.builder.TestingEnvironment.resetWorkspace(TestingEnvironment.java:859)
	at org.eclipse.jdt.core.tests.builder.BuilderTests.tearDown(BuilderTests.java:433)
	at org.eclipse.test.EclipseTestRunner.run(EclipseTestRunner.java:354)
	at org.eclipse.test.EclipseTestRunner.run(EclipseTestRunner.java:206)
	at org.eclipse.test.CoreTestApplication.runTests(CoreTestApplication.java:35)
	at org.eclipse.test.CoreTestApplication.run(CoreTestApplication.java:31)
	at java.lang.reflect.VMReflection.invokeMethod(VMReflection.java)
	at org.eclipse.equinox.internal.app.EclipseAppContainer.callMethod(EclipseAppContainer.java:533)
	at org.eclipse.equinox.internal.app.EclipseAppHandle.run(EclipseAppHandle.java:155)
	at org.eclipse.core.runtime.internal.adaptor.EclipseAppLauncher.runApplication(EclipseAppLauncher.java:106)
	at org.eclipse.core.runtime.internal.adaptor.EclipseAppLauncher.start(EclipseAppLauncher.java:76)
	at org.eclipse.core.runtime.adaptor.EclipseStarter.run(EclipseStarter.java:363)
	at org.eclipse.core.runtime.adaptor.EclipseStarter.run(EclipseStarter.java:176)
	at java.lang.reflect.VMReflection.invokeMethod(VMReflection.java)
	at org.eclipse.equinox.launcher.Main.invokeFramework(Main.java:504)
	at org.eclipse.equinox.launcher.Main.basicRun(Main.java:443)
	at org.eclipse.equinox.launcher.Main.run(Main.java:1169)
	at org.eclipse.equinox.launcher.Main.main(Main.java:1144)
	at org.eclipse.core.launcher.Main.main(Main.java:30)

org.eclipse.jdt.core.tests.builder.PackageTests.test002
null
java.lang.ArrayIndexOutOfBoundsException
	at java.util.TreeMap$SmallValueIterator.next(TreeMap.java:334)
	at org.eclipse.core.internal.resources.AliasManager$LocationMap.matchingPrefixDo(AliasManager.java:174)
	at org.eclipse.core.internal.resources.AliasManager.computeDeepAliases(AliasManager.java:445)
	at org.eclipse.core.internal.resources.AliasManager.updateAliases(AliasManager.java:648)
	at org.eclipse.core.internal.resources.Resource.delete(Resource.java:717)
	at org.eclipse.core.internal.resources.Project.delete(Project.java:297)
	at org.eclipse.jdt.core.tests.builder.TestingEnvironment.removeProject(TestingEnvironment.java:839)
	at org.eclipse.jdt.core.tests.builder.PackageTests.test002(PackageTests.java:175)
	at java.lang.reflect.VMReflection.invokeMethod(VMReflection.java)
	at org.eclipse.test.EclipseTestRunner.run(EclipseTestRunner.java:354)
	at org.eclipse.test.EclipseTestRunner.run(EclipseTestRunner.java:206)
	at org.eclipse.test.CoreTestApplication.runTests(CoreTestApplication.java:35)
	at org.eclipse.test.CoreTestApplication.run(CoreTestApplication.java:31)
	at java.lang.reflect.VMReflection.invokeMethod(VMReflection.java)
	at org.eclipse.equinox.internal.app.EclipseAppContainer.callMethod(EclipseAppContainer.java:533)
	at org.eclipse.equinox.internal.app.EclipseAppHandle.run(EclipseAppHandle.java:155)
	at org.eclipse.core.runtime.internal.adaptor.EclipseAppLauncher.runApplication(EclipseAppLauncher.java:106)
	at org.eclipse.core.runtime.internal.adaptor.EclipseAppLauncher.start(EclipseAppLauncher.java:76)
	at org.eclipse.core.runtime.adaptor.EclipseStarter.run(EclipseStarter.java:363)
	at org.eclipse.core.runtime.adaptor.EclipseStarter.run(EclipseStarter.java:176)
	at java.lang.reflect.VMReflection.invokeMethod(VMReflection.java)
	at org.eclipse.equinox.launcher.Main.invokeFramework(Main.java:504)
	at org.eclipse.equinox.launcher.Main.basicRun(Main.java:443)
	at org.eclipse.equinox.launcher.Main.run(Main.java:1169)
	at org.eclipse.equinox.launcher.Main.main(Main.java:1144)
	at org.eclipse.core.launcher.Main.main(Main.java:30)

org.eclipse.jdt.core.tests.dom.ASTConverterTest.test0150
null
java.lang.NullPointerException
	at org.eclipse.jdt.core.dom.ASTSyntaxErrorPropagator.checkAndTagAsMalformed(ASTSyntaxErrorPropagator.java:34)
	at org.eclipse.jdt.core.dom.ASTSyntaxErrorPropagator.visit(ASTSyntaxErrorPropagator.java:117)
	at org.eclipse.jdt.core.dom.CompilationUnit.accept0(CompilationUnit.java:208)
	at org.eclipse.jdt.core.dom.ASTNode.accept(ASTNode.java:2476)
	at org.eclipse.jdt.core.dom.ASTConverter.convert(ASTConverter.java:1269)
	at org.eclipse.jdt.core.dom.CompilationUnitResolver.convert(CompilationUnitResolver.java:255)
	at org.eclipse.jdt.core.dom.ASTParser.internalCreateAST(ASTParser.java:900)
	at org.eclipse.jdt.core.dom.ASTParser.createAST(ASTParser.java:651)
	at org.eclipse.jdt.core.tests.dom.ConverterTestSetup.runConversion(ConverterTestSetup.java:153)
	at org.eclipse.jdt.core.tests.dom.ConverterTestSetup.runConversion(ConverterTestSetup.java:139)
	at org.eclipse.jdt.core.tests.dom.ConverterTestSetup.runConversion(ConverterTestSetup.java:135)
	at org.eclipse.jdt.core.tests.dom.ConverterTestSetup.runConversion(ConverterTestSetup.java:115)
	at org.eclipse.jdt.core.tests.dom.ASTConverterTest.test0150(ASTConverterTest.java:3384)
	at java.lang.reflect.VMReflection.invokeMethod(VMReflection.java)
	at org.eclipse.jdt.core.tests.model.SuiteOfTestCases$Suite.runTest(SuiteOfTestCases.java:99)
	at org.eclipse.jdt.core.tests.model.SuiteOfTestCases$Suite.superRun(SuiteOfTestCases.java:83)
	at org.eclipse.jdt.core.tests.model.SuiteOfTestCases$1.protect(SuiteOfTestCases.java:71)
	at org.eclipse.jdt.core.tests.model.SuiteOfTestCases$Suite.run(SuiteOfTestCases.java:80)
	at org.eclipse.test.EclipseTestRunner.run(EclipseTestRunner.java:354)
	at org.eclipse.test.EclipseTestRunner.run(EclipseTestRunner.java:206)
	at org.eclipse.test.CoreTestApplication.runTests(CoreTestApplication.java:35)
	at org.eclipse.test.CoreTestApplication.run(CoreTestApplication.java:31)
	at java.lang.reflect.VMReflection.invokeMethod(VMReflection.java)
	at org.eclipse.equinox.internal.app.EclipseAppContainer.callMethod(EclipseAppContainer.java:533)
	at org.eclipse.equinox.internal.app.EclipseAppHandle.run(EclipseAppHandle.java:155)
	at org.eclipse.core.runtime.internal.adaptor.EclipseAppLauncher.runApplication(EclipseAppLauncher.java:106)
	at org.eclipse.core.runtime.internal.adaptor.EclipseAppLauncher.start(EclipseAppLauncher.java:76)
	at org.eclipse.core.runtime.adaptor.EclipseStarter.run(EclipseStarter.java:363)
	at org.eclipse.core.runtime.adaptor.EclipseStarter.run(EclipseStarter.java:176)
	at java.lang.reflect.VMReflection.invokeMethod(VMReflection.java)
	at org.eclipse.equinox.launcher.Main.invokeFramework(Main.java:504)
	at org.eclipse.equinox.launcher.Main.basicRun(Main.java:443)
	at org.eclipse.equinox.launcher.Main.run(Main.java:1169)
	at org.eclipse.equinox.launcher.Main.main(Main.java:1144)
	at org.eclipse.core.launcher.Main.main(Main.java:30)

org.eclipse.jdt.core.tests.dom.ASTConverterTest.test0152
null
java.lang.NullPointerException
	at org.eclipse.jdt.core.dom.ASTSyntaxErrorPropagator.checkAndTagAsMalformed(ASTSyntaxErrorPropagator.java:34)
	at org.eclipse.jdt.core.dom.ASTSyntaxErrorPropagator.visit(ASTSyntaxErrorPropagator.java:117)
	at org.eclipse.jdt.core.dom.CompilationUnit.accept0(CompilationUnit.java:208)
	at org.eclipse.jdt.core.dom.ASTNode.accept(ASTNode.java:2476)
	at org.eclipse.jdt.core.dom.ASTConverter.convert(ASTConverter.java:1269)
	at org.eclipse.jdt.core.dom.CompilationUnitResolver.convert(CompilationUnitResolver.java:255)
	at org.eclipse.jdt.core.dom.ASTParser.internalCreateAST(ASTParser.java:900)
	at org.eclipse.jdt.core.dom.ASTParser.createAST(ASTParser.java:651)
	at org.eclipse.jdt.core.tests.dom.ConverterTestSetup.runConversion(ConverterTestSetup.java:153)
	at org.eclipse.jdt.core.tests.dom.ConverterTestSetup.runConversion(ConverterTestSetup.java:139)
	at org.eclipse.jdt.core.tests.dom.ConverterTestSetup.runConversion(ConverterTestSetup.java:135)
	at org.eclipse.jdt.core.tests.dom.ConverterTestSetup.runConversion(ConverterTestSetup.java:115)
	at org.eclipse.jdt.core.tests.dom.ASTConverterTest.test0152(ASTConverterTest.java:3410)
	at java.lang.reflect.VMReflection.invokeMethod(VMReflection.java)
	at org.eclipse.jdt.core.tests.model.SuiteOfTestCases$Suite.runTest(SuiteOfTestCases.java:99)
	at org.eclipse.jdt.core.tests.model.SuiteOfTestCases$Suite.superRun(SuiteOfTestCases.java:83)
	at org.eclipse.jdt.core.tests.model.SuiteOfTestCases$1.protect(SuiteOfTestCases.java:71)
	at org.eclipse.jdt.core.tests.model.SuiteOfTestCases$Suite.run(SuiteOfTestCases.java:80)
	at org.eclipse.test.EclipseTestRunner.run(EclipseTestRunner.java:354)
	at org.eclipse.test.EclipseTestRunner.run(EclipseTestRunner.java:206)
	at org.eclipse.test.CoreTestApplication.runTests(CoreTestApplication.java:35)
	at org.eclipse.test.CoreTestApplication.run(CoreTestApplication.java:31)
	at java.lang.reflect.VMReflection.invokeMethod(VMReflection.java)
	at org.eclipse.equinox.internal.app.EclipseAppContainer.callMethod(EclipseAppContainer.java:533)
	at org.eclipse.equinox.internal.app.EclipseAppHandle.run(EclipseAppHandle.java:155)
	at org.eclipse.core.runtime.internal.adaptor.EclipseAppLauncher.runApplication(EclipseAppLauncher.java:106)
	at org.eclipse.core.runtime.internal.adaptor.EclipseAppLauncher.start(EclipseAppLauncher.java:76)
	at org.eclipse.core.runtime.adaptor.EclipseStarter.run(EclipseStarter.java:363)
	at org.eclipse.core.runtime.adaptor.EclipseStarter.run(EclipseStarter.java:176)
	at java.lang.reflect.VMReflection.invokeMethod(VMReflection.java)
	at org.eclipse.equinox.launcher.Main.invokeFramework(Main.java:504)
	at org.eclipse.equinox.launcher.Main.basicRun(Main.java:443)
	at org.eclipse.equinox.launcher.Main.run(Main.java:1169)
	at org.eclipse.equinox.launcher.Main.main(Main.java:1144)
	at org.eclipse.core.launcher.Main.main(Main.java:30)

org.eclipse.jdt.core.tests.dom.ASTConverterTest.test0153
null
java.lang.NullPointerException
	at org.eclipse.jdt.core.dom.ASTSyntaxErrorPropagator.checkAndTagAsMalformed(ASTSyntaxErrorPropagator.java:34)
	at org.eclipse.jdt.core.dom.ASTSyntaxErrorPropagator.visit(ASTSyntaxErrorPropagator.java:117)
	at org.eclipse.jdt.core.dom.CompilationUnit.accept0(CompilationUnit.java:208)
	at org.eclipse.jdt.core.dom.ASTNode.accept(ASTNode.java:2476)
	at org.eclipse.jdt.core.dom.ASTConverter.convert(ASTConverter.java:1269)
	at org.eclipse.jdt.core.dom.CompilationUnitResolver.convert(CompilationUnitResolver.java:255)
	at org.eclipse.jdt.core.dom.ASTParser.internalCreateAST(ASTParser.java:900)
	at org.eclipse.jdt.core.dom.ASTParser.createAST(ASTParser.java:651)
	at org.eclipse.jdt.core.tests.dom.ConverterTestSetup.runConversion(ConverterTestSetup.java:153)
	at org.eclipse.jdt.core.tests.dom.ConverterTestSetup.runConversion(ConverterTestSetup.java:139)
	at org.eclipse.jdt.core.tests.dom.ConverterTestSetup.runConversion(ConverterTestSetup.java:135)
	at org.eclipse.jdt.core.tests.dom.ConverterTestSetup.runConversion(ConverterTestSetup.java:115)
	at org.eclipse.jdt.core.tests.dom.ASTConverterTest.test0153(ASTConverterTest.java:3429)
	at java.lang.reflect.VMReflection.invokeMethod(VMReflection.java)
	at org.eclipse.jdt.core.tests.model.SuiteOfTestCases$Suite.runTest(SuiteOfTestCases.java:99)
	at org.eclipse.jdt.core.tests.model.SuiteOfTestCases$Suite.superRun(SuiteOfTestCases.java:83)
	at org.eclipse.jdt.core.tests.model.SuiteOfTestCases$1.protect(SuiteOfTestCases.java:71)
	at org.eclipse.jdt.core.tests.model.SuiteOfTestCases$Suite.run(SuiteOfTestCases.java:80)
	at org.eclipse.test.EclipseTestRunner.run(EclipseTestRunner.java:354)
	at org.eclipse.test.EclipseTestRunner.run(EclipseTestRunner.java:206)
	at org.eclipse.test.CoreTestApplication.runTests(CoreTestApplication.java:35)
	at org.eclipse.test.CoreTestApplication.run(CoreTestApplication.java:31)
	at java.lang.reflect.VMReflection.invokeMethod(VMReflection.java)
	at org.eclipse.equinox.internal.app.EclipseAppContainer.callMethod(EclipseAppContainer.java:533)
	at org.eclipse.equinox.internal.app.EclipseAppHandle.run(EclipseAppHandle.java:155)
	at org.eclipse.core.runtime.internal.adaptor.EclipseAppLauncher.runApplication(EclipseAppLauncher.java:106)
	at org.eclipse.core.runtime.internal.adaptor.EclipseAppLauncher.start(EclipseAppLauncher.java:76)
	at org.eclipse.core.runtime.adaptor.EclipseStarter.run(EclipseStarter.java:363)
	at org.eclipse.core.runtime.adaptor.EclipseStarter.run(EclipseStarter.java:176)
	at java.lang.reflect.VMReflection.invokeMethod(VMReflection.java)
	at org.eclipse.equinox.launcher.Main.invokeFramework(Main.java:504)
	at org.eclipse.equinox.launcher.Main.basicRun(Main.java:443)
	at org.eclipse.equinox.launcher.Main.run(Main.java:1169)
	at org.eclipse.equinox.launcher.Main.main(Main.java:1144)
	at org.eclipse.core.launcher.Main.main(Main.java:30)

org.eclipse.jdt.core.tests.dom.ASTConverterTest.test0259
null
java.lang.NullPointerException
	at org.eclipse.jdt.core.dom.ASTSyntaxErrorPropagator.checkAndTagAsMalformed(ASTSyntaxErrorPropagator.java:34)
	at org.eclipse.jdt.core.dom.ASTSyntaxErrorPropagator.visit(ASTSyntaxErrorPropagator.java:117)
	at org.eclipse.jdt.core.dom.CompilationUnit.accept0(CompilationUnit.java:208)
	at org.eclipse.jdt.core.dom.ASTNode.accept(ASTNode.java:2476)
	at org.eclipse.jdt.core.dom.ASTConverter.convert(ASTConverter.java:1269)
	at org.eclipse.jdt.core.dom.CompilationUnitResolver.convert(CompilationUnitResolver.java:255)
	at org.eclipse.jdt.core.dom.ASTParser.internalCreateAST(ASTParser.java:900)
	at org.eclipse.jdt.core.dom.ASTParser.createAST(ASTParser.java:651)
	at org.eclipse.jdt.core.tests.dom.ConverterTestSetup.runConversion(ConverterTestSetup.java:153)
	at org.eclipse.jdt.core.tests.dom.ConverterTestSetup.runConversion(ConverterTestSetup.java:139)
	at org.eclipse.jdt.core.tests.dom.ConverterTestSetup.runConversion(ConverterTestSetup.java:135)
	at org.eclipse.jdt.core.tests.dom.ConverterTestSetup.runConversion(ConverterTestSetup.java:115)
	at org.eclipse.jdt.core.tests.dom.ASTConverterTest.test0259(ASTConverterTest.java:6214)
	at java.lang.reflect.VMReflection.invokeMethod(VMReflection.java)
	at org.eclipse.jdt.core.tests.model.SuiteOfTestCases$Suite.runTest(SuiteOfTestCases.java:99)
	at org.eclipse.jdt.core.tests.model.SuiteOfTestCases$Suite.superRun(SuiteOfTestCases.java:83)
	at org.eclipse.jdt.core.tests.model.SuiteOfTestCases$1.protect(SuiteOfTestCases.java:71)
	at org.eclipse.jdt.core.tests.model.SuiteOfTestCases$Suite.run(SuiteOfTestCases.java:80)
	at org.eclipse.test.EclipseTestRunner.run(EclipseTestRunner.java:354)
	at org.eclipse.test.EclipseTestRunner.run(EclipseTestRunner.java:206)
	at org.eclipse.test.CoreTestApplication.runTests(CoreTestApplication.java:35)
	at org.eclipse.test.CoreTestApplication.run(CoreTestApplication.java:31)
	at java.lang.reflect.VMReflection.invokeMethod(VMReflection.java)
	at org.eclipse.equinox.internal.app.EclipseAppContainer.callMethod(EclipseAppContainer.java:533)
	at org.eclipse.equinox.internal.app.EclipseAppHandle.run(EclipseAppHandle.java:155)
	at org.eclipse.core.runtime.internal.adaptor.EclipseAppLauncher.runApplication(EclipseAppLauncher.java:106)
	at org.eclipse.core.runtime.internal.adaptor.EclipseAppLauncher.start(EclipseAppLauncher.java:76)
	at org.eclipse.core.runtime.adaptor.EclipseStarter.run(EclipseStarter.java:363)
	at org.eclipse.core.runtime.adaptor.EclipseStarter.run(EclipseStarter.java:176)
	at java.lang.reflect.VMReflection.invokeMethod(VMReflection.java)
	at org.eclipse.equinox.launcher.Main.invokeFramework(Main.java:504)
	at org.eclipse.equinox.launcher.Main.basicRun(Main.java:443)
	at org.eclipse.equinox.launcher.Main.run(Main.java:1169)
	at org.eclipse.equinox.launcher.Main.main(Main.java:1144)
	at org.eclipse.core.launcher.Main.main(Main.java:30)

org.eclipse.jdt.core.tests.dom.ASTConverterTest.test0294
null
java.lang.NullPointerException
	at org.eclipse.jdt.core.dom.ASTSyntaxErrorPropagator.checkAndTagAsMalformed(ASTSyntaxErrorPropagator.java:34)
	at org.eclipse.jdt.core.dom.ASTSyntaxErrorPropagator.visit(ASTSyntaxErrorPropagator.java:117)
	at org.eclipse.jdt.core.dom.CompilationUnit.accept0(CompilationUnit.java:208)
	at org.eclipse.jdt.core.dom.ASTNode.accept(ASTNode.java:2476)
	at org.eclipse.jdt.core.dom.ASTConverter.convert(ASTConverter.java:1269)
	at org.eclipse.jdt.core.dom.CompilationUnitResolver.convert(CompilationUnitResolver.java:255)
	at org.eclipse.jdt.core.dom.ASTParser.internalCreateAST(ASTParser.java:900)
	at org.eclipse.jdt.core.dom.ASTParser.createAST(ASTParser.java:651)
	at org.eclipse.jdt.core.tests.dom.ConverterTestSetup.runConversion(ConverterTestSetup.java:153)
	at org.eclipse.jdt.core.tests.dom.ConverterTestSetup.runConversion(ConverterTestSetup.java:139)
	at org.eclipse.jdt.core.tests.dom.ConverterTestSetup.runConversion(ConverterTestSetup.java:135)
	at org.eclipse.jdt.core.tests.dom.ConverterTestSetup.runConversion(ConverterTestSetup.java:115)
	at org.eclipse.jdt.core.tests.dom.ASTConverterTest.test0294(ASTConverterTest.java:7084)
	at java.lang.reflect.VMReflection.invokeMethod(VMReflection.java)
	at org.eclipse.jdt.core.tests.model.SuiteOfTestCases$Suite.runTest(SuiteOfTestCases.java:99)
	at org.eclipse.jdt.core.tests.model.SuiteOfTestCases$Suite.superRun(SuiteOfTestCases.java:83)
	at org.eclipse.jdt.core.tests.model.SuiteOfTestCases$1.protect(SuiteOfTestCases.java:71)
	at org.eclipse.jdt.core.tests.model.SuiteOfTestCases$Suite.run(SuiteOfTestCases.java:80)
	at org.eclipse.test.EclipseTestRunner.run(EclipseTestRunner.java:354)
	at org.eclipse.test.EclipseTestRunner.run(EclipseTestRunner.java:206)
	at org.eclipse.test.CoreTestApplication.runTests(CoreTestApplication.java:35)
	at org.eclipse.test.CoreTestApplication.run(CoreTestApplication.java:31)
	at java.lang.reflect.VMReflection.invokeMethod(VMReflection.java)
	at org.eclipse.equinox.internal.app.EclipseAppContainer.callMethod(EclipseAppContainer.java:533)
	at org.eclipse.equinox.internal.app.EclipseAppHandle.run(EclipseAppHandle.java:155)
	at org.eclipse.core.runtime.internal.adaptor.EclipseAppLauncher.runApplication(EclipseAppLauncher.java:106)
	at org.eclipse.core.runtime.internal.adaptor.EclipseAppLauncher.start(EclipseAppLauncher.java:76)
	at org.eclipse.core.runtime.adaptor.EclipseStarter.run(EclipseStarter.java:363)
	at org.eclipse.core.runtime.adaptor.EclipseStarter.run(EclipseStarter.java:176)
	at java.lang.reflect.VMReflection.invokeMethod(VMReflection.java)
	at org.eclipse.equinox.launcher.Main.invokeFramework(Main.java:504)
	at org.eclipse.equinox.launcher.Main.basicRun(Main.java:443)
	at org.eclipse.equinox.launcher.Main.run(Main.java:1169)
	at org.eclipse.equinox.launcher.Main.main(Main.java:1144)
	at org.eclipse.core.launcher.Main.main(Main.java:30)

org.eclipse.jdt.core.tests.dom.ASTConverterTest.test0296
null
java.lang.NullPointerException
	at org.eclipse.jdt.core.dom.ASTSyntaxErrorPropagator.checkAndTagAsMalformed(ASTSyntaxErrorPropagator.java:34)
	at org.eclipse.jdt.core.dom.ASTSyntaxErrorPropagator.visit(ASTSyntaxErrorPropagator.java:117)
	at org.eclipse.jdt.core.dom.CompilationUnit.accept0(CompilationUnit.java:208)
	at org.eclipse.jdt.core.dom.ASTNode.accept(ASTNode.java:2476)
	at org.eclipse.jdt.core.dom.ASTConverter.convert(ASTConverter.java:1269)
	at org.eclipse.jdt.core.dom.CompilationUnitResolver.convert(CompilationUnitResolver.java:255)
	at org.eclipse.jdt.core.dom.ASTParser.internalCreateAST(ASTParser.java:900)
	at org.eclipse.jdt.core.dom.ASTParser.createAST(ASTParser.java:651)
	at org.eclipse.jdt.core.tests.dom.ConverterTestSetup.runConversion(ConverterTestSetup.java:153)
	at org.eclipse.jdt.core.tests.dom.ConverterTestSetup.runConversion(ConverterTestSetup.java:139)
	at org.eclipse.jdt.core.tests.dom.ConverterTestSetup.runConversion(ConverterTestSetup.java:135)
	at org.eclipse.jdt.core.tests.dom.ConverterTestSetup.runConversion(ConverterTestSetup.java:115)
	at org.eclipse.jdt.core.tests.dom.ASTConverterTest.test0296(ASTConverterTest.java:7138)
	at java.lang.reflect.VMReflection.invokeMethod(VMReflection.java)
	at org.eclipse.jdt.core.tests.model.SuiteOfTestCases$Suite.runTest(SuiteOfTestCases.java:99)
	at org.eclipse.jdt.core.tests.model.SuiteOfTestCases$Suite.superRun(SuiteOfTestCases.java:83)
	at org.eclipse.jdt.core.tests.model.SuiteOfTestCases$1.protect(SuiteOfTestCases.java:71)
	at org.eclipse.jdt.core.tests.model.SuiteOfTestCases$Suite.run(SuiteOfTestCases.java:80)
	at org.eclipse.test.EclipseTestRunner.run(EclipseTestRunner.java:354)
	at org.eclipse.test.EclipseTestRunner.run(EclipseTestRunner.java:206)
	at org.eclipse.test.CoreTestApplication.runTests(CoreTestApplication.java:35)
	at org.eclipse.test.CoreTestApplication.run(CoreTestApplication.java:31)
	at java.lang.reflect.VMReflection.invokeMethod(VMReflection.java)
	at org.eclipse.equinox.internal.app.EclipseAppContainer.callMethod(EclipseAppContainer.java:533)
	at org.eclipse.equinox.internal.app.EclipseAppHandle.run(EclipseAppHandle.java:155)
	at org.eclipse.core.runtime.internal.adaptor.EclipseAppLauncher.runApplication(EclipseAppLauncher.java:106)
	at org.eclipse.core.runtime.internal.adaptor.EclipseAppLauncher.start(EclipseAppLauncher.java:76)
	at org.eclipse.core.runtime.adaptor.EclipseStarter.run(EclipseStarter.java:363)
	at org.eclipse.core.runtime.adaptor.EclipseStarter.run(EclipseStarter.java:176)
	at java.lang.reflect.VMReflection.invokeMethod(VMReflection.java)
	at org.eclipse.equinox.launcher.Main.invokeFramework(Main.java:504)
	at org.eclipse.equinox.launcher.Main.basicRun(Main.java:443)
	at org.eclipse.equinox.launcher.Main.run(Main.java:1169)
	at org.eclipse.equinox.launcher.Main.main(Main.java:1144)
	at org.eclipse.core.launcher.Main.main(Main.java:30)

org.eclipse.jdt.core.tests.dom.ASTConverterTest.test0316
null
java.lang.NullPointerException
	at org.eclipse.jdt.core.dom.ASTSyntaxErrorPropagator.checkAndTagAsMalformed(ASTSyntaxErrorPropagator.java:34)
	at org.eclipse.jdt.core.dom.ASTSyntaxErrorPropagator.visit(ASTSyntaxErrorPropagator.java:117)
	at org.eclipse.jdt.core.dom.CompilationUnit.accept0(CompilationUnit.java:208)
	at org.eclipse.jdt.core.dom.ASTNode.accept(ASTNode.java:2476)
	at org.eclipse.jdt.core.dom.ASTConverter.convert(ASTConverter.java:1269)
	at org.eclipse.jdt.core.dom.CompilationUnitResolver.convert(CompilationUnitResolver.java:255)
	at org.eclipse.jdt.core.dom.ASTParser.internalCreateAST(ASTParser.java:900)
	at org.eclipse.jdt.core.dom.ASTParser.createAST(ASTParser.java:651)
	at org.eclipse.jdt.core.tests.dom.ConverterTestSetup.runConversion(ConverterTestSetup.java:153)
	at org.eclipse.jdt.core.tests.dom.ConverterTestSetup.runConversion(ConverterTestSetup.java:139)
	at org.eclipse.jdt.core.tests.dom.ConverterTestSetup.runConversion(ConverterTestSetup.java:135)
	at org.eclipse.jdt.core.tests.dom.ConverterTestSetup.runConversion(ConverterTestSetup.java:115)
	at org.eclipse.jdt.core.tests.dom.ASTConverterTest.test0316(ASTConverterTest.java:7652)
	at java.lang.reflect.VMReflection.invokeMethod(VMReflection.java)
	at org.eclipse.jdt.core.tests.model.SuiteOfTestCases$Suite.runTest(SuiteOfTestCases.java:99)
	at org.eclipse.jdt.core.tests.model.SuiteOfTestCases$Suite.superRun(SuiteOfTestCases.java:83)
	at org.eclipse.jdt.core.tests.model.SuiteOfTestCases$1.protect(SuiteOfTestCases.java:71)
	at org.eclipse.jdt.core.tests.model.SuiteOfTestCases$Suite.run(SuiteOfTestCases.java:80)
	at org.eclipse.test.EclipseTestRunner.run(EclipseTestRunner.java:354)
	at org.eclipse.test.EclipseTestRunner.run(EclipseTestRunner.java:206)
	at org.eclipse.test.CoreTestApplication.runTests(CoreTestApplication.java:35)
	at org.eclipse.test.CoreTestApplication.run(CoreTestApplication.java:31)
	at java.lang.reflect.VMReflection.invokeMethod(VMReflection.java)
	at org.eclipse.equinox.internal.app.EclipseAppContainer.callMethod(EclipseAppContainer.java:533)
	at org.eclipse.equinox.internal.app.EclipseAppHandle.run(EclipseAppHandle.java:155)
	at org.eclipse.core.runtime.internal.adaptor.EclipseAppLauncher.runApplication(EclipseAppLauncher.java:106)
	at org.eclipse.core.runtime.internal.adaptor.EclipseAppLauncher.start(EclipseAppLauncher.java:76)
	at org.eclipse.core.runtime.adaptor.EclipseStarter.run(EclipseStarter.java:363)
	at org.eclipse.core.runtime.adaptor.EclipseStarter.run(EclipseStarter.java:176)
	at java.lang.reflect.VMReflection.invokeMethod(VMReflection.java)
	at org.eclipse.equinox.launcher.Main.invokeFramework(Main.java:504)
	at org.eclipse.equinox.launcher.Main.basicRun(Main.java:443)
	at org.eclipse.equinox.launcher.Main.run(Main.java:1169)
	at org.eclipse.equinox.launcher.Main.main(Main.java:1144)
	at org.eclipse.core.launcher.Main.main(Main.java:30)

...Skipped the rest of reports...

================================================
Unexpected failures : 7

org.eclipse.core.tests.internal.preferences.EclipsePreferencesTest.testLegacy
3.0 expected:<value.1196845938159-0.8950811314968541> but was:<null>
junit.framework.ComparisonFailure: 3.0 expected:<value.1196845938159-0.8950811314968541> but was:<null>
	at org.eclipse.core.tests.internal.preferences.EclipsePreferencesTest.testLegacy(EclipsePreferencesTest.java:974)
	at java.lang.reflect.VMReflection.invokeMethod(VMReflection.java)
	at org.eclipse.test.EclipseTestRunner.run(EclipseTestRunner.java:354)
	at org.eclipse.test.EclipseTestRunner.run(EclipseTestRunner.java:206)
	at org.eclipse.test.CoreTestApplication.runTests(CoreTestApplication.java:35)
	at org.eclipse.test.CoreTestApplication.run(CoreTestApplication.java:31)
	at java.lang.reflect.VMReflection.invokeMethod(VMReflection.java)
	at org.eclipse.equinox.internal.app.EclipseAppContainer.callMethod(EclipseAppContainer.java:533)
	at org.eclipse.equinox.internal.app.EclipseAppHandle.run(EclipseAppHandle.java:155)
	at org.eclipse.core.runtime.internal.adaptor.EclipseAppLauncher.runApplication(EclipseAppLauncher.java:106)
	at org.eclipse.core.runtime.internal.adaptor.EclipseAppLauncher.start(EclipseAppLauncher.java:76)
	at org.eclipse.core.runtime.adaptor.EclipseStarter.run(EclipseStarter.java:363)
	at org.eclipse.core.runtime.adaptor.EclipseStarter.run(EclipseStarter.java:176)
	at java.lang.reflect.VMReflection.invokeMethod(VMReflection.java)
	at org.eclipse.equinox.launcher.Main.invokeFramework(Main.java:504)
	at org.eclipse.equinox.launcher.Main.basicRun(Main.java:443)
	at org.eclipse.equinox.launcher.Main.run(Main.java:1169)
	at org.eclipse.equinox.launcher.Main.main(Main.java:1144)
	at org.eclipse.core.launcher.Main.main(Main.java:30)

org.eclipse.jdt.core.tests.builder.BuildpathTests.testClosedProject
Unexpected problem(s)!!!. ----------- Expected ------------  ------------ but was ------------ Problem : The project cannot be built until its prerequisite CP1 is built. Cleaning and building all projects is recommended [ resource : </CP2> range : <-1,-1> category : <10> severity : <2>]  --------- Difference is ----------  expected:<[]> but was:<[Problem : The project cannot be built until its prerequisite CP1 is built. Cleaning and building all projects is recommended [ resource : </CP2> range : <-1,-1> category : <10> severity : <2>] ]>
junit.framework.ComparisonFailure: Unexpected problem(s)!!!.
----------- Expected ------------

------------ but was ------------
Problem : The project cannot be built until its prerequisite CP1 is built. Cleaning and building all projects is recommended [ resource : </CP2> range : <-1,-1> category : <10> severity : <2>]

--------- Difference is ----------
 expected:<[]> but was:<[Problem : The project cannot be built until its prerequisite CP1 is built. Cleaning and building all projects is recommended [ resource : </CP2> range : <-1,-1> category : <10> severity : <2>]
]>
	at org.eclipse.jdt.core.tests.junit.extension.TestCase.assertStringEquals(TestCase.java:234)
	at org.eclipse.jdt.core.tests.junit.extension.TestCase.assumeEquals(TestCase.java:254)
	at org.eclipse.jdt.core.tests.builder.BuilderTests.expectingNoProblemsFor(BuilderTests.java:206)
	at org.eclipse.jdt.core.tests.builder.BuilderTests.expectingNoProblemsFor(BuilderTests.java:192)
	at org.eclipse.jdt.core.tests.builder.BuilderTests.expectingNoProblems(BuilderTests.java:186)
	at org.eclipse.jdt.core.tests.builder.BuildpathTests.testClosedProject(BuildpathTests.java:143)
	at java.lang.reflect.VMReflection.invokeMethod(VMReflection.java)
	at org.eclipse.test.EclipseTestRunner.run(EclipseTestRunner.java:354)
	at org.eclipse.test.EclipseTestRunner.run(EclipseTestRunner.java:206)
	at org.eclipse.test.CoreTestApplication.runTests(CoreTestApplication.java:35)
	at org.eclipse.test.CoreTestApplication.run(CoreTestApplication.java:31)
	at java.lang.reflect.VMReflection.invokeMethod(VMReflection.java)
	at org.eclipse.equinox.internal.app.EclipseAppContainer.callMethod(EclipseAppContainer.java:533)
	at org.eclipse.equinox.internal.app.EclipseAppHandle.run(EclipseAppHandle.java:155)
	at org.eclipse.core.runtime.internal.adaptor.EclipseAppLauncher.runApplication(EclipseAppLauncher.java:106)
	at org.eclipse.core.runtime.internal.adaptor.EclipseAppLauncher.start(EclipseAppLauncher.java:76)
	at org.eclipse.core.runtime.adaptor.EclipseStarter.run(EclipseStarter.java:363)
	at org.eclipse.core.runtime.adaptor.EclipseStarter.run(EclipseStarter.java:176)
	at java.lang.reflect.VMReflection.invokeMethod(VMReflection.java)
	at org.eclipse.equinox.launcher.Main.invokeFramework(Main.java:504)
	at org.eclipse.equinox.launcher.Main.basicRun(Main.java:443)
	at org.eclipse.equinox.launcher.Main.run(Main.java:1169)
	at org.eclipse.equinox.launcher.Main.main(Main.java:1144)
	at org.eclipse.core.launcher.Main.main(Main.java:30)

org.eclipse.jdt.core.tests.model.ReconcilerTests.testReconcileParticipant03
Unexpected participant ast. ----------- Expected ------------ package p1;\n import p2.*;\n public class X {\n   public void bar(){\n   }\n }\n  ------------ but was ------------ null --------- Difference is ----------  expected:<[package p1;\n import p2.*;\n public class X {\n   public void bar(){\n   }\n }\n ]> but was:<[null]>
junit.framework.ComparisonFailure: Unexpected participant ast.
----------- Expected ------------
package p1;\n
import p2.*;\n
public class X {\n
  public void bar(){\n
  }\n
}\n

------------ but was ------------
null
--------- Difference is ----------
 expected:<[package p1;\n
import p2.*;\n
public class X {\n
  public void bar(){\n
  }\n
}\n
]> but was:<[null]>
	at org.eclipse.jdt.core.tests.junit.extension.TestCase.assertStringEquals(TestCase.java:226)
	at org.eclipse.jdt.core.tests.junit.extension.TestCase.assertEquals(TestCase.java:201)
	at org.eclipse.jdt.core.tests.model.AbstractJavaModelTests.assertSourceEquals(AbstractJavaModelTests.java:541)
	at org.eclipse.jdt.core.tests.model.AbstractJavaModelTests.assertASTNodeEquals(AbstractJavaModelTests.java:548)
	at org.eclipse.jdt.core.tests.model.ReconcilerTests.testReconcileParticipant03(ReconcilerTests.java:2367)
	at java.lang.reflect.VMReflection.invokeMethod(VMReflection.java)
	at org.eclipse.jdt.core.tests.model.SuiteOfTestCases$Suite.runTest(SuiteOfTestCases.java:99)
	at org.eclipse.jdt.core.tests.model.SuiteOfTestCases$Suite.superRun(SuiteOfTestCases.java:83)
	at org.eclipse.jdt.core.tests.model.SuiteOfTestCases$1.protect(SuiteOfTestCases.java:71)
	at org.eclipse.jdt.core.tests.model.SuiteOfTestCases$Suite.run(SuiteOfTestCases.java:80)
	at org.eclipse.test.EclipseTestRunner.run(EclipseTestRunner.java:354)
	at org.eclipse.test.EclipseTestRunner.run(EclipseTestRunner.java:206)
	at org.eclipse.test.CoreTestApplication.runTests(CoreTestApplication.java:35)
	at org.eclipse.test.CoreTestApplication.run(CoreTestApplication.java:31)
	at java.lang.reflect.VMReflection.invokeMethod(VMReflection.java)
	at org.eclipse.equinox.internal.app.EclipseAppContainer.callMethod(EclipseAppContainer.java:533)
	at org.eclipse.equinox.internal.app.EclipseAppHandle.run(EclipseAppHandle.java:155)
	at org.eclipse.core.runtime.internal.adaptor.EclipseAppLauncher.runApplication(EclipseAppLauncher.java:106)
	at org.eclipse.core.runtime.internal.adaptor.EclipseAppLauncher.start(EclipseAppLauncher.java:76)
	at org.eclipse.core.runtime.adaptor.EclipseStarter.run(EclipseStarter.java:363)
	at org.eclipse.core.runtime.adaptor.EclipseStarter.run(EclipseStarter.java:176)
	at java.lang.reflect.VMReflection.invokeMethod(VMReflection.java)
	at org.eclipse.equinox.launcher.Main.invokeFramework(Main.java:504)
	at org.eclipse.equinox.launcher.Main.basicRun(Main.java:443)
	at org.eclipse.equinox.launcher.Main.run(Main.java:1169)
	at org.eclipse.equinox.launcher.Main.main(Main.java:1144)
	at org.eclipse.core.launcher.Main.main(Main.java:30)

org.eclipse.osgi.tests.bundles.ClassLoadingBundleTests.testStartTransientByLoadClass
compareResults length expected:<1> but was:<9>
junit.framework.AssertionFailedError: compareResults length expected:<1> but was:<9>
	at org.eclipse.osgi.tests.bundles.AbstractBundleTests.compareResults(AbstractBundleTests.java:55)
	at org.eclipse.osgi.tests.bundles.ClassLoadingBundleTests.testStartTransientByLoadClass(ClassLoadingBundleTests.java:217)
	at java.lang.reflect.VMReflection.invokeMethod(VMReflection.java)
	at org.eclipse.test.EclipseTestRunner.run(EclipseTestRunner.java:354)
	at org.eclipse.test.EclipseTestRunner.run(EclipseTestRunner.java:206)
	at org.eclipse.test.CoreTestApplication.runTests(CoreTestApplication.java:35)
	at org.eclipse.test.CoreTestApplication.run(CoreTestApplication.java:31)
	at java.lang.reflect.VMReflection.invokeMethod(VMReflection.java)
	at org.eclipse.equinox.internal.app.EclipseAppContainer.callMethod(EclipseAppContainer.java:533)
	at org.eclipse.equinox.internal.app.EclipseAppHandle.run(EclipseAppHandle.java:155)
	at org.eclipse.core.runtime.internal.adaptor.EclipseAppLauncher.runApplication(EclipseAppLauncher.java:106)
	at org.eclipse.core.runtime.internal.adaptor.EclipseAppLauncher.start(EclipseAppLauncher.java:76)
	at org.eclipse.core.runtime.adaptor.EclipseStarter.run(EclipseStarter.java:363)
	at org.eclipse.core.runtime.adaptor.EclipseStarter.run(EclipseStarter.java:176)
	at java.lang.reflect.VMReflection.invokeMethod(VMReflection.java)
	at org.eclipse.equinox.launcher.Main.invokeFramework(Main.java:504)
	at org.eclipse.equinox.launcher.Main.basicRun(Main.java:443)
	at org.eclipse.equinox.launcher.Main.run(Main.java:1169)
	at org.eclipse.equinox.launcher.Main.main(Main.java:1144)
	at org.eclipse.core.launcher.Main.main(Main.java:30)

org.eclipse.osgi.tests.bundles.ClassLoadingBundleTests.testStartTransient
compareResults length expected:<1> but was:<9>
junit.framework.AssertionFailedError: compareResults length expected:<1> but was:<9>
	at org.eclipse.osgi.tests.bundles.AbstractBundleTests.compareResults(AbstractBundleTests.java:55)
	at org.eclipse.osgi.tests.bundles.ClassLoadingBundleTests.testStartTransient(ClassLoadingBundleTests.java:288)
	at java.lang.reflect.VMReflection.invokeMethod(VMReflection.java)
	at org.eclipse.test.EclipseTestRunner.run(EclipseTestRunner.java:354)
	at org.eclipse.test.EclipseTestRunner.run(EclipseTestRunner.java:206)
	at org.eclipse.test.CoreTestApplication.runTests(CoreTestApplication.java:35)
	at org.eclipse.test.CoreTestApplication.run(CoreTestApplication.java:31)
	at java.lang.reflect.VMReflection.invokeMethod(VMReflection.java)
	at org.eclipse.equinox.internal.app.EclipseAppContainer.callMethod(EclipseAppContainer.java:533)
	at org.eclipse.equinox.internal.app.EclipseAppHandle.run(EclipseAppHandle.java:155)
	at org.eclipse.core.runtime.internal.adaptor.EclipseAppLauncher.runApplication(EclipseAppLauncher.java:106)
	at org.eclipse.core.runtime.internal.adaptor.EclipseAppLauncher.start(EclipseAppLauncher.java:76)
	at org.eclipse.core.runtime.adaptor.EclipseStarter.run(EclipseStarter.java:363)
	at org.eclipse.core.runtime.adaptor.EclipseStarter.run(EclipseStarter.java:176)
	at java.lang.reflect.VMReflection.invokeMethod(VMReflection.java)
	at org.eclipse.equinox.launcher.Main.invokeFramework(Main.java:504)
	at org.eclipse.equinox.launcher.Main.basicRun(Main.java:443)
	at org.eclipse.equinox.launcher.Main.run(Main.java:1169)
	at org.eclipse.equinox.launcher.Main.main(Main.java:1144)
	at org.eclipse.core.launcher.Main.main(Main.java:30)

org.eclipse.osgi.tests.bundles.ClassLoadingBundleTests.testStopTransient
compareResults length expected:<1> but was:<9>
junit.framework.AssertionFailedError: compareResults length expected:<1> but was:<9>
	at org.eclipse.osgi.tests.bundles.AbstractBundleTests.compareResults(AbstractBundleTests.java:55)
	at org.eclipse.osgi.tests.bundles.ClassLoadingBundleTests.testStopTransient(ClassLoadingBundleTests.java:366)
	at java.lang.reflect.VMReflection.invokeMethod(VMReflection.java)
	at org.eclipse.test.EclipseTestRunner.run(EclipseTestRunner.java:354)
	at org.eclipse.test.EclipseTestRunner.run(EclipseTestRunner.java:206)
	at org.eclipse.test.CoreTestApplication.runTests(CoreTestApplication.java:35)
	at org.eclipse.test.CoreTestApplication.run(CoreTestApplication.java:31)
	at java.lang.reflect.VMReflection.invokeMethod(VMReflection.java)
	at org.eclipse.equinox.internal.app.EclipseAppContainer.callMethod(EclipseAppContainer.java:533)
	at org.eclipse.equinox.internal.app.EclipseAppHandle.run(EclipseAppHandle.java:155)
	at org.eclipse.core.runtime.internal.adaptor.EclipseAppLauncher.runApplication(EclipseAppLauncher.java:106)
	at org.eclipse.core.runtime.internal.adaptor.EclipseAppLauncher.start(EclipseAppLauncher.java:76)
	at org.eclipse.core.runtime.adaptor.EclipseStarter.run(EclipseStarter.java:363)
	at org.eclipse.core.runtime.adaptor.EclipseStarter.run(EclipseStarter.java:176)
	at java.lang.reflect.VMReflection.invokeMethod(VMReflection.java)
	at org.eclipse.equinox.launcher.Main.invokeFramework(Main.java:504)
	at org.eclipse.equinox.launcher.Main.basicRun(Main.java:443)
	at org.eclipse.equinox.launcher.Main.run(Main.java:1169)
	at org.eclipse.equinox.launcher.Main.main(Main.java:1144)
	at org.eclipse.core.launcher.Main.main(Main.java:30)

org.eclipse.releng.tests.BuildTests.testVersionCompare
output file is null
junit.framework.AssertionFailedError: output file is null
	at org.eclipse.releng.tests.BuildTests.verifyCompareResults(BuildTests.java:771)
	at org.eclipse.releng.tests.BuildTests.testVersionCompare(BuildTests.java:904)
	at java.lang.reflect.VMReflection.invokeMethod(VMReflection.java)
	at org.eclipse.test.EclipseTestRunner.run(EclipseTestRunner.java:354)
	at org.eclipse.test.EclipseTestRunner.run(EclipseTestRunner.java:206)
	at org.eclipse.test.CoreTestApplication.runTests(CoreTestApplication.java:35)
	at org.eclipse.test.CoreTestApplication.run(CoreTestApplication.java:31)
	at java.lang.reflect.VMReflection.invokeMethod(VMReflection.java)
	at org.eclipse.equinox.internal.app.EclipseAppContainer.callMethod(EclipseAppContainer.java:533)
	at org.eclipse.equinox.internal.app.EclipseAppHandle.run(EclipseAppHandle.java:155)
	at org.eclipse.core.runtime.internal.adaptor.EclipseAppLauncher.runApplication(EclipseAppLauncher.java:106)
	at org.eclipse.core.runtime.internal.adaptor.EclipseAppLauncher.start(EclipseAppLauncher.java:76)
	at org.eclipse.core.runtime.adaptor.EclipseStarter.run(EclipseStarter.java:363)
	at org.eclipse.core.runtime.adaptor.EclipseStarter.run(EclipseStarter.java:176)
	at java.lang.reflect.VMReflection.invokeMethod(VMReflection.java)
	at org.eclipse.equinox.launcher.Main.invokeFramework(Main.java:504)
	at org.eclipse.equinox.launcher.Main.basicRun(Main.java:443)
	at org.eclipse.equinox.launcher.Main.run(Main.java:1169)
	at org.eclipse.equinox.launcher.Main.main(Main.java:1144)
	at org.eclipse.core.launcher.Main.main(Main.java:30)

BUILD FAILED:
	Ant Error Message:
/export/users/cc/cc-eut33/scripts/cc-exec-adaptor.xml:104: The following error occurred while executing this line: /export/users/cc/cc-eut33/adaptors/eut33/adaptor.xml:59: The following error occurred while executing this line: /export/users/cc/cc-eut33/tests/eut/build.xml:430: EUT failed: There are unexpected failures

Date of build:	2007-12-05 15:02:14 +0600
Time to build:	638 minutes 28 seconds

***********************************************************
Errors/Warnings:	(386)
            
File /export/users/cc/cc-eut33/tests/eut/config/eut3.3.linux.efl does not exist.
Java Result: 1
[exec] Result: 1
[exec] Result: 2
[java] Java Result: 1
[move] Warning: /export/users/cc/cc-eut33/build/checkouts/eut33/eclipse-testing/results/chkpii not found.
[java] Java Result: 2
[java] Java Result: 1
[java] Timeout: killed the sub-process
[java] 	at org.apache.tools.ant.taskdefs.Java.fork(Java.java:770)
[java] 	at org.apache.tools.ant.taskdefs.Java.executeJava(Java.java:194)
[java] 	at org.apache.tools.ant.taskdefs.Java.execute(Java.java:104)
[java] 	at org.apache.tools.ant.UnknownElement.execute(UnknownElement.java:288)
[java] 	at sun.reflect.GeneratedMethodAccessor2.invoke(Unknown Source)
[java] 	at sun.reflect.DelegatingMethodAccessorImpl.invoke(DelegatingMethodAccessorImpl.java:25)
[java] 	at java.lang.reflect.Method.invoke(Method.java:585)
[java] 	at org.apache.tools.ant.dispatch.DispatchUtils.execute(DispatchUtils.java:105)
[java] 	at org.apache.tools.ant.Task.perform(Task.java:348)
[java] 	at org.apache.tools.ant.Target.execute(Target.java:357)
[java] 	at org.apache.tools.ant.Target.performTasks(Target.java:385)
[java] 	at org.apache.tools.ant.Project.executeSortedTargets(Project.java:1329)
[java] 	at org.apache.tools.ant.helper.SingleCheckExecutor.executeTargets(SingleCheckExecutor.java:38)
[java] 	at org.eclipse.ant.internal.core.ant.EclipseSingleCheckExecutor.executeTargets(EclipseSingleCheckExecutor.java:30)
[java] 	at org.apache.tools.ant.Project.executeTargets(Project.java:1181)
[java] 	at org.apache.tools.ant.taskdefs.Ant.execute(Ant.java:416)
[java] 	at org.apache.tools.ant.taskdefs.CallTarget.execute(CallTarget.java:105)
[java] 	at org.apache.tools.ant.UnknownElement.execute(UnknownElement.java:288)
[java] 	at sun.reflect.GeneratedMethodAccessor2.invoke(Unknown Source)
[java] 	at sun.reflect.DelegatingMethodAccessorImpl.invoke(DelegatingMethodAccessorImpl.java:25)
[java] 	at java.lang.reflect.Method.invoke(Method.java:585)
[java] 	at org.apache.tools.ant.dispatch.DispatchUtils.execute(DispatchUtils.java:105)
[java] 	at org.apache.tools.ant.Task.perform(Task.java:348)
[java] 	at org.apache.tools.ant.Target.execute(Target.java:357)
[java] 	at org.apache.tools.ant.Target.performTasks(Target.java:385)
[java] 	at org.apache.tools.ant.Project.executeSortedTargets(Project.java:1329)
[java] 	at org.apache.tools.ant.helper.SingleCheckExecutor.executeTargets(SingleCheckExecutor.java:38)
[java] 	at org.eclipse.ant.internal.core.ant.EclipseSingleCheckExecutor.executeTargets(EclipseSingleCheckExecutor.java:30)
[java] 	at org.apache.tools.ant.Project.executeTargets(Project.java:1181)
[java] 	at org.apache.tools.ant.taskdefs.Ant.execute(Ant.java:416)
[java] 	at org.apache.tools.ant.UnknownElement.execute(UnknownElement.java:288)
[java] 	at sun.reflect.GeneratedMethodAccessor2.invoke(Unknown Source)
[java] 	at sun.reflect.DelegatingMethodAccessorImpl.invoke(DelegatingMethodAccessorImpl.java:25)
[java] 	at java.lang.reflect.Method.invoke(Method.java:585)
[java] 	at org.apache.tools.ant.dispatch.DispatchUtils.execute(DispatchUtils.java:105)
[java] 	at org.apache.tools.ant.Task.perform(Task.java:348)
[java] 	at org.apache.tools.ant.Target.execute(Target.java:357)
[java] 	at org.apache.tools.ant.Target.performTasks(Target.java:385)
[java] 	at org.apache.tools.ant.Project.executeSortedTargets(Project.java:1329)
[java] 	at org.apache.tools.ant.helper.SingleCheckExecutor.executeTargets(SingleCheckExecutor.java:38)
[java] 	at org.eclipse.ant.internal.core.ant.EclipseSingleCheckExecutor.executeTargets(EclipseSingleCheckExecutor.java:30)
[java] 	at org.apache.tools.ant.Project.executeTargets(Project.java:1181)
[java] 	at org.apache.tools.ant.taskdefs.Ant.execute(Ant.java:416)
[java] 	at org.apache.tools.ant.UnknownElement.execute(UnknownElement.java:288)
[java] 	at sun.reflect.GeneratedMethodAccessor2.invoke(Unknown Source)
[java] 	at sun.reflect.DelegatingMethodAccessorImpl.invoke(DelegatingMethodAccessorImpl.java:25)
[java] 	at java.lang.reflect.Method.invoke(Method.java:585)
[java] 	at org.apache.tools.ant.dispatch.DispatchUtils.execute(DispatchUtils.java:105)
[java] 	at org.apache.tools.ant.Task.perform(Task.java:348)
[java] 	at org.apache.tools.ant.Target.execute(Target.java:357)
[java] 	at org.apache.tools.ant.Target.performTasks(Target.java:385)
[java] 	at org.apache.tools.ant.Project.executeSortedTargets(Project.java:1329)
[java] 	at org.apache.tools.ant.helper.SingleCheckExecutor.executeTargets(SingleCheckExecutor.java:38)
[java] 	at org.eclipse.ant.internal.core.ant.EclipseSingleCheckExecutor.executeTargets(EclipseSingleCheckExecutor.java:30)
[java] 	at org.apache.tools.ant.Project.executeTargets(Project.java:1181)
[java] 	at org.apache.tools.ant.taskdefs.Ant.execute(Ant.java:416)
[java] 	at org.apache.tools.ant.taskdefs.CallTarget.execute(CallTarget.java:105)
[java] 	at org.apache.tools.ant.UnknownElement.execute(UnknownElement.java:288)
[java] 	at sun.reflect.GeneratedMethodAccessor2.invoke(Unknown Source)
[java] 	at sun.reflect.DelegatingMethodAccessorImpl.invoke(DelegatingMethodAccessorImpl.java:25)
[java] 	at java.lang.reflect.Method.invoke(Method.java:585)
[java] 	at org.apache.tools.ant.dispatch.DispatchUtils.execute(DispatchUtils.java:105)
[java] 	at org.apache.tools.ant.Task.perform(Task.java:348)
[java] 	at org.apache.tools.ant.taskdefs.Sequential.execute(Sequential.java:62)
[java] 	at org.apache.tools.ant.UnknownElement.execute(UnknownElement.java:288)
[java] 	at sun.reflect.GeneratedMethodAccessor2.invoke(Unknown Source)
[java] 	at sun.reflect.DelegatingMethodAccessorImpl.invoke(DelegatingMethodAccessorImpl.java:25)
[java] 	at java.lang.reflect.Method.invoke(Method.java:585)
[java] 	at org.apache.tools.ant.dispatch.DispatchUtils.execute(DispatchUtils.java:105)
[java] 	at org.apache.tools.ant.Task.perform(Task.java:348)
[java] 	at org.apache.tools.ant.taskdefs.MacroInstance.execute(MacroInstance.java:391)
[java] 	at org.apache.tools.ant.UnknownElement.execute(UnknownElement.java:288)
[java] 	at sun.reflect.GeneratedMethodAccessor2.invoke(Unknown Source)
[java] 	at sun.reflect.DelegatingMethodAccessorImpl.invoke(DelegatingMethodAccessorImpl.java:25)
[java] 	at java.lang.reflect.Method.invoke(Method.java:585)
[java] 	at org.apache.tools.ant.dispatch.DispatchUtils.execute(DispatchUtils.java:105)
[java] 	at org.apache.tools.ant.Task.perform(Task.java:348)
[java] 	at org.apache.tools.ant.Target.execute(Target.java:357)
[java] 	at org.apache.tools.ant.Target.performTasks(Target.java:385)
[java] 	at org.apache.tools.ant.Project.executeSortedTargets(Project.java:1329)
[java] 	at org.apache.tools.ant.helper.SingleCheckExecutor.executeTargets(SingleCheckExecutor.java:38)
[java] 	at org.eclipse.ant.internal.core.ant.EclipseSingleCheckExecutor.executeTargets(EclipseSingleCheckExecutor.java:30)
[java] 	at org.apache.tools.ant.Project.executeTargets(Project.java:1181)
[java] 	at org.apache.tools.ant.taskdefs.Ant.execute(Ant.java:416)
[java] 	at org.apache.tools.ant.taskdefs.CallTarget.execute(CallTarget.java:105)
[java] 	at org.apache.tools.ant.UnknownElement.execute(UnknownElement.java:288)
[java] 	at sun.reflect.GeneratedMethodAccessor2.invoke(Unknown Source)
[java] 	at sun.reflect.DelegatingMethodAccessorImpl.invoke(DelegatingMethodAccessorImpl.java:25)
[java] 	at java.lang.reflect.Method.invoke(Method.java:585)
[java] 	at org.apache.tools.ant.dispatch.DispatchUtils.execute(DispatchUtils.java:105)
[java] 	at org.apache.tools.ant.Task.perform(Task.java:348)
[java] 	at org.apache.tools.ant.Target.execute(Target.java:357)
[java] 	at org.apache.tools.ant.Target.performTasks(Target.java:385)
[java] 	at org.apache.tools.ant.Project.executeSortedTargets(Project.java:1329)
[java] 	at org.apache.tools.ant.Project.executeTarget(Project.java:1298)
[java] 	at org.apache.tools.ant.helper.DefaultExecutor.executeTargets(DefaultExecutor.java:41)
[java] 	at org.eclipse.ant.internal.core.ant.EclipseDefaultExecutor.executeTargets(EclipseDefaultExecutor.java:32)
[java] 	at org.apache.tools.ant.Project.executeTargets(Project.java:1181)
[java] 	at org.eclipse.ant.internal.core.ant.InternalAntRunner.run(InternalAntRunner.java:623)
[java] 	at org.eclipse.ant.internal.core.ant.InternalAntRunner.run(InternalAntRunner.java:495)
[java] 	at sun.reflect.NativeMethodAccessorImpl.invoke0(Native Method)
[java] 	at sun.reflect.NativeMethodAccessorImpl.invoke(NativeMethodAccessorImpl.java:39)
[java] 	at sun.reflect.DelegatingMethodAccessorImpl.invoke(DelegatingMethodAccessorImpl.java:25)
[java] 	at java.lang.reflect.Method.invoke(Method.java:585)
[java] 	at org.eclipse.ant.core.AntRunner.run(AntRunner.java:512)
[java] 	at org.eclipse.ant.core.AntRunner.start(AntRunner.java:599)
[java] 	at org.eclipse.equinox.internal.app.EclipseAppHandle.run(EclipseAppHandle.java:153)
[java] 	at org.eclipse.core.runtime.internal.adaptor.EclipseAppLauncher.runApplication(EclipseAppLauncher.java:106)
[java] 	at org.eclipse.core.runtime.internal.adaptor.EclipseAppLauncher.start(EclipseAppLauncher.java:76)
[java] 	at org.eclipse.core.runtime.adaptor.EclipseStarter.run(EclipseStarter.java:363)
[java] 	at org.eclipse.core.runtime.adaptor.EclipseStarter.run(EclipseStarter.java:176)
[java] 	at sun.reflect.NativeMethodAccessorImpl.invoke0(Native Method)
[java] 	at sun.reflect.NativeMethodAccessorImpl.invoke(NativeMethodAccessorImpl.java:39)
[java] 	at sun.reflect.DelegatingMethodAccessorImpl.invoke(DelegatingMethodAccessorImpl.java:25)
[java] 	at java.lang.reflect.Method.invoke(Method.java:585)
[java] 	at org.eclipse.equinox.launcher.Main.invokeFramework(Main.java:504)
[java] 	at org.eclipse.equinox.launcher.Main.basicRun(Main.java:443)
[java] 	at org.eclipse.equinox.launcher.Main.run(Main.java:1169)
[java] 	at org.eclipse.equinox.launcher.Main.main(Main.java:1144)
[java] Java Result: 1
[java] Java Result: 2
[java] Java Result: 2
[java] Java Result: 1
[java] Java Result: 1
[java] Java Result: 2
[java] Java Result: 2
[java] Java Result: 2
[java] Java Result: 1
[java] Java Result: 2
[copy] Warning: Could not find file /export/users/cc/cc-eut33/build/checkouts/eut33/eclipse-testing/test-eclipse/eclipse/org.eclipse.ui.tests.performance.xml to copy.
[java] Timeout: killed the sub-process
[java] 	at org.apache.tools.ant.taskdefs.Java.fork(Java.java:770)
[java] 	at org.apache.tools.ant.taskdefs.Java.executeJava(Java.java:194)
[java] 	at org.apache.tools.ant.taskdefs.Java.execute(Java.java:104)
[java] 	at org.apache.tools.ant.UnknownElement.execute(UnknownElement.java:288)
[java] 	at sun.reflect.GeneratedMethodAccessor2.invoke(Unknown Source)
[java] 	at sun.reflect.DelegatingMethodAccessorImpl.invoke(DelegatingMethodAccessorImpl.java:25)
[java] 	at java.lang.reflect.Method.invoke(Method.java:585)
[java] 	at org.apache.tools.ant.dispatch.DispatchUtils.execute(DispatchUtils.java:105)
[java] 	at org.apache.tools.ant.Task.perform(Task.java:348)
[java] 	at org.apache.tools.ant.Target.execute(Target.java:357)
[java] 	at org.apache.tools.ant.Target.performTasks(Target.java:385)
[java] 	at org.apache.tools.ant.Project.executeSortedTargets(Project.java:1329)
[java] 	at org.apache.tools.ant.helper.SingleCheckExecutor.executeTargets(SingleCheckExecutor.java:38)
[java] 	at org.eclipse.ant.internal.core.ant.EclipseSingleCheckExecutor.executeTargets(EclipseSingleCheckExecutor.java:30)
[java] 	at org.apache.tools.ant.Project.executeTargets(Project.java:1181)
[java] 	at org.apache.tools.ant.taskdefs.Ant.execute(Ant.java:416)
[java] 	at org.apache.tools.ant.taskdefs.CallTarget.execute(CallTarget.java:105)
[java] 	at org.apache.tools.ant.UnknownElement.execute(UnknownElement.java:288)
[java] 	at sun.reflect.GeneratedMethodAccessor2.invoke(Unknown Source)
[java] 	at sun.reflect.DelegatingMethodAccessorImpl.invoke(DelegatingMethodAccessorImpl.java:25)
[java] 	at java.lang.reflect.Method.invoke(Method.java:585)
[java] 	at org.apache.tools.ant.dispatch.DispatchUtils.execute(DispatchUtils.java:105)
[java] 	at org.apache.tools.ant.Task.perform(Task.java:348)
[java] 	at org.apache.tools.ant.Target.execute(Target.java:357)
[java] 	at org.apache.tools.ant.Target.performTasks(Target.java:385)
[java] 	at org.apache.tools.ant.Project.executeSortedTargets(Project.java:1329)
[java] 	at org.apache.tools.ant.helper.SingleCheckExecutor.executeTargets(SingleCheckExecutor.java:38)
[java] 	at org.eclipse.ant.internal.core.ant.EclipseSingleCheckExecutor.executeTargets(EclipseSingleCheckExecutor.java:30)
[java] 	at org.apache.tools.ant.Project.executeTargets(Project.java:1181)
[java] 	at org.apache.tools.ant.taskdefs.Ant.execute(Ant.java:416)
[java] 	at org.apache.tools.ant.UnknownElement.execute(UnknownElement.java:288)
[java] 	at sun.reflect.GeneratedMethodAccessor2.invoke(Unknown Source)
[java] 	at sun.reflect.DelegatingMethodAccessorImpl.invoke(DelegatingMethodAccessorImpl.java:25)
[java] 	at java.lang.reflect.Method.invoke(Method.java:585)
[java] 	at org.apache.tools.ant.dispatch.DispatchUtils.execute(DispatchUtils.java:105)
[java] 	at org.apache.tools.ant.Task.perform(Task.java:348)
[java] 	at org.apache.tools.ant.Target.execute(Target.java:357)
[java] 	at org.apache.tools.ant.Target.performTasks(Target.java:385)
[java] 	at org.apache.tools.ant.Project.executeSortedTargets(Project.java:1329)
[java] 	at org.apache.tools.ant.helper.SingleCheckExecutor.executeTargets(SingleCheckExecutor.java:38)
[java] 	at org.eclipse.ant.internal.core.ant.EclipseSingleCheckExecutor.executeTargets(EclipseSingleCheckExecutor.java:30)
[java] 	at org.apache.tools.ant.Project.executeTargets(Project.java:1181)
[java] 	at org.apache.tools.ant.taskdefs.Ant.execute(Ant.java:416)
[java] 	at org.apache.tools.ant.UnknownElement.execute(UnknownElement.java:288)
[java] 	at sun.reflect.GeneratedMethodAccessor2.invoke(Unknown Source)
[java] 	at sun.reflect.DelegatingMethodAccessorImpl.invoke(DelegatingMethodAccessorImpl.java:25)
[java] 	at java.lang.reflect.Method.invoke(Method.java:585)
[java] 	at org.apache.tools.ant.dispatch.DispatchUtils.execute(DispatchUtils.java:105)
[java] 	at org.apache.tools.ant.Task.perform(Task.java:348)
[java] 	at org.apache.tools.ant.Target.execute(Target.java:357)
[java] 	at org.apache.tools.ant.Target.performTasks(Target.java:385)
[java] 	at org.apache.tools.ant.Project.executeSortedTargets(Project.java:1329)
[java] 	at org.apache.tools.ant.helper.SingleCheckExecutor.executeTargets(SingleCheckExecutor.java:38)
[java] 	at org.eclipse.ant.internal.core.ant.EclipseSingleCheckExecutor.executeTargets(EclipseSingleCheckExecutor.java:30)
[java] 	at org.apache.tools.ant.Project.executeTargets(Project.java:1181)
[java] 	at org.apache.tools.ant.taskdefs.Ant.execute(Ant.java:416)
[java] 	at org.apache.tools.ant.taskdefs.CallTarget.execute(CallTarget.java:105)
[java] 	at org.apache.tools.ant.UnknownElement.execute(UnknownElement.java:288)
[java] 	at sun.reflect.GeneratedMethodAccessor2.invoke(Unknown Source)
[java] 	at sun.reflect.DelegatingMethodAccessorImpl.invoke(DelegatingMethodAccessorImpl.java:25)
[java] 	at java.lang.reflect.Method.invoke(Method.java:585)
[java] 	at org.apache.tools.ant.dispatch.DispatchUtils.execute(DispatchUtils.java:105)
[java] 	at org.apache.tools.ant.Task.perform(Task.java:348)
[java] 	at org.apache.tools.ant.taskdefs.Sequential.execute(Sequential.java:62)
[java] 	at org.apache.tools.ant.UnknownElement.execute(UnknownElement.java:288)
[java] 	at sun.reflect.GeneratedMethodAccessor2.invoke(Unknown Source)
[java] 	at sun.reflect.DelegatingMethodAccessorImpl.invoke(DelegatingMethodAccessorImpl.java:25)
[java] 	at java.lang.reflect.Method.invoke(Method.java:585)
[java] 	at org.apache.tools.ant.dispatch.DispatchUtils.execute(DispatchUtils.java:105)
[java] 	at org.apache.tools.ant.Task.perform(Task.java:348)
[java] 	at org.apache.tools.ant.taskdefs.MacroInstance.execute(MacroInstance.java:391)
[java] 	at org.apache.tools.ant.UnknownElement.execute(UnknownElement.java:288)
[java] 	at sun.reflect.GeneratedMethodAccessor2.invoke(Unknown Source)
[java] 	at sun.reflect.DelegatingMethodAccessorImpl.invoke(DelegatingMethodAccessorImpl.java:25)
[java] 	at java.lang.reflect.Method.invoke(Method.java:585)
[java] 	at org.apache.tools.ant.dispatch.DispatchUtils.execute(DispatchUtils.java:105)
[java] 	at org.apache.tools.ant.Task.perform(Task.java:348)
[java] 	at org.apache.tools.ant.Target.execute(Target.java:357)
[java] 	at org.apache.tools.ant.Target.performTasks(Target.java:385)
[java] 	at org.apache.tools.ant.Project.executeSortedTargets(Project.java:1329)
[java] 	at org.apache.tools.ant.helper.SingleCheckExecutor.executeTargets(SingleCheckExecutor.java:38)
[java] 	at org.eclipse.ant.internal.core.ant.EclipseSingleCheckExecutor.executeTargets(EclipseSingleCheckExecutor.java:30)
[java] 	at org.apache.tools.ant.Project.executeTargets(Project.java:1181)
[java] 	at org.apache.tools.ant.taskdefs.Ant.execute(Ant.java:416)
[java] 	at org.apache.tools.ant.taskdefs.CallTarget.execute(CallTarget.java:105)
[java] 	at org.apache.tools.ant.UnknownElement.execute(UnknownElement.java:288)
[java] 	at sun.reflect.GeneratedMethodAccessor2.invoke(Unknown Source)
[java] 	at sun.reflect.DelegatingMethodAccessorImpl.invoke(DelegatingMethodAccessorImpl.java:25)
[java] 	at java.lang.reflect.Method.invoke(Method.java:585)
[java] 	at org.apache.tools.ant.dispatch.DispatchUtils.execute(DispatchUtils.java:105)
[java] 	at org.apache.tools.ant.Task.perform(Task.java:348)
[java] 	at org.apache.tools.ant.Target.execute(Target.java:357)
[java] 	at org.apache.tools.ant.Target.performTasks(Target.java:385)
[java] 	at org.apache.tools.ant.Project.executeSortedTargets(Project.java:1329)
[java] 	at org.apache.tools.ant.Project.executeTarget(Project.java:1298)
[java] 	at org.apache.tools.ant.helper.DefaultExecutor.executeTargets(DefaultExecutor.java:41)
[java] 	at org.eclipse.ant.internal.core.ant.EclipseDefaultExecutor.executeTargets(EclipseDefaultExecutor.java:32)
[java] 	at org.apache.tools.ant.Project.executeTargets(Project.java:1181)
[java] 	at org.eclipse.ant.internal.core.ant.InternalAntRunner.run(InternalAntRunner.java:623)
[java] 	at org.eclipse.ant.internal.core.ant.InternalAntRunner.run(InternalAntRunner.java:495)
[java] 	at sun.reflect.NativeMethodAccessorImpl.invoke0(Native Method)
[java] 	at sun.reflect.NativeMethodAccessorImpl.invoke(NativeMethodAccessorImpl.java:39)
[java] 	at sun.reflect.DelegatingMethodAccessorImpl.invoke(DelegatingMethodAccessorImpl.java:25)
[java] 	at java.lang.reflect.Method.invoke(Method.java:585)
[java] 	at org.eclipse.ant.core.AntRunner.run(AntRunner.java:512)
[java] 	at org.eclipse.ant.core.AntRunner.start(AntRunner.java:599)
[java] 	at org.eclipse.equinox.internal.app.EclipseAppHandle.run(EclipseAppHandle.java:153)
[java] 	at org.eclipse.core.runtime.internal.adaptor.EclipseAppLauncher.runApplication(EclipseAppLauncher.java:106)
[java] 	at org.eclipse.core.runtime.internal.adaptor.EclipseAppLauncher.start(EclipseAppLauncher.java:76)
[java] 	at org.eclipse.core.runtime.adaptor.EclipseStarter.run(EclipseStarter.java:363)
[java] 	at org.eclipse.core.runtime.adaptor.EclipseStarter.run(EclipseStarter.java:176)
[java] 	at sun.reflect.NativeMethodAccessorImpl.invoke0(Native Method)
[java] 	at sun.reflect.NativeMethodAccessorImpl.invoke(NativeMethodAccessorImpl.java:39)
[java] 	at sun.reflect.DelegatingMethodAccessorImpl.invoke(DelegatingMethodAccessorImpl.java:25)
[java] 	at java.lang.reflect.Method.invoke(Method.java:585)
[java] 	at org.eclipse.equinox.launcher.Main.invokeFramework(Main.java:504)
[java] 	at org.eclipse.equinox.launcher.Main.basicRun(Main.java:443)
[java] 	at org.eclipse.equinox.launcher.Main.run(Main.java:1169)
[java] 	at org.eclipse.equinox.launcher.Main.main(Main.java:1144)
[java] Java Result: 2
[java] Java Result: 2
[java] Java Result: 2
[java] Java Result: 2
[java] Java Result: 1
[java] Timeout: killed the sub-process
[java] 	at org.apache.tools.ant.taskdefs.Java.fork(Java.java:770)
[java] 	at org.apache.tools.ant.taskdefs.Java.executeJava(Java.java:194)
[java] 	at org.apache.tools.ant.taskdefs.Java.execute(Java.java:104)
[java] 	at org.apache.tools.ant.UnknownElement.execute(UnknownElement.java:288)
[java] 	at sun.reflect.GeneratedMethodAccessor2.invoke(Unknown Source)
[java] 	at sun.reflect.DelegatingMethodAccessorImpl.invoke(DelegatingMethodAccessorImpl.java:25)
[java] 	at java.lang.reflect.Method.invoke(Method.java:585)
[java] 	at org.apache.tools.ant.dispatch.DispatchUtils.execute(DispatchUtils.java:105)
[java] 	at org.apache.tools.ant.Task.perform(Task.java:348)
[java] 	at org.apache.tools.ant.Target.execute(Target.java:357)
[java] 	at org.apache.tools.ant.Target.performTasks(Target.java:385)
[java] 	at org.apache.tools.ant.Project.executeSortedTargets(Project.java:1329)
[java] 	at org.apache.tools.ant.helper.SingleCheckExecutor.executeTargets(SingleCheckExecutor.java:38)
[java] 	at org.eclipse.ant.internal.core.ant.EclipseSingleCheckExecutor.executeTargets(EclipseSingleCheckExecutor.java:30)
[java] 	at org.apache.tools.ant.Project.executeTargets(Project.java:1181)
[java] 	at org.apache.tools.ant.taskdefs.Ant.execute(Ant.java:416)
[java] 	at org.apache.tools.ant.taskdefs.CallTarget.execute(CallTarget.java:105)
[java] 	at org.apache.tools.ant.UnknownElement.execute(UnknownElement.java:288)
[java] 	at sun.reflect.GeneratedMethodAccessor2.invoke(Unknown Source)
[java] 	at sun.reflect.DelegatingMethodAccessorImpl.invoke(DelegatingMethodAccessorImpl.java:25)
[java] 	at java.lang.reflect.Method.invoke(Method.java:585)
[java] 	at org.apache.tools.ant.dispatch.DispatchUtils.execute(DispatchUtils.java:105)
[java] 	at org.apache.tools.ant.Task.perform(Task.java:348)
[java] 	at org.apache.tools.ant.Target.execute(Target.java:357)
[java] 	at org.apache.tools.ant.Target.performTasks(Target.java:385)
[java] 	at org.apache.tools.ant.Project.executeSortedTargets(Project.java:1329)
[java] 	at org.apache.tools.ant.helper.SingleCheckExecutor.executeTargets(SingleCheckExecutor.java:38)
[java] 	at org.eclipse.ant.internal.core.ant.EclipseSingleCheckExecutor.executeTargets(EclipseSingleCheckExecutor.java:30)
[java] 	at org.apache.tools.ant.Project.executeTargets(Project.java:1181)
[java] 	at org.apache.tools.ant.taskdefs.Ant.execute(Ant.java:416)
[java] 	at org.apache.tools.ant.UnknownElement.execute(UnknownElement.java:288)
[java] 	at sun.reflect.GeneratedMethodAccessor2.invoke(Unknown Source)
[java] 	at sun.reflect.DelegatingMethodAccessorImpl.invoke(DelegatingMethodAccessorImpl.java:25)
[java] 	at java.lang.reflect.Method.invoke(Method.java:585)
[java] 	at org.apache.tools.ant.dispatch.DispatchUtils.execute(DispatchUtils.java:105)
[java] 	at org.apache.tools.ant.Task.perform(Task.java:348)
[java] 	at org.apache.tools.ant.Target.execute(Target.java:357)
[java] 	at org.apache.tools.ant.Target.performTasks(Target.java:385)
[java] 	at org.apache.tools.ant.Project.executeSortedTargets(Project.java:1329)
[java] 	at org.apache.tools.ant.helper.SingleCheckExecutor.executeTargets(SingleCheckExecutor.java:38)
[java] 	at org.eclipse.ant.internal.core.ant.EclipseSingleCheckExecutor.executeTargets(EclipseSingleCheckExecutor.java:30)
[java] 	at org.apache.tools.ant.Project.executeTargets(Project.java:1181)
[java] 	at org.apache.tools.ant.taskdefs.Ant.execute(Ant.java:416)
[java] 	at org.apache.tools.ant.UnknownElement.execute(UnknownElement.java:288)
[java] 	at sun.reflect.GeneratedMethodAccessor2.invoke(Unknown Source)
[java] 	at sun.reflect.DelegatingMethodAccessorImpl.invoke(DelegatingMethodAccessorImpl.java:25)
[java] 	at java.lang.reflect.Method.invoke(Method.java:585)
[java] 	at org.apache.tools.ant.dispatch.DispatchUtils.execute(DispatchUtils.java:105)
[java] 	at org.apache.tools.ant.Task.perform(Task.java:348)
[java] 	at org.apache.tools.ant.Target.execute(Target.java:357)
[java] 	at org.apache.tools.ant.Target.performTasks(Target.java:385)
[java] 	at org.apache.tools.ant.Project.executeSortedTargets(Project.java:1329)
[java] 	at org.apache.tools.ant.helper.SingleCheckExecutor.executeTargets(SingleCheckExecutor.java:38)
[java] 	at org.eclipse.ant.internal.core.ant.EclipseSingleCheckExecutor.executeTargets(EclipseSingleCheckExecutor.java:30)
[java] 	at org.apache.tools.ant.Project.executeTargets(Project.java:1181)
[java] 	at org.apache.tools.ant.taskdefs.Ant.execute(Ant.java:416)
[java] 	at org.apache.tools.ant.taskdefs.CallTarget.execute(CallTarget.java:105)
[java] 	at org.apache.tools.ant.UnknownElement.execute(UnknownElement.java:288)
[java] 	at sun.reflect.GeneratedMethodAccessor2.invoke(Unknown Source)
[java] 	at sun.reflect.DelegatingMethodAccessorImpl.invoke(DelegatingMethodAccessorImpl.java:25)
[java] 	at java.lang.reflect.Method.invoke(Method.java:585)
[java] 	at org.apache.tools.ant.dispatch.DispatchUtils.execute(DispatchUtils.java:105)
[java] 	at org.apache.tools.ant.Task.perform(Task.java:348)
[java] 	at org.apache.tools.ant.taskdefs.Sequential.execute(Sequential.java:62)
[java] 	at org.apache.tools.ant.UnknownElement.execute(UnknownElement.java:288)
[java] 	at sun.reflect.GeneratedMethodAccessor2.invoke(Unknown Source)
[java] 	at sun.reflect.DelegatingMethodAccessorImpl.invoke(DelegatingMethodAccessorImpl.java:25)
[java] 	at java.lang.reflect.Method.invoke(Method.java:585)
[java] 	at org.apache.tools.ant.dispatch.DispatchUtils.execute(DispatchUtils.java:105)
[java] 	at org.apache.tools.ant.Task.perform(Task.java:348)
[java] 	at org.apache.tools.ant.taskdefs.MacroInstance.execute(MacroInstance.java:391)
[java] 	at org.apache.tools.ant.UnknownElement.execute(UnknownElement.java:288)
[java] 	at sun.reflect.GeneratedMethodAccessor2.invoke(Unknown Source)
[java] 	at sun.reflect.DelegatingMethodAccessorImpl.invoke(DelegatingMethodAccessorImpl.java:25)
[java] 	at java.lang.reflect.Method.invoke(Method.java:585)
[java] 	at org.apache.tools.ant.dispatch.DispatchUtils.execute(DispatchUtils.java:105)
[java] 	at org.apache.tools.ant.Task.perform(Task.java:348)
[java] 	at org.apache.tools.ant.Target.execute(Target.java:357)
[java] 	at org.apache.tools.ant.Target.performTasks(Target.java:385)
[java] 	at org.apache.tools.ant.Project.executeSortedTargets(Project.java:1329)
[java] 	at org.apache.tools.ant.helper.SingleCheckExecutor.executeTargets(SingleCheckExecutor.java:38)
[java] 	at org.eclipse.ant.internal.core.ant.EclipseSingleCheckExecutor.executeTargets(EclipseSingleCheckExecutor.java:30)
[java] 	at org.apache.tools.ant.Project.executeTargets(Project.java:1181)
[java] 	at org.apache.tools.ant.taskdefs.Ant.execute(Ant.java:416)
[java] 	at org.apache.tools.ant.taskdefs.CallTarget.execute(CallTarget.java:105)
[java] 	at org.apache.tools.ant.UnknownElement.execute(UnknownElement.java:288)
[java] 	at sun.reflect.GeneratedMethodAccessor2.invoke(Unknown Source)
[java] 	at sun.reflect.DelegatingMethodAccessorImpl.invoke(DelegatingMethodAccessorImpl.java:25)
[java] 	at java.lang.reflect.Method.invoke(Method.java:585)
[java] 	at org.apache.tools.ant.dispatch.DispatchUtils.execute(DispatchUtils.java:105)
[java] 	at org.apache.tools.ant.Task.perform(Task.java:348)
[java] 	at org.apache.tools.ant.Target.execute(Target.java:357)
[java] 	at org.apache.tools.ant.Target.performTasks(Target.java:385)
[java] 	at org.apache.tools.ant.Project.executeSortedTargets(Project.java:1329)
[java] 	at org.apache.tools.ant.Project.executeTarget(Project.java:1298)
[java] 	at org.apache.tools.ant.helper.DefaultExecutor.executeTargets(DefaultExecutor.java:41)
[java] 	at org.eclipse.ant.internal.core.ant.EclipseDefaultExecutor.executeTargets(EclipseDefaultExecutor.java:32)
[java] 	at org.apache.tools.ant.Project.executeTargets(Project.java:1181)
[java] 	at org.eclipse.ant.internal.core.ant.InternalAntRunner.run(InternalAntRunner.java:623)
[java] 	at org.eclipse.ant.internal.core.ant.InternalAntRunner.run(InternalAntRunner.java:495)
[java] 	at sun.reflect.NativeMethodAccessorImpl.invoke0(Native Method)
[java] 	at sun.reflect.NativeMethodAccessorImpl.invoke(NativeMethodAccessorImpl.java:39)
[java] 	at sun.reflect.DelegatingMethodAccessorImpl.invoke(DelegatingMethodAccessorImpl.java:25)
[java] 	at java.lang.reflect.Method.invoke(Method.java:585)
[java] 	at org.eclipse.ant.core.AntRunner.run(AntRunner.java:512)
[java] 	at org.eclipse.ant.core.AntRunner.start(AntRunner.java:599)
[java] 	at org.eclipse.equinox.internal.app.EclipseAppHandle.run(EclipseAppHandle.java:153)
[java] 	at org.eclipse.core.runtime.internal.adaptor.EclipseAppLauncher.runApplication(EclipseAppLauncher.java:106)
[java] 	at org.eclipse.core.runtime.internal.adaptor.EclipseAppLauncher.start(EclipseAppLauncher.java:76)
[java] 	at org.eclipse.core.runtime.adaptor.EclipseStarter.run(EclipseStarter.java:363)
[java] 	at org.eclipse.core.runtime.adaptor.EclipseStarter.run(EclipseStarter.java:176)
[java] 	at sun.reflect.NativeMethodAccessorImpl.invoke0(Native Method)
[java] 	at sun.reflect.NativeMethodAccessorImpl.invoke(NativeMethodAccessorImpl.java:39)
[java] 	at sun.reflect.DelegatingMethodAccessorImpl.invoke(DelegatingMethodAccessorImpl.java:25)
[java] 	at java.lang.reflect.Method.invoke(Method.java:585)
[java] 	at org.eclipse.equinox.launcher.Main.invokeFramework(Main.java:504)
[java] 	at org.eclipse.equinox.launcher.Main.basicRun(Main.java:443)
[java] 	at org.eclipse.equinox.launcher.Main.run(Main.java:1169)
[java] 	at org.eclipse.equinox.launcher.Main.main(Main.java:1144)
The execution FAILED with the following exception:
The following error occurred while executing this line:
/export/users/cc/cc-eut33/adaptors/eut33/adaptor.xml:59: The following error occurred while executing this line:
/export/users/cc/cc-eut33/tests/eut/build.xml:430: EUT failed: There are unexpected failures

***********************************************************
Unit Tests: (0)
        
No Tests Run: This project doesn't have any tests

***********************************************************
Modifications since last successful build:	(0)
            

begin 644 execution_log.zip
M4$L#! H    ( !8-AC<.V'/0$&8  )L="  2    97AE8W5T:6]N7VQO9RYH
M=&UL[;UK<^-&KR#\>?,K6-F\M<[6C&SY-C-^<U+EL3V)Y[$=EV5GSFYJ:HHF
M6Q)CBM3#BR\Y=?[[=C=)B==N--F490_.R3.6*  -H-%H 'WA+]-HYO[ZRZUO
M/_WZRSP@O_YB&F'TY)+_^%]CWXO>ALX_Y,!XO_7__?__Z]<?XKEM1N1M>.\=
M_/!#$+-_K2FQ[MZZCA<_OK5\;^Q,V$/^(0[(@,31@ (.YH$_)T'DD%#R\R B
MYLRZYV N,;W!+1G[%)*W9AC&7S9Q242^&L?LK^--#-L)B!7YP9.Q21[G?A!M
MQB$)PDW+HO^]I2WL[&S>QHYK;W)>_3@*-Y.GQ'*=>4C>1B1DE#8#$L9N%/;=
M3/J=:W"0Z<*,'#_5ZH !AEQ:R@AY)-97XR.C/'9<VA==FV=_!X\SMT"_\,5T
MW8/F7T,2??[S?!SXLQO*P6A.+&?L$+N(D7ZVIOY7XV_SWC3N*;-40L,?*P@0
M>N8\G/K1YM2^V_R;_2\@F[>.M\E).J%Q.#<IM/&[&<Q\[\DX,V./?@^, V/#
M^MDX\N=/@3.91L;PPX?A&V-[:^N=<4WA4[21/XX>S( 8G_S8LWD/&'Y@.%%H
MN(Y%O- /PC>&&1KF?$X?F+<N&<"D_'$XV!ML_6@T0M.1]M9TYU.3LNKYD6'Y
MLSDS.-8^^TR9H:TUHM,1:/R'$>QO#;=VJ6 ;Q\0RC#TNX,]OC#,V&C?);'\W
MVIQ8EK$[& ZVWA@!-64S) ;7<B/I:13-#S8WIXE*!R97U< /)HT8G[=')V_W
M!UL'AO'3?V5?_EL,OL?!-5F"S%8O<\ZG$?1O.V**IT,LB'Q?- #^CCTGP@&"
M ^2['2#F7&3_LO%!"47DL0L%RO55[$7.C!P&UM2Y)P)8IT**?YS=T0G]JW$4
M$!K1V&QV[SZSIO'#9GER[;U!%L.MMD4>\ TFT=W@\?W^M_U=85_%<W%?QO.W
MD1D,)O]4^JG/,(S]?9O%8BM17F.+)8,-(QJ!75/@2S>>T*\"[2U"Z6L:-C,4
MI9%0[(C8B=0&4N%+[' Y1:.:>J(:F/0S=WUT5'NLEZDW':2*&E!W,6#^(@F+
M!Y_MZ)I^8[*.&,<#XXK;I*$G.FXR\$T5EJ@#J)L'F0+@\V "W7H>3-![F0<3
MTK!YL&2MKDM'[]M4R35NF:>>7XTO9L#LX,"(:!02F>&=X9DS8OS"?_Z5!38V
MH9JQV-@<&#3,,GYY#-WH5SYXB&E7M9]1O@Y,+Z09Y8R9F>-%_FI<(OM$QRIE
M^*MQX1ODT>'(5-6A'P<6H2&49],.-CQ*E?H;9EUO#-MG,+3;I_2O0*TL418Z
MV2Q[%G:+ &)"O*NF/F."S9^^\F"2L3OD(]'0J-G:^?0%6TK]=)TV2V,Q:@XA
M:U2C_@3NZUO9<)G[TME]3%RE]H7Z.?--FRF'?PVGA$1:Y^7LQ\UY,O<6&&> 
MFY]O+DZO!_\Y.M,3GU)G>T+M][F"88S57F*L)O?X-5VY$ETMQ@\+(KQJ3KQJ
M!GB,%-06"OCG9%H[,(:-$(T_3/YQY@?4#U%W=&#$'I6!6CL5B="9W!_S6; 1
MEZ?F=" =&$=3*B'U E$<>!29VE,4AP)V,H:W ;1/@H"&B338B.@LZ)I/E#XK
M2[&@\M[Q:3.$ 82K31W3T)<5V1KS ->W>+4I[;T5&$@6D?\11_,X.G:"%;2Y
M.1BD_]7HILC0)Q92/3-'V3/QX@%?J;BNKF HN3<_(#UEDXFX:>*VY/4YLL@F
M5C![K,7XZY-)Y]K$IWTU#MX.V7\T7"8SZC'I ,ZYW6;U,?TS_8;FXV!T^)^7
M9A"2DT>+S/GRFRJU_V%&G&+*_2-AF=Q@SH@&X>#XCW-./TB>;-QX=Y[_X!DC
MGO']K$CU;_-Q/CCVK7A&O(A;"PE.:6^V(,X^/7(U+%@MTFW)L,RP.=5DG/WG
M^=E&[A=&Y^##]E;W-NC0<,9/1XD[2W/62DOO]M]W;XD]^#,9B&ES58FV=N4]
M,7!-2CX@8Y:##_X\OTH^4;(#Q[OW[\@YB::^O5'XA2&JDD[HI$0WTF^<SYWA
M.PDQEH,,Q@%-K1_\X&[ 9#PR0[XLSSYO+!YP>L-]F=P">A^9)DOT=B2644<O
MZ?R?AFQS043EWU@^3*EN[;>EROB\3,@2NTIXNX7X2\(UC'YHK\ZR*F6#K(Y6
M4M7,]W7RA%/<;M,Y"XH5:MM[\*')MS*<)%^XTNB$3[T7(UM]FECZGJ1KNI'?
MEIE4A?R1'W JA\D**A_<J:+#C;H?4S'T-"-H8?@Z/%=>$^3?L>/YCY1.1 +/
M=.D,.\_ZERK@B(:YIL/ZTJ(Y?<I[W<^\Y;V='6TM_VYZMDORAK5\F(S:/84.
MM]+]4JPDE&O1-N>1'^1:S38#,-A<_V_40,#\92<F:.(;1(UMOVO;=*G%$6NE
M.(:S1XD][2OT:I>&AC*)7O( <[.^.Z<#)J7Z*?/_&_QA,H9D\9&<^*T9.A9U
MP3FJN[LM1F:1:E @.!SN2R9@.<49_:= <E=!=&YH0GJB.?@S2QGKZURX.M?_
MZARNO:V3'3SWVEL^FUS]RINX]9>X[I9\GOGW>7O4I3]K>C=W'%XY&[,=D(/F
M43JW2>S@*AZNXJETU)KNN**V/(B=M.)UZ+J7QR?/5B1OY 6KY/)@;UMDQACL
MX58L# >?.1S,N[?5AX/BUE]B.%CX8GK/=\@ ([+O,"+K<=\"M>4T".+%H,,X
M\F>L5YYM#[R8(8S.,.S"L O#KC4-NXK.:_6!EZS]%Q]ZI?L),?S"\$NEH]:T
M()9:\[(*]6SEL 9.,-S"< O#+0RWUC3<*GBMU4=;DN9?0; 5D'0;$@9<&' I
M=)3<D:<FP<.,M2R,\>I3$@YE6_$6M:AG#--D3&'$5HN!>]6>-;"3)6 8UJV3
MG3Q_6%?V<L\1V\EY>!T!7C:^,<3#$$^AHP A7F99+R/(R[A=LS"OB2T,]!HE
M3\Z@7,2N>^GS(T*+D]B-:+4G(Q;'BW*=X#IF>&YZYH0$/PVS"L!&_G%Z6.2=
M[.@K8S2.''=P'1!R;LX'X8R.XT^.9V]D3](C'=NR8YH54A,2E8CL[$H.WBE+
M?Y;>I<':" C;*5VCAFV5<Y&09M.F/@7^+&. _C2O:7KO@\)A;%#34WYR[N2>
M>%%=>]L:VOOB!W<AM7(RN UH &&9892TM_PA/9>C>G"OIK',00^2:3/[NK%X
MGAZ1V];7%#/*M#F;W3VR4?@A/4FLN[WL=QX5D(9FM_<U:I23I?.R9YN!+6SV
MG<H1,&E'QMX\.SV>M%KJR^&^\H%/N=V4VMC_H%.B^B;>J9I(>3)== 0[Q$R\
MD(9$QSX)+_SHA"6^I]YBO&T40-,CN@IG%Z7-_[3-CP76-+.GP64O_09KI.1%
MAN\^J$JBWL0[57/0VU?*!E]NG@8P=\0N4+;]HR3ZW:CYD3?[7K7KY*VR<(.U
M>M/<ZLY0=0HJ-\O3"!*PL@*[KB7YQ!Y>$2NFX>0].?/]^481+#W%_8QM#[NJ
M&]LNM5W77!]#B8&PRAR?'AOM^L,KN34"[[O!^V[6Y+X;Y*\;?WA?$-X7A/<%
MB1K#^X+POJ#G'6!X7] ZW1>T[&XLS6-I'DOSZUR:]]EUO77%^5W=5?)2<;ZI
MX9T=#5TH*L\W-?SNO48=0PKT_5?/L4"/!7HLT.LOT&]+"_2[RJD+%NBQ[?4H
MT"<39*-ERP;42\DCL42/)?HU*3$C?UBBQQ+]RCP_ENBQ1(\E^A4/,"S18XD>
M2_18HL<2/>Z>Q]WS6)S'XCP6YWLISN]*B_,?]KJ."RS.KU';JRR0L\?"'>S#
M+=G1C)>2Q&%]'.OC:U+?1?ZP/H[U\95Y?JR/8WT<Z^,K'F!8'\?Z.-;'L3Z.
M]7'<PHY;V+%*CE5RK)+W6"7?DU;)AULJ&3.6R=>][967R<7[R(?#K5=2+L%"
M.1;*UZ30B_QAH1P+Y2OS_%@HQT(Y%LI7/,"P4(Z%<BR48Z%\;T=#:?!Y"N6Y
MRNHYZ\=R7?6]ZH0D:FQ6T\+.7M>B8TU):;\X;S0G_N^[%O':UU<^J,[ +Z*T
M\[VVO<J2%ANHXIV?V[NX\Q,+6EC0^IX*1NO.'Q:TL*"%!2U18UC0PH(6%K0Z
M4<6"%A:TL*"%.S]QYR?N_,2=G[CS$W=^KO/.SW?RG9_;RAY;8[D8=WZ^^#*Y
M9.?GSA 2C[Z ; X+Y5@H7Y-"+_*'A7(LE*_,\V.A' OE6"A?\0##0CD6RK%0
MCH5R+)2K%LKQ"F&\0AA+Y%@BQQ(YJ$0^E);(=V2WO&*%'-M>O^H\?[^?:!/[
MSH=74J#!TCR6YM>DM(S\86D>2_,K\_Q8FL?2/);F5SS L#2/I7DLS6-I'DOS
MN(<=][!C@;Y=\UB@QP(]J$"_+2W0[RJG+EB@Q[;7HT OWCZ_*QM0+R6/Q!(]
MENC7I,2,_&&)'DOT*_/\6*+'$CV6Z%<\P+!$CR5Z+-%CB1Y+]+A['G?/8W$>
MB_-8G.^E.+\K+<Y_V,/[95Y1VZLLD/,W"PJO8=^2'<UX*4D<UL>Q/KXF]5WD
M#^OC6!]?F>?'^CC6Q[$^ON(!AO5QK(]C?1SKXU@?QRWLN(4=J^18)<<J>8]5
M\CWY->Q;*ADSELG7O>V5E\DEU[ /MUY)N00+Y5@H7Y-"+_*'A7(LE*_,\V.A
M' OE6"A?\0##0CD6RK%0CH5R+)3C1G+<2(XE<BR18XF\EQ+YOKQ$/GRG.MUB
MB1S;?O;R/']+JG 7^_8N[F+'XCP6Y[^GXO>Z\X?%>2S.8W%>U!@6Y[$XC\7Y
M3E2Q.(_%>2S.=R_.[V@H2CY/<3Y7TV5Y<J6B^T'G'NM930L[>UW+G37%K'?%
M>:,Y\5>>;_555SZHSL OHK#S7165)'L^=X80[_T"8A\L*V%9:4W*(L@?EI6P
MK+0RSX]E)2PK85EIQ0,,RTKK5%:ZIN;IQ]&!<>>X+K&-:$J,,+Y]2^-*FA^$
M4BY,FKI/Z3SB^VXX,#V:/ICAG4W&X> S,Z0QZU/^*1FI[R3A ( D0XPCPC[G
M* \_ %0&HYRG"K'!"M4;[\[S'[P3E\P(_9J1+3U.8H+WDEI.&'N+@?@;H1.,
MR6H9? P>6JR'_& [&YII \:(IVIPNFR[VX2Z=V]2)'PZF[L9;2%,6A'3YUCV
MW@.FM(K>;2><FY$U'1RG'VXBA_Z4Z;_X-.W?-NU<4ZO),O,-_B499K)]%@W$
M@@E9&DGZ-0WD .ZUB6!6.:#LA46JK71+$\*_69^E?(Y\.EO9"=EP(_LQS6=E
M9=W:!J;$I2P/1M3"7'(T)=;="6^*SIIIFUEK=2"I9'"OR9I<1![<A;(GV60L
M9T( *?6Y4"77JW<(V1_7[.D.<Q[I,'-#NT- "-5,\XB&Q"4[SCWJ,-+0DZ(G
M14^*GO2U>U+T<^CGT,^AGT,_AWX._1SZ.?1S+]O/86:,GG2-/.G"'$?DWS&U
M"X>.[(SCW"/> N3$.EHC6J,&:SPWK< _]=A9?XLLF"X^3=KYT,:QHU&B46*P
MJ=@ !IL8;*(G14^*GK2K)ZWU(B7*VY"C/$T^^IB,S=B-FEQC^>?4PVCRS9+&
M&Z"2_FJ38>CSR6+Q3M,GU"?G=O16GZ:YDL)F,@WM[7Z06'K>"5Y0YW9/&AW@
MUD8"8"00VNAN-/Z>AO*OWHWG.YSW<[%O2WVZ-U0X@U9#,MD:6R:J<H]8]_W'
M;;?%XO[C%[K_&/W,&OD9W%C=?F-UX8OENZQ?W@;\>%IX4/CQ+WY2*2!S&BA^
MY=NDQXY+C$WRR)YLQB$)PDW+HO^])7&TL[-Y&SNNO6FQG-2/HW S>9KR^Y8=
MO*'&M,G^ODT?9C]N2H]M'M)H:L82)WX4:/ X<PTG-,AL'CT-!%Q?3RF497K&
M+:%_*,NV<?O$96$-&)__/#?(H\/X,F*/"L9/ +I/E4[X*XR>7/+5^&(&'@4^
M2$C0P-SPJ+D9O_"??V4LV60>$(MQ.C!N0OK38^A&]!<OC(AI#QHI7P>F%[)P
MG_%"/;3?6=%IIVZZCA<_#B;1W>#Q_?ZW_=TR"W]9OD<9_FI<^$P9'-E8:-Z@
M\Y[A^89'J;+=\N0Q>F/8/H/Q_&A*_S:;5\@.LATT_T[-7_!K:IQHE'5&6?@R
M(=Y5W0@VTNZ=/WTUCNB_C.(P49A&^Z)BOZKQ,HT$ ETFIT18HQKU)S6U;^5!
MS(U-L] MN!#JZLPW;:8H_C6<$A+U,T[G;CRA]E)@GP%N?KZY.+T>_.?HK'GH
M^.'$$?@@/FX%OX>$92$LXCP,K"F-S@2PCI14/)?]_I8&K8/)/Y5A_E=R\_%7
M@U_DS)1N.W18T0CX2:O.JWT]NZ,M4?<2$#:&6;,'_;58TB=-4ER77Q*16(!P
M,O'&SB1FQWM-?KE$^XZRDMM\!1!_C'YS^)30H1$Z_+@^1,9)([P:F/2S-?6_
M&BQ%9M:0'QK,Y-.179K C&06X3-$]UYLBC\V8<Q0!U?U_EDPS/XU[BE?-$,V
M?AP.]@9;/QJ-T'2&>6NZ\ZEI'+"@Q6!W/;'A0M7"/],LY]:MVG:&'MY[QG\8
MP?[6<&MW^,:@F9%E&'O&]M;6NY_?&&=,O$TRV]^--B>69>P.AH.M-S2 HF9"
MYS.NJT;2TRB:'VQN3LU@YGM/61&0*J@1XS.3/.FG V/8,K3G'U_P%"T,:?L.
M03'T>K6AU](;K3[@$K7]XL,L-IU1G@+6?[YPHL:("R,N52<N08^=GB*IX@5Y
M.?O.(II$5\\26(%YPS@+ Z@5U@3EV1.&9.MD*<\=DG$_5G%?SU0/ _#QXD.U
M>&Z;PMD6(S2,T#1':#U6NQ)S7H. K)X1C+XP^L+H"Z.O-8V^"DZ+>>G5!UX 
M%EY\S$7-:\9$PZ@+HRZ5CEK;J(L9=&[()O%.(NZS!%]"?C &J\4HK#1N8ZBV
MXE#MN8K:#4/EYG3=!F_&$0Y?')>80F$*M:8I5,E[K3Z!DC+PXM.GO^V(2<;.
MRV(&A1F42D>M;09%;3J_!SL]"\YOB/G#2]Y*]@RA&( K#,<P',-P#,.Q-0W'
MFCW8ZB,S%5Y>?)!&8Y[/?YZ/ W]&#3$8S8GEC!UB-\^*A;G"'RM(%'KF/)SZ
MT>;4OMO\F_TO()NWCK?)2=)A<<C]M?%[XKZ-[' [G68VK)_Y8 Z<R30RAA\^
MT(F#31C&-85/T4;^.'HP V)\\F//YJ?TV8SD1*'A.A;Q0C\(WQ@F=6O),7XZ
M1]7-B#52"F;$!+KUC)B@]S(C)J15ZHL)QN?MT<G;_<'6@6'\]%_9E_\6@^]Q
M<$V6(+-5ZHWHD(P<(MROG.0>O&$28/J!Z8=*1[V4]",U[\''Y.^SE8(A;&$"
M4HO1O#F\^F;WDT>+S-F\=F"<! &=S@P[#IB)<*::M5M[)4M-.]DE5ME/O/^*
M5UOM;0$N,H2V<UNE_T[AOI$&J[M.+/?$NW<"W^,W CJ>%?"[ 3.9:F"2YE6N
M)&EH_]*T[LP)2:R>_;2UM;U1>)C>;2-[(W'EGI;U?+<FOK8<7UN^)J_=7G?^
MR@D:OA:\0S/X6G!\+3A>R[>6U_*]Y &&M]<]]VO!<7WFA:[/Y,T NDT1EW%>
M\3).FA(_^Q).(Q^X?(/+-[A\L[;+-TSYU./C^@VNW[S*]9O,O@=S,PC3TO6A
MZZ[!$DX39[B*TS)- 5P4R#^^X.!S;0_E/,. #L@DO9)D'0=U#7<XL+'^L,(1
M2^Y--^9!_C=NFYTN]L6MI.MD5&M6@\B<WK,7(9H9>8E5B+Q;%<0T6*S 8L5W
M4JR8^33%QTH%5BI4.NJE5"JX<;,C_LS7G[,OZ[+9M(DS3&AJ,8Y<,V1OZYUR
M+?U/IL-3CP;CCKWX9;CQLS$SGUA8S-^*3.-\(WO?D?')I ,EV7XZ&#0K^*\<
MW%?C8.=@=^? 2%_0;$1/<V+\:&7MT4?!TX_&+ XC]NZE,8W7_8?D[4O$B=BD
M;$91X-S&E)4P"1J2W1YTBOWQUQ]9+_RX^>N/S<Q UR(QUWO=U1G;GPTHV'->
M-RGA")T6#F <P(W#A8)\8D<QHVA]#KM4><)!C*/SI6_EPOKH]U(?Y?G3LQ='
M&[AXB971PI<87V.)%:$55H1ZNW\RSMX'>>,L3ST]QWW]=7Q@Q%6+\9;]'W][
M-3^^$<\;(7,P!\P7W,Q%Q9T"-)U&@V/_P1,A #B\?IJ32W/2K-D\$)#');@F
M)D]L)Y(RF0$!F5R"?T],_D:B8Q):@</.'0F;+D "V2WAZ./YT(KH-/S%#^YN
MB6=-OSB>[3_(6*E%@DO2@*Y/*-:Y?G!%)C0K"9YD[!2AX6*4\?3Q?TE].ZM.
M4RU!A:A!@4M2BZQ1G(",24 \<FYZ=,A)1T<97D&0"J8^*49TGB+VZ8S2#65\
MY&'AW!>Q]''.1AH-1T8D G9 !0$N0PVJ7D%R+D/:#65X-3&*F)JD^&-./!5O
M6P,/E*(6LS\IME69V6XOQ[9605@84-VW7&:!0RFPG,)KYE.N90ZER*<^?1ZY
M?DW6FV^30P#Y2V&_ ]X649$TSBU JL9<6B/>$9CG40N>1[WPS&($R 1^J39S
M7^J>LD=3XE;KA)5X@0*IA!<<O(?I&#R;MIB M;M0D$=4=*#?G9\_#7-WE)P3
M+Q:V7X$&\EV#IXG_99@:BJ?^/""0ZR**?H;%MI$'5&=8GX7DB.Y 6]]19WA'
M&\-_.N3AVY^GH]./9R=B%1<@@2R7<#2ZBZ0,45F>K3B %$[!92PP]$T9WT99
MW>0P(.:?3BBL/8N0X%-) [KV+@#J4[D#>F!5/KVD<,K,]F';8O^1@U/F5I_W
M6-+< [:]I\SM7@_<[@/;WE?F=K^GBJA",;-5!51G?@1E>]2&[3*2/FV?F;=$
MFGUP(+B&4W!]3)YZ\SB2M<J!X$RFX)J8Y/FK&8F[/@,",KD$U\3D1W;?\K5_
M[8O74I=@0$;S"+U5@!7+N*WKO_I\PM1_8*&@>&"G0% _L #7S.1Y[(H'6!Y0
MD=D$I0>&/YDAG&D&W(+Q!$W7 (PG[_;W]S^(1U,*!!U\"W!-3'ZBPT!JMQD0
MD,DEN&8FKY)%0$OL>"O0BFSG\/3Y-T986ISD0'!?EH)K8O)WQR:,XA<GFEZ:
M@7BLE8&!3%?1>F >9B6U&"W$T&\MC/K(O"?L*+9T:):!%20HHNE<BV%Z8=0O
M"+%)\S:Q!GB5=9HRIJYYAY(\&8]I !XF:_?\M*9X&JE%@<Y!#<C?P0(9IP:H
ML^3@5/C47&G)T11[\SR@.K_ZO#HG>NBZ8)Z7L"ILY[%TCD&Y72S!5,::7JLX
M/3YA5(%JKD!#%TVJ>!I5#62^%><]L;W8JB<-K-38S2-H3&0.^<7Q(R+/8A:0
M"BE,#D=C' +CN0"I$('HYWD4F=;='X$MV0JW!(/O(5\@Z%R6.KHZ.;P^$:]4
MY@%5%J46*/H9!BRCI8#J#.M;:,@1%:\TY '5&>YGI1)@$QEDBY5*S5:14@5H
M.8-LP;/>-9U<A9TE$:SR(TVV!'@J&S::*/0G':MM.:R12]>TR-1G5\R'A]&U
M/S\C]Y+$1IU<>UU(":]81:=>[MLG_J\6D6KH:E9:;0LKUYY6E?6D)\W*H<'C
M!:L,_6,&-HW+@LB*(VE\6L6 AZIUN#KW*R;5<; H%025?8P5U%X6FL&RU.&T
M6GKN1:*2B4NE*</#):EB:C0PJAEBJ\A1Q5 PL1I<G946Z+Z ,K!*K:6/O0%9
M$0?<#W4(B@6C7GJ!+Y!MOQ?OU<F 5!;=.+C&:D!289#O=2C!*E0$"E@:I_Y#
MSV9+90EY/K&:D37]Y)H3L<E(<!4F=B$5W-,(G0<5)C#<<-5.V[CA"C=<E=K%
M#5??SX8KW$->QOC.]Y"_A-,<N..]OQWO+V*[W8O:KB9L-0-2W->%&V_*K:['
MQAO<Q]* @/M <!](%>?[W@<2.=:9,R;6DR4IVI1@X3M"BEB:.#]^\LP9E/4R
M,)#W*II>YMF)_B/?2]Z$07L6PDP91TV4*K960U(2J!Y%R:QZ$X==%L'B6LFN
M["48D.T\@D96^9PL9S4!4V U0]#(*JA$E0=48%=[J>K0MAG=,R>,V)MSQ'6R
M(BRTNE;&TL3Y%9GYR=5!(.:KX$#^ZQ"_XRNA6'<N*^1@NZFB*)A/';)>*U*4
MJ!%+S:9ZE"M'._,9$N]9@P!U3+6H^@4YFIK>!"Y&"JXNQ )1UZ$ SQ%'RPP 
MNO6?@^H*TIQPSHY.%0OS20S.KLV?T)[\&$_>#W>WQ:5@%4+0<$Z)I"YO$(L#
M.OH[=(3'&B-/PMYU0N6&#( R,'CALXSVVHT?^UI[7Z<1A^]]-.45F"6D6CR3
MX6A<]19KF4,HK'=KU2<D,E2+";5?MLG?-"+780:GP.D"0Q^WR>7G)"#VA3F3
M:K8(#>>\C/>]WAKZ0G<4,)UD/O(R\.\=V=;U.@0%_5=1]6V74A.D#@&^=:H_
M0?*^?U$.D[^$HPZGQ6Q3P,9Y!^<==6YQWFD$QWD'YYTUGG?8"@SPI2HY4'@O
M%) T&E)D1G%XYH!?R5-!4#"D*JH^0:Y]WZ5S,%"*(C1<A#*>/OY_<_U;TTUB
MB=]-SW;E0M2@P"6I1=8WKE7%J4>!C^T^Q4E/D/ U0'YWE!\!+JIJQ%([MU*'
MWX-<8%9:<(\=H2 7.YUTX9^3&?$B'\Q7 :N%7"7\[]7 UK8*/<H6:2$; XNP
M<!]:Q-*Y<R"(LI7+:U^:,M9BJ.PBJ.+V)0L@@6C :2N/YE0BV[6P;.)3X,^D
M7=2,IKA;HHY KZ(!>DR$V$D\S7W'R/_NV#;QODR)E^Q0HA[QQ@OYC9!"!B6X
MX*U&$BK]2CIJ+>=(@Y2C/F7\XS:T8C7A,I164BV1-8J3'D;F]/E6/[!I-F(J
M"">@T:>,0*-LP.LB7V\&^9&,_8!O@72\YC>R"W"43;*$W5-_0<=8#4[+?M(]
MRI)8[9,?>_;2#H0<U6( I6G U1=<+0ITT/V"%01X6%6#JC7P4).E 4<IW.A/
MHGP1&%PM;E%@UK\]YN2>)K3,6$\]$W(71!.:ZI:9&@*]B0;;N"G :RV<_FV<
M[ 25RZL0\J-9*9S"V:P%QO>Q. M90E1;.-2Z7#@"]O5(N:]'/?3U2-K7(X6^
M'FGMZQ&@KT=*?3W2W->GX<EL'CV)"V8)#+2\ED'K"C^2]\O22.W:_W9%0C\.
M++)\O:@XG!#C0H,2&94^)#UV NK4C_S9W R<4#*]"S';2%FET8>,I]Z4!$YD
MRM[PTH341K(">A]"'=KF/"*!^-;G6HPVXBQQ>Y0E7555%RE#["#9DD3_ HH/
M28@0NPNH[Q $*TT'_IP$T5.R01Q\R*L62Z$@WH"O3ZXK8K$(%^C\J_!P6:J8
M^J2 \]^&\QYX/@H(32: ;)>!H9=V5-!Z8IX5_"&KN *\EB(5*/0DW2(7/'9,
MUQ<7!26X+:6L4-&Y";,X**6I: 5!92MF!57O1D? 4"I JFUOU#R("E2E:F^E
M\#Y4G2[WJ<^&(D2UI<9^Y\2D$: YE8&5!.G!J#)MC,PQD:2@15 @XV4D7;7]
M(/#9D0+;D99=BZ#0:GX)2=_])]8=?V$"FX&NG,E4<FU1%1Y^\TD5LQ<ISLA8
M10@&WDJ&!+$7$627S%:@6PF@\\K9(N6/?A3Y,P56$H164F2H.@5A9X/DE<X\
MI KK2QR-M^>Q_)%=D2X.RW* "O?F+5$T,7SN)^^FE3*<!P0R7$31?V'%%0DE
M4VH96/VRBA1-/_-L%1C*!(-59SW!ZN&>$+ZA-S(]FR80GOQN4#%JB_M#ZHCT
M)";H;65-2"U%T_Z>LEP#;$BJRI3'41>IB*U?(D8W/5T">7&$$%-=NCH:NFZ/
M(73\VB:=5F-V+./4DEWO5X6'W@53AZE)B@MVG8R:(/4H0%F:D#6)\]&TI?RG
M,$"&%]#:S&9LQJXD8,J P :2@>L*D^*01HK73B09K3DX:)"4Q]"54;(%TS14
M/":A%3AS>6I9CP/-,9NPOR<CN8A=5VXB"RBH@UC":S5FZ4:")9B2*6O=3O"R
MQEU"4W'@-2$IR='CT%OV*CN%U4:V1EQENVJ@\CTYF1<T>%_?-(3N"-W1RMS1
M9]\1B\, @#PGH+IRBGCR;GMGYYTX34B!H%G% ESCD63^\D?'FP!?M%4$5SB>
M7$;4) )[?8^""%5PH AUB)U$^.N3&9FNP1>>OAH'0_K_1CI0#"<T/#\R3-?U
M'XAM.)XQ#WS7GS0W4Z+V=LC^,RX#,C.C." &S9T-?VR,'9<T$RDL/9\>2Y><
M*8C";NYC??/[=>#,3KVQ'U#I9/ZL! MDN(*EL3*_O/E%6FA?@BI4Y_-(&MG.
MZGT?3?$0*\$J,%[ TKI8_SLQYXE:A$R4@946Z_-H^O:MG3Q&@<FL4<A!'A"^
M:RV'HJN$RU8-82P70:%%VA*2KD5)\[Y\:;:0C1IXZ )E':8V4Z<Q5\"'/[_"
M)-G^(K'<.A2PV=<C]R3.F6^9RPN8E3@KHK84KTQ$WRXOMN7?#QW)VT_R@/!I
M-X>BB6'FH=,=5H[D-?=%4"#3922MIX.!C)>!E<X$]\"\_!W3*B^8UOMV:>;2
MV(: *Q*9P81$LF/Q-? *SK."J6NJ30YS>HS^+'^B4_[6['HTZ#0L(-"C:* 3
MP"+$#N)I/P5\Z*9WW8E9R:"@K"_AM<UH-H#/!11XGK(U\WGA UG- X*7<GM@
M^#J("8#=)1@X"UPBZ+.!/X*/+HC?$BS<'HI8&JW7LX&J+@,KV'(135MBPJZG
MYK%<0ED\_U?!P0E*%5'7//L41F26[6T']$$= G2FK475%8D]S@,2AHMY >)I
M&G"@<5D3-DY . 'A!(03$$Y W],$]#&@F>.U+SL%L@2#KL_E$#2Q^N[][KLM
M8:,< LA@"JLQK[QWHJ=E=B=-!8O@"CED&5&7"-X37S+[Y+B1[*Q^ 13*>@E)
MZ[57Q/YB!IZTW%*$5;K>*H>EK9 U]MF.@*GCVH'DK$0)%ES<*F%I*W/-"%N?
M-1W9.=8")+BT5<#1MED+MN=#?7]''WLY:&3VAP=EN0P,C_Y*:+KF]\!GSNGZ
M:2XI+><!H7-Z 47?\@J_4^G<G,_I")<MC!:!X4LH)31=Z]%F<$>"(QKD3/Q 
M5LPO T-7I"MHVJ[_.O)]]Q9VM*4,#+X0K(RFC?G<01G@\9P&'+ H#=A:)],K
M<D],\<NZ\H!*TVB&HHEAX,T#RG<.]'#; 'OM@V.ZE_X\=N5;=2K0X"F_@J=M
M=YE+#FW I0-Y0/".LCR*KMH:CY&/B>4'IFPO7 D66DLK8^F*59P0SGH9&!JU
M5-!0[2]9[5=D')!P"GVY:14<',=4$5$$-/YG-?X+_^31(I!,:0$'3I)R&&@D
M+]E(^'V7C+0X15J"@7>/+A'T'2I?4%VX*6FAO!$+?K2\"5_789RER\WRX?06
M4B%CS6C0(S@" CBH7_*@3N?R3['K*L8-)12UV*&"K%><,W9GF:(\91PU@:K8
M^BZYBAQ+7!G@(/!KK3BP+N-_\LR9A+\4!FKJ&;3&$L>(I+.,-,*I0"L4/$IX
M.I?&S$A^C5(>4&4Y;(&BB>'_Z_NS0\_.: L9*,$"V:Y@:58U6T'AU[^!E+> 
M5E1Z#D\S_W]$4Q+ !5B"*TJ01]0L N@.JC*P(OO:;YU*KE(&L5X$5;JJ63O;
MZ>D4$-\E6+7S+WUP3O*W;<F8* ##>2^A:39UP%'C(JBBF6L^)8WN'=U[9Q'0
MO:-[!W'^<MT[OZJ3N3+^@EPVBHB=N.+#<42"U$H=;R(W)A5*"G<%*]#4J9,;
M[Q_>[JBS3J"45'0"IZE3)]DY-IASJ<-0D;&*JU.60T5)#EO+4<;4/W)3*V"O
M&^XP:L54U$>LC-XJ]0"(7A7HZ-2%YKBWSCMTT >44@??M2*=E&:1SC8BI]1A
MCEN13I*WK9=F5CFSM6@JTC80Z%$TF!^L0>H@5E]S5J*N+U/'Y171Q'2@TU M
MLOILUD"FQP'+FM$1DC;0Z3!8&RGVZ-);:P-&IX,[7XDV,!#%0!0#40Q$,1#%
M0!0#T=4&HKS\RV=YSP:>*V[ 42HXUV#W*]&I!US! .!WD[1(J0^IS\T[DIXR
M:B=V X$V<C>2ZEEPGLPD'@"24D&I=%1!#;T^])"M1IUZN3 !SG M>AO)&PAI
M%[F-G-V$ZUNB@O+:#.$Z[&Y=V.O@;2%D)\GZ]T69XCHXHD8273IR%2ZHK<S=
M!>U/.O8.@)-')UP&S7"O(\%5> N!D(I&22_(@WIA4H2H(&,SB3X$5.O%>K0V
MPO77=T4;4>U (79K2^VS*W/.K9OH4$(*6H"3[$<AK<<Q@$8[-:QD=#>J76VT
MP\CH,(?^O$&=ZEMKH;/[ ]#J<;X&QIABU ZS=0\QI\2J%"0&4=%CZSWHX3<2
M 5Z0LH""OX! \RM13F=S/XC.J#Z$#2_!H'>(Y!"TLCKB)R\!;2> 2NQF*#TP
M#-3P$K@%XUJU/2+\*!]Y%+.]! -?X;-$T,@JS[@6-[Z-HB"VV(NZI*PTX"D(
MTTA!GW3L:IOPVD_Z6L90 1@N1PE-'_-_W)/@(7 BDIV:%KO$6@RX&'6XN@Y]
M.'.85\\#0H][%%!TW:)L!C"&\X#0FY0+*/HT#+#Q!11<MYJMF@H/X',!!5>I
M?C[5!V 3$ER*WH>ANE!-2' 3ZETH]DXL?H=9=.7[TA%0A(:+4<;39VD*_%>@
MX;;5$_\O)5P_>60.@HF>V:"0@2HX_ T/%42](H"&;0E6C7GM@S2A^\EW;1(D
M8=^Q$Q"+II!/L( 30D!)1ADIO8*S"+&+W")\-;'%E+1*O7#Z +X6L$K2Y+"T
M<@YP:'E )9Y[<6MT>@(T3:&46.7PNOEDKX%DK\"15*YKX%5YSV-JEX(/H>QN
M^FPH25_F*$57EK&9T,I$YH$%=Z==I<]1TJ:( LV5Z439RN6$M&FDMW%Q+7D?
M]P)*291KC>_@7E!4ZI\"O"KO?6J[BQ<2H2O+N"(O)&I*S0L!*6E31']>2-2J
MLI5K]D)0DMKN2/?LD>--7"*+APJ0X%O2"SC:>99YSP*D,L\ZO>B2ZB*' '*Q
M@%?F/X>IZ^Y!_\*/1E.?O>+[;TJ;#5%VZ\X%_9^0*1$B])9"(0F]BVB@ 5&"
M55M"TSXH$KIIS>UD-H^>$M\)8*:*I"1+'7H/W2$;ZR78%MVA<[PG=-,2HEIW
M5)&49*E#[Z$[8&ZL%J-%U^AW9;74F>*._'D+F3+,+K(M::Q"QF,:7T0D=:;_
M(F3.%\J]2!P*MB.I0RL"XKI=:-)41C]Y?#@Q'0_F#1O15=VJ@)!6D0\#:^K<
MD_/8C9Q4P0 &:["4!*S%URK7A9^^ .R)TK]W;$E,WX2D)%4=NE:A,O+'/@EI
M1,1WEP'XJD-3$JR>@%X[M.UK_X(\9$U!C*B$HF:!%63]XER: 1V\Q%:5J8RG
M+EB5@E;ICN.YZUAL-Q)<L@J.DE0UV%HEN@G9+LW'O+$#N*K!4I*J%E]KN4/1
M#38A*94Q>G2#15V!W6 SFI)@O;K!I DE-UB/HB12;VXP1U[)#0KPU 7KS0TF
M;:BYP08<):GZ<X,)?>Z0BG,^@*L:+"6I:O%U[;?Q??L3C:*/R=CQY*^#K()#
M=^#4(&H2X:-I?W*",%(0HQX%*$H3LK;712D(4@8&OQRJ)^;1G-"<=#)/B!V.
MS'OJ_\0,+.&@+.<Q]-YM3O5@TL1=^N+Q/*S:W>9++&V<S_Q[\B\BGLT64&!N
M%_!:^;SP;=GMZQF8$J<)@JZ7"WCVI3D1\YG"0%\ED$'K.B$82!E,0*!G^P*M
M[)VR>ZT\B_PQEK)9!(6FF"4DK29Z9H;\S!WQ).L:57 EDRTBZCHKQ/<4_FYZ
MMDL"WH[L!?(U"-"30K6H/0JRK<S.=@=1MK7)<AGX=FQ%'QW/IG,6I%=J,8"R
M-.!JNS'/#,73(X< WX5'83=^-L9^8/C!9$ LUYF'9! [ _9S.+"3E_C-W7CB
M>.&@T$_7#$+C&V4L0HFREV(>^=[8F<2!*7_5:R,6^!TSC?CKVV%]Z'QD^7/9
M"X'+T.HZSO"^"]TR.UH&]C+=EJ 5WI%4POMN=#LBDD1A"::DS01!-ZO\GM@P
M]"T'Y-8:L%0%J>)_)^9Q[T1/IS,:G<H5O015T&X>29=*TP(E@.TB*%3)):3O
MP!+2($S,7@8$+3HMP+\'!0;^0TB"43R7'A4O@D*564):7Y4J1,FI4'KCXR-_
M-J-QMT2J% @JV )\??6N48'\QA:9 A,@L (S\.] @6G:)V8O P)RN 3_#A1X
M&9 Q"8@G.S&>@P/7''(8ZZM)!1^ZE(B5&/6ZTG^1IP<_D+C2# @HWQ)\?=6O
MLZ V)T'TQ+KFR(\]<6!0@887TLIXO?#O18%S&TL7^)J06DF31U]?@U$:KTOQ
M]([6WXD[A\2?.3CHY)/'>!6]D)-(;R=\\8.[6^J-IR>>Y<M3JBHX4. Z1%V+
M8L<G,.;S@- %L0+*^IJ2OB-[Q/)Y15?,X!(,>APOA["^:E08D0N!](['460&
M43R_BL5SUA(,OA"W0'@5^D\%TJO]Y,Y=]B(IZ:U!>4CHSL4BCE:>TVE:>C%!
M"5B)\SS:J["A1"R])G1*(T ?8D%Y0/#VC#R*3H:!YE."56'[U1D/ETJO[;"S
M^)<D".>$OZ[TU+LB$R>, &?_:[$4;@!HP->5EBVI\Y?T#<4)51D:FHA5\7KB
M7[Q?I@+=DG]]^V2>.8-<RJ5WN+#W84 \;0X.*&(!0V^5%;)+J=6NL9[VB_$7
M13G1U(]AQSMJX!647L'4+(62""WYU\[\*'*LNR=&'CA-UR& \X0Z5,T+X7QX
M)9?2SX@7 :628BLNEPOHO J_R^33ZW OF('_8P8VL,=JX,%'$6HP7T6O+"33
M/Q>2(%]_%HM8 Z_@YBJ8NK;?W[)K'5+:<B&JX-!M^36(K\*Z"H+QSM%K9NM<
MNF0E9L>;C%C+-O7QXD,&%6B%0G8)3SO_+(KX:(:.=>(2-C4=VN8<+D\#MK)\
MC71ZD?<H#B-_UEK@.O16$M<3TK=59>PZDNMR,B#X5I447.]^&G;S=^!(3I65
M8-5VURRQM"U>L N0['0CGV0](@\*7L0H(O7"]J'K^@]A<@V! C=YM%;B% GT
M(MJE:T9T)ILI<)6AM!)IB=R+.#>>1RP2AF;@N.*,4H#72K 2A5ZD8\[PT+;E
M!Z2;T5K)5B30FV@W(0E +DZ,VEK$(A%M%Z[&MRY1<8,U". +5NM0M0H"<8(Y
M0"7&-3NZ,]\R70(RJ"(HD.DRDJ[*=NHA08R7@:%U[0J:KKJ8-:51&HCU(BBT
M%E9"ZH7M8V?,]T/"MC%+<%L)5D.E7TFOGV0G$D6(W61,2>@2T+EUJ=M+%0>*
M[NM1H$(U(&L2!SPGMI@!>YGOJ 9"_FHE7YPKYN#@*<H20]?Q-1LT)R_!H,?6
M;.WS[V\D.0Q'LD-1QTX8D(D9V$OS$_($(0"]UPA$:H6"?Z(36F>.&1&-"DC(
M]:6$3Y+Q58?05KA/&D?<@G@R&\ 826!5V<^P]'$..N.8@X-SK/VD(Z7)CZH3
M.U'#J>0,1@T\G/LJICXIDC!;QD$"!><X@]?')SO^[9CNN1E1+4AU782&\UW&
MT\@_"<;$BCAE*1<Y6 7>"U@:.8?4L')P"ASKKE:Q-[R"_)ZJQ]/LZT[#O*$)
M&R^"0O<?EI#TL0VUXB(HG.T^;#BY) LTN11!E2[ATC[%C!2F\E&KJ;R"I8]S
MD+9'RE/YJ(>I? 2:!$>*D^!(^R0X KKBD;(K'O7@B@_CR#_S3?%-ZAD0-.U;
M@&O;"<YO&R*C*/#OI#O!"[#@G> E+$V<7P>Q9YG2E8HE&)#?/((F5O\O"?Q$
M?&'+2S @JWD$7=65*!#O4V4 T'H*!]7(V(DGVR"P@%)@,877R.>YM,US!?[.
MM?(VFCKC2+R9?0FFP&6&H)O5=]]&#TX8_D:"F2D>Z?4HJB*4D/6+<S.",G(S
M4F>>X>@[EFC=L?+MV/4?Q+-G'A)^.#&/H^V6[Z,IH72]"]_CGV[]1R$;=0C@
MV[[K4'4:S-RT)%MQ,B@50TG@=1U?\CUV&S<1%T<74-#C24MX7<;,AL>A*UFG
M28&@)KP UQS2>),C4_*JFB*H8FB3(>E.TZ075!<@55.T'JZGEC*\!%/*A+6R
M>NDS); W/4MO-<E#0E?JBSAZ]Q/RCI/'Z!5HM3V%>3R\=?(%WCJ9:>/<]"A=
M<81?@E74]P)+,^>@QA5YU6X5H*Y5M 2-VRK^D6T081#@31/_]&"?EV9$4T4/
M5-EKP%&T@0JVK@LD///6)7;:C/0&B3(T] J)*IZNLI5-O,@9.R0(0:^7J(&'
MEJ_J,/OQ>R!)&G#:^<'>)%(2I:4,VIG/?!J(^3*PHM_LC?E+$LSB"' M>1V"
MHA!%5,TF=$7^'3L!/Y*CY'!K\!0-JY8"3B42P\O: 8G4A*1H@%5TW=T$'4UU
M"*H=U.=H6E[!"N-E :XJ1 Y16TWOPIR1D)6M/IEL<Z8XD*V"@^MY541-(IP3
M+_[3"9U;QZ4Z6AXYA,@CP04*)Z6BZQ"'8[K^!'2[=!$4>I"CA*2KC&FZ[JUI
MW5W[7Z@KD92[R\#0HF8%K2?F/[J^=4?LCT^)LI28*N&V%*U"1=?Q87GG*'6)
MYHY(S?)H:GH3<F3&(0F3 ^-")AJQU"X!JL/7=4; LY/]E^D[!D[#I")[YD\F
MDC?%BU&AYP@D1+35L5D9]-!U4XV.B&>'B]KHR;WL7!H 'USS!E#255XV YKD
MCN+;F1.&T@IS"1A:9*Z@Z1UQ9\2\@XP1!J<VJA(,?:JF$0:-PIU_%K;\;<+2
M0/:J=G]VZWB 4!-,!=XY4'JZJD_T-WY1"2C3KD!#JT]5/%V.(KZ- E-VZ"L%
M@@[Y!;AF)MGIMY,@D)SFJ$ KLIW#T[>$=$^":!0%-+.[]D\]FO+):C*U*/#%
MI%IDO>*D9*_]I!T(1R44-7$JR-HV0E//,*=^X5:R:S0/"-X$G4?1>,]JJ@SN
M\%)')PYKZW$4[EBMQ=:WU?^*1''@L;$GY*0 "=_RG\?1%F(%-".@$\UHZC_D
M+@F51$/U2.!@J@F]#Z&N2.C'@45:"5>#W$;(6C(:][(N(@;((*I#4-C?6D75
M=>^<1Y3DJ(&'WCQ7AZEKR]"#6F_4P$,W#]5AZI)B&A"UWJC%@$I2CZMKHHD]
M[XE7$D%33!D:.KE4\735*DV7'8,@=N92>/"?A _BQ$2(":U3BFGT5- 0RU6!
M;EFVT/L:I73STZG8O@J0T-2WB*,M .9*N/#Y:KK]QYB]?YXD52M))-N," Z&
M123T[9?.:%Z1,:O5$!K_09R $!.^GUI$HU<9TUI)"_Y2S$XR+FAHDI'??PD1
M*0\(E*"(HFT/=O Q(.;=<'M'/&<LX<#[L',8NKG=$9]"R<&I<KNC[QQ*1G-[
M"-,MA5/DEF/HYG9'_+J-')PJMSOZ7K&1T=P9PBR!PBERRS%T<[L-TRV%4^5V
M6ZMN+\C$9*G?13R[E7BR"C2<\S*>OKP&M(B<@X/G,=J7CR^6J5%XX1^EJZ&2
MB_+K<<";%1JP>Y H><&%JDP%K!92E?!U+\$H2-5-IA5(- NO_1%M!!)K5L'A
M<E00]8JPN+#O,O CW_+%!Y&;D-3$J4'7F^]<3P,_GDP!.Q?J$-3RFQ*JM@U^
MB<D>N<3TXKF8D2(L>#M?"4OK+G>VCY--5'XP,UW0I"+ 4]KYWD!!EW1L&T"H
M*%D]#E2J)FS=$AT[(3\YH"93&4M5JBJ^;KG2 Q%J8I605*6JH.OU;VQ22VE3
M%_HH.614CZ/FY:K8>B625-064&I<:ZRDU6W8@(4@.80.FT.T"<)>*\0N$Y_(
MMLCE 8&,%U%PKU2VV?%HZKCVERGQ )M#:S&4ME96<+5M:[=HW_)W<8\L7W:U
M= 4:O*F]@J?7U80 YHN@:DXGU,XVX+YRQ8O)M=] SFNL:@?0ZU%4:KK]'45_
MZ4?I4T>@)$4#CIKKZ4TB=KO#1]^_8W_5Y!)B@N<'(0T-,MJ!.3%FYJ,S8Y.^
M<6'>.Q/F XW(-P)G,HT,?VP0_AYUPPR(V4A.E1!  ^HD^U3(V'=MHE$O8GI=
MU".CK%]+-#9G*7#853LR.NI:D5/L41MZ3 9(KH-N5F4PA1'LDK&:1F384 7(
MZ?0BK[H):/.A*_2<A:8B?]Y>X"IR*W'KR/0B[*T?1?ZLO;RU^*U$;J#4ZRA>
M/&PQ]A8/.XW@')5^QV\;4:O(W<9NW\(N3:B-M#78'0VY;WDMPBZ&;2MO#78K
M>6OI].F9VPA;1NWBE?L6,_,-6:33PJUDJ)U\TY)(OZZIA9P5W&Z.J6=)EQZA
MA:A5Y(Y>J6=AE^Z@A;!5Y(XNJ6=A4X_00M(29A=_U+.,8S.,C'N'/!BWIHK+
M+>"UDJ]$H1?IEE]X0Y%YJQH"-U!H)7$CK5YD7Z32;46O)]!*\B92JQ#<B5S2
M4?0%"1W"YXCUZ;4>Q#M^)'A=/-:#OOT_HIE.6< R:L>9ME<QLRA-6<@B8J<(
ML5<!%]&9LH0ES&ZQ8:\R+@.5<]^Z,]B6 &-H4$@2F=94<'.-.JF.@503T96I
M94>?6G;Z4,M._VK)]T%AFFRG&@BY5NJ!$>Y%17[,!VTT)>G ;:<:$9E6*A$3
MU*^*Y>)(AQ4+(1%U-4C(]:F$+LL8>A:P5K_06==B^[4-$8TN.EC-2L>RO4X+
M'A(R7?2PLN6/ZBA4KJ<*2.CP"KW65VM&7P?Y=:R0B*FM9BQT4(&691,)N3Z5
MT&$114BDBQ)6M*12\<(=--!]@45$:Q5N4+6(VTQ!AQ/LLZA;XW':"Z]A*49(
M;#4.L+W\.M9GQ-16X_W::T#'HHV8V@I<7WOQ.Z_D"$CU*7BK=9T&]"Y"][[*
MLVRJXV*/E% 7-:QPZ6?9:+<5(!F=+NI8W7I08YO*RT)R2AHUTNLB4<4EJ=7@
M&] UN,;^JO%U<W!;J;NO(XEHK2(8;BMYU\6E9DHK"8/;BMUYQ4E :C7A7[?U
M)SA%/:'AZE:CQ*VW692"4]2MJ[Z7J):MZURI4J/:16?/M6ZUY$#'\A6,6A<]
MK68Q*W\(2GD12X(,E5Y*I@]AU1>K=)U 6]VYLWQ+JHM28MPVLO:Y")5OI\7B
MDQ2]C;P]+S;5C1I@:5F(VF74]E!,KATM+>1LOX@DH]*O#;<0M<-BD91,'\(J
M+PY)D-L(V^MB4(T7;"%IV\4?,8T^W1&LW"O"[.*,]!=X:SV!NI"M%W,D1/IU
M1.IRME^TD5'IUPNI2]I^<49&I4<7I"YFRT48(8D^!%18=&E$:R-<3XLL^29:
M+:X "+01M_?%E'QC;191Y/AMQ.Y[T430%G"Q!$)!@^0]+([4N I(M;@1K8.+
MTET9KI_35*5KN^@AIM%G$*@J8;O%#1&%7L,_5?%:+F((2?0;#K59M%"AU"U4
MZGN10M8J?'%"A9(NG?2S&)%OM?LBA"JU-KI9[:)#ON7VBPU0*FWTL>+%A0X'
M96 TE'6PHF,R->UU6'C0<T@&3*Y');1>C=!Q0@9(K$?QNRQ1:#H> Z>W F^@
M6@W5<#8&1FL5?J"]\!K6-%9S+D9H;.WEU['0L:)#,37MM5_VT'(D!DJM_UF@
MO?B=ET16<1Q&X&D42[#=#\. 2*W"Z;66O/OBR4H.P@C]2VOA-:RHK.84C-"Y
MM!9?PS++:H[ -/N7UK)W77M9P?F7FK;:K,1T//TBI].CO-V69[0=?5&AV*,V
M.JW9Z#KWHD!P=:I07<C1=^A%B63__E"I?-[QQ(N<SDIF_Y8B=U[Y6<5I%T%\
MV5+LCLM!_1]U$<65+67NND:T@G,NPH"JTXJ1_E,NK4BO6%$MEI'T'W%I1;I'
M16E<6^KG?$MK\CTJ3<."D][#+<ID=2DGK6)OM2JV29"APDO)]"%L:4EK&\YB
M&;.-F%4:?<A87K)2$+*"VD;*&B)]B%E<F%(0LH381L0*B3X$K"PZ*<A8Q6TC
M9AV5?EV0NJ15W&X.J%])2QY@J[7OV-+@?[96XW\4A*R@ZO _/8E9&1P*<E9Q
MM0S/GB2M# X%2:NX6H9G3Y(N/X,J<D+4-G+6$.E73&"U38+<3=0>JFHU<S6D
MX-"(UB%&T%U>J'< JM*U+9F):?0Y8ZI*V*XZ)J+0ZURI*E[+0IB01+]S1YO2
MEPJE;O-*W\4N6:OP*I<*)5TZZ:>NE6^U>T%+E5H;W:RVA)5ON7WM"DJEC3Y6
M7*WJL$,,1D-9!RO:(5;37LM*5C.!#K*OH*[5O"-;7?+N52XAK1YE;U?S:L3O
M('?_%3#![FMUP374P\3$5N+K6HNOH4@F)K8Z1P>M/303T.?H^JA"-+L6=<F[
ME].$M%8YY-6%UU!C$Q-;Y9!7%U]#X4U,K$?QVY;A!!0Z"+^*HEQ=:ZJU.2$-
M+?+W6:EKM?]-AMT]P.FM-M)V_QN @!8_MP+!6Y7VNNY_ Q!:Q9S>4N:N9;\5
M['\33A^=BH#Z][^U(KUB1;6H#.K?_]:*=(^*TE@N[&?_6VOR/2I-0PU1[_XW
M9;*:E;/=I938A*PH?#.9/H1M536LQ6PC9N]UPNWV!<)ZU#92]E\2W&Y;"ZQ#
M;"-BW]6_[0YEOP;<-F*NH-!7&O[JDG8N[35268'_@94U:C$U^!_]18S:\:\@
M9->"71.1E0Q/!3D[U^8:J:QD>"I(VKD,UTBE#TG;%=[J4=O(V7^IK=2,6HVM
M";F;J/U5U?)SM4+!H8K6(4;HJ;Q0<@"JTG4LF370Z'/&5)6P4W6LED*O<Z6J
M>-T*8?4D^IT[.I2^0)2ZS2LK*G8UMJI<Y0)1TJ637NM:VUH+6F!J;73S+"6L
M;2VU*RF5-OI8<;6J^_XW"0UE':QV_]MVS:*-8L:L;?^;F%2/@K<M;^G;_R:A
MU:/L[6I>NO:_"2GU*'7K0IC&_6\R8BOQ=:W%UU D6^G^-X%S@=8>M.U_$Y-:
MH:-3E[Q[.6V5^]^$0TQ=> TUMI7N?Q,.,77Q-13>5KK_+=]<VS*<OOUO$EHK
MD5VU-J=S_YN46O]!CE)%1,_^-P&=E?BZEB)W+N:M</];W6S:4NR.%;Z5[7^K
MG45;RMRU[+>Z_6_UTT>G(F!O^]_42*]842TJ@[WM?U,CW:.B-)8+>]W_IDZ^
M1Z5IJ"'VLO\-3E:#<B(21A]]WR6F=VQ&YI'OW9,@='RO$:\1 R"F %>3+$>^
MZP='9FB9-CFYIV.R^0+Q>G"@%'6(.D7X9%K4%I[D/*2 *FPO4'0R?!F0,0F(
M9Y$S)XR(1X)O-AE_"Q\BB_TLYTI"0$5 *:D5"!Y,;KL)GA'0(/B2U H$I_\S
M8S<B=C?QBV0T**%,< 6J\'R?^K? L4DW793H:%!&A6+/VHBFPVZN($^@H_Q%
M4BL0O),KR!/0(/C*7 %K3(,KJ)+1H(05NP+6I Y74$-'@S+Z<@4LP/L7>1J1
MZ)M-/PZ%#):!@7)5T?IAOGF)J0ZX'?-ZEHU*A!TO BN>P:JSGF#IY_R6I@E@
MUCFP.N\IFG[F/_[QV\WH7R?_!\I(!J\NPA)3HQ1_I X!.'"+X HRE!'[$D$^
M?(O@;470.(2S&8I[;E@$T8 #%:8)NQ^)%$(#(68[Z7H* (2M2(Q0B*I#RAZ,
M\Y/O1=_N37=,_\(8RV.H"E7$[466A<84)2K@M9*K1*%_Z8#F6(/87;Z>3''A
MBY5-LHS91L0JC5YE;-N9#00Z2;S2SBTTMM.5VQU]@N_H%SQKJ$T44(^K*FX3
ME7XE;35S"DETD[OWF534'-#&A21TBJ_/SME8@J_55*"!0M7@:>2_L< *F80@
M!!2DE)/J7_".8FL3>H4BPZ-&*)'NXO<33PJ-+"LC=K/Z/!4=IE^DUZ\>6#FU
M@_WGT+M)7B#4O\B=?%V!0'>Q5^;K"NL(7837./!KR*VB][L._"H5'7;0R\#_
MC40?3?MZ2F9$R%D.#BA+ 4,3MZ=>I+"IIP(-Y+P&3Q/_%_Z?IOM)9E4+*""_
M.7C=?&9A,ZS]#%J5[R6>)OXO73,:^\'L2)I=%B"!?)=P-/,L-8\\H"+'6HWD
MZK>/<OUF0$!&E^":F009<AE8D6GM9CPBD=PS9T! 9I?@NIB, L>;,(<I;G<!
M!F4TAZ"+U2_7<HO-@*!L+L U,PFRV#*P(M/:+9:;UC$)K<"91W3FS*(W(3=-
M2$!AFM'[$BIB#\3+R TX;47*L#5)!(E"U&(0W1$(U\#)(XU_60!V84J<8!5<
M1=,EQ%Y$D#K(*G@K$;0ZS")IN>^L@6\EA%Z/6J0M-?PJ>"L9M Z'RSB<VI2,
M.,I+@:!!X0)<$Y-_S(EWZ-E'KA^*1VL>$,AL$457.CDS)V)..00T;4Q@OU=E
M<FJGWB>33@8.>;BDJ?.<6)%S+V:_&0VZ%51 0*]H)[-Y]*0H5QE'3:@JMEZ)
M+OQ60M6@J<E52T!7_#P5G+O- *!Q\E33R=DDH3$]^U9\ BJ% :=(*;2N66;9
M'4=3TY/XQ@HT=-ZIXO7%_Q<GFNYLCR+'NGOZ2*;FO2,K!T$HM)6SGI9^V:\(
MY0_*&@=6ERA%TY6/4,?-7$,<B$TN!P?-2_(8NJ;FV[^I$NC@B\@1#?*(%UT_
MS263="T*=+IN0-9VRL.+ N<VCOR ]JH?!Q8YM,UY1&2'.IK0P&<XF@EH$HW3
M,V]=(MZ(L00#LIY'T+5S)IZ[CD6[&,AS#3QT3TP=IK:% V]!==&_-!D2R]*(
M!5Y(:,37=:+<#!TK3UK(3P4:>I*\BJ>)_UQFO:1^\C@/2"A=1I/@ F634M'9
M4Y?^/'9-6#\M855Z*8^ED_-SXL4JW!?A520H8VJ<RH$"%$$5)O0>V/[B!W>W
MQ+.F)Y[EVXXW$7NL*CB0_3I$75L:')>P B8+,P]G<QJKT>Q R$PM!G2K0CVN
MKES)F<U=<L+O#SDCYITX#2H!0[.G"II6YIFA EG/0)487R)IV[L;1H'_1.QC
MQW3]":,M"4%J$,#[<NM0-0ER[MNFRR/EQ^@Z,+UP+ EEZQ" @M2C:G1*X=R$
MQ>-E8 6'5$33U0MF9$VI@TN5(]9B$1:J^S*6OM)KP&>7\/#RU/&NIP$Q;?%0
MJ$<!R(&=_<R=C6I'M;]VM8L\E":5#(=[[_;%6R(2$* ",F!=-2XJ;41&5*,N
M.3>#.Q+<>+9_16Q?7*)J1(/6N 0$M(IV'KN1,\\:"9,669E004XI#26A =1Z
MU !K*&PM>P&[@]0E.IKDO9G;;8RY&0THH8B 5M&*2E00KAY12;PF$EH%//3L
M<Q),VO:A"%U)6#&A7D1NW;=B JW$[KFOCXE+HLS_@22MQ0"GU+6X>GWL0E&G
MWKWI.N+R4@..FC^M8O<KD?AL=A-2-YGTG;].?5AB!) ^JD-0\Y<EU!X%$7=-
M+48'4?1URF7@LP7<I/-!?J 6 [I(7X^K5Y9S_UY)DCR\FAQ%3/U2I+U]YEL\
M.U(5J@%=7<9&0IJ-T)\_*9E@#E[1  N8FJ5@V\AL95DJ6(H2U>#K[QVV,9-O
M%VICDD("ZOTG(-57AW837TZF;9>O3A7YQJ[]#OX)1JF#50AHZM7)%?',F=*$
M4\10D[&,JU>6)$Y7D:6(H29+&;>/8:LN41U>FX'9KW0)=;; G6Z[4^^T&N0V
M_5=+IK^N;"FRA$3[#NY3_$_\U21)M'Q&S#%(X"8D\#4/3>@]"'5!OQ/[U$OU
MJBQ? WX+41LI]2AU\JRUT$7T#C*7"?5AO8YW1VQU^RV@M;'@$H'>1$MTV5+ 
M(G)K,<MDM H+SJJKX$H"]9)34V*Q9YM>-(IO%<41HT)O89 0T2UFT@;;!J<N
M9SVNJJ!-5/0.0&B27057&V1]I-5+TFST*HJ11U':R;,DH9"W-"&U:%FYU<XM
M*F0 =0A*+28>N#0(%!@ X'?BAP['#MQ4L%OWAG(X4(>FUCIE7C60KD5IV6JK
M2%>&W9$7E?A3@MRV+Q3LH &I4\LJ49L059D+>#BE/A%76SKT^"7##X$#]80"
M1'6-@Z?I$G"KEN"S:0U"JQ95YK1:E%:MMNK3)D1E#A1E[BBORAS><9:BZ,D 
M5VRS#DFY9=HUR_1@9/)[EF07=3>BM6^=6<FQ,^97?4:*+%1Q-?'!#O2TY8/C
M*O%1B'H*1('Y3QFMFQ9:V$(!K=UN?V;'Y[['#B$)VZU#4&JQM"P+V1Q2CZ+4
MZG!_>W]O3]A* J)$E5U@PP\Q)J>WA.1+L I7Y!2P-%[K<YV:D92!#%"!YR6*
MKLNS M.Z._)]]Z,IN?LK!PB],*N HI/A/^+(=3S)G7$Y0!6&%RA:-Z+13HNH
M'[6O R*Y@Z<"KK3YK(BH582C*;'N;OU'15'JT)1$JB>@=YO@DZ)0102U[8%/
MO0C"O=F(!/>.)18@#ZARH'R!HFL@/_@G=,*)3?D%$D50Z& N(6DK$(=1X%C2
MT^\Y.'#A-X>AS&WAB^6[+IW9WP8DC%T:NC22^$S_-:XXU(%1W8#Y5Q@]N>2K
M\<4,/,>;4+:FQ(C,\,Y@N8CQ"__Y5\,)#9O, \)N';$'QDU(?WH,W8C^XM$4
MW[2K,F24DT.U?C"CY"ETY!N;Y''N!]%F')(@W+0L^M];$D<[.YNWL>/:FQ9S
M!WX<A9O)4V*YSCPD;YD**9'-5.9-ZL3CQ\$DNAL\OM__MK];9N$OR_<HPU^-
M"]\@CPY'-H+TIIK0,#W;\'S#XS4*@YW2>F/8/H/Q_(B=W6K6OD.CMP-1YP0)
MMP(8UCLU,.EG:^I_-:YBC_6)X0>30:J#P=]C&D$.&%XX.'3=:_XA[5]CS..&
MOM2[*>7C<>8VVS+[UTCOXS=^' [V!EL_-@]':FMO37<^-8T#UAU4I>S(?$2H
M,OAG.N9O!0%8>.\9_V$$^UO#K=WA&V/CF%B&L6=L;VV]^_F-<<8DVR2S_=UH
M<V)9QNY@.-AZ0TW#)2:U;*ZF1M+3*)H?;&Y.S6#F>T\#DX;T4S*@NH$-P6&'
M,8V#]64-UM@9S,V #HQDG%RRSU?9RT%"-F9&L1.1YQB_4-9P2.-8W6T]MF*G
MOY&5&&Z8W#XU&"5_GVT^%#.$HZ@6XX9Z_'@RC:C#MPB_)Y\:E)&<;'\[W&T.
M:MF_ ]?T)H.+V'4OZ3Q TZV3C,@!)4$,ZMZ(%QE3.G.X)* !.D]N#,OTF-IN
MB>%1U,86_H<9E0V.-^*9[B E&0Y&KGE/?D^^I<G3X!<V)'[=J/N)43[X\.'G
M5HTN[IWZXGBV_S!@S3BFZ_Q#TE=DIJV$&V5(WNS.^^T]/0VG M:WLK_5L9&!
M1QY*I)=-)8T,WW4696!:5%/A3\/=&N*['8G_-'P_"&*/[7E=F&2EF:VM8;MF
M1A&=JN-Y,DBH>_HI?<"\)+L^D36]409*>T>AR? A&CPX]H10[Y61/O.M.TZ^
M\" AK= C>=*C)ZJ2P/>H&0>,]&%('YS3KC$GU)(+OR9ZV]YIU]"Q$\Y=\ZG:
M1O9#(L;VA_V.]*G"#SV;?64W@!3);W]XIV9<YCRYZ9--* L+.K3OG= /!OZ<
M>,D(R8WY[$?>WKL/[[K:\O:>W)9W=K=?C"T73(H9P@E%KS.TO98RW9S6-U%Z
MGC0R?-_-VA;4BU;\OFV_5W2=]CV-CA;='S;TR(>N?I-/:57CVNEJPTR(F],R
MX>V=8=>9.)M%*I/(]G9GVC_M<N,O$=[=5W!/++$=V&9DWE(GP;K)OV5!$!]8
M5\1T9UGOI@'$1O(PD>!]9^58O!9.?2$=S8NG58'4IL'L/7@WIPWT<P")_>RV
M%,2Q2<']GAZ?'.:^AFP,;)0>IE.[0A_-:2N+)O^.Z0!@G1(Y,T(="<L=JFU6
MG_-F5?P5^7?L>/[CLF4JZ. D^9$23L)6;G^5AZES5)B%N1EF0BU;9#=ZT7EJ
MV<"9&=,.3,. I70;-1#J>E9F(M%U4]OOVC9=:I%[TD3DC=*C-)YNJVC%AH8R
MB9895T#&K/(Q^//\*OG$3-#Q[OT[<D[H5&%O%'YAB*JD$SHIT8WT6SKM*\P&
MF9F[6=^=FT[&ZJ? G)$'ZC8V^,-D"&TI3&'UQ&_9.AIU2#FJN[L*?5A/-2@0
M' [W%7Q:/<49_:= <E=!=&YH0GH[@C00DWY,^C'I7_M$"9-^3/HQZ0?*A$D_
M)OV8]&/2#VL1DWY,^C'IQZ0?DWY,^C'IQZ1_?1(E3/HQZ<>D'R@3)OV8]&/2
MCTD_K$5,^C'IQZ0?DWY,^C'IQZ0?D_[U290PZ<>D'Y-^H$R8]&/2CTD_)OVP
M%C'IQZ0?DWY,^C'IQZ0?DWY,^M<G4<*D'Y-^3/J!,F'2CTD_)OV8],-:Q*0?
MDWY,^C'IQZ0?DWY,^C'I7Y]$"9-^3/HQZ0?*A$D_)OV8]&/2#VL1DWY,^C'I
MQZ0?DWY,^C'IQZ1_?1(E3/HQZ<>D'R@3)OV8]&/2CTD_K$5,^C'IQZ0?DWY,
M^C'IQZ0?D_[U290PZ<>D'Y-^H$R8]&/2CTD_)OVP%C'IQZ0?DWY,^C'IQZ0?
MDWY,^M<G4<*D'Y-^3/J!,F'2CTD_)OV8],-:Q*0?DWY,^C'IQZ0?DWY,^C'I
M7Y]$"9-^3/HQZ0?*A$D_)OV8]&/2#VL1DWY,^C'IQZ0?DWY,^C'IQZ1_?1(E
M3/HQZ<>D'R@3)OV8]&/2CTD_K$5,^C'IQZ0?DWY,^C'IQZ0?D_[U290PZ<>D
M'Y-^H$R8]&/2CTD_)OVP%C'IQZ0?DWY,^C'IQZ0?DWY,^M<G4<*D'Y-^3/J!
M,F'2CTD_)OV8],-:Q*0?DWY,^C'IQZ0?DWY,^C'I7Y]$"9-^3/HQZ0?*A$D_
M)OV8]&/2#VL1DWY,^C'IQZ0?DWY,^C'IQZ1_?1(E3/HQZ<>D'R@3)OV8]&/2
MCTD_K$5,^C'IQZ0?DWY,^C'IQZ0?D_[U290PZ<>D'Y-^H$R8]&/2CTD_)OVP
M%C'IQZ0?DWY,^C'IQZ0?DWY,^M<G4<*D'Y-^3/J!,F'2CTD_)OV8],-:Q*0?
MDWY,^C'IQZ0?DWY,^C'I7Y]$"9-^3/HQZ0?*A$D_)OV8]&/2#VL1DWY,^C'I
MQZ0?DWY,^C'IQZ1_?1(E3/HQZ<>D'R@3)OV8]&/2CTD_K$5,^C'IQZ0?DWY,
M^C'IQZ0?D_[U290PZ<>D'Y-^H$R8]&/2CTD_)OVP%C'IQZ0?DWY,^C'IQZ0?
MDWY,^M<G4<*D'Y-^3/J!,F'2CTD_)OV8],-:Q*0?DWY,^C'IQZ0?DWY,^C'I
M7Y]$"9-^3/HQZ0?*A$D_)OV8]&/2#VL1DWY,^C'IQZ0?DWY,^C'IQZ1_?1(E
M3/HQZ<>D'R@3)OV8]&/2CTD_K$5,^C'IQZ0?DWY,^C'IQZ0?D_[U290PZ<>D
M'Y-^H$R8]&/2CTD_)OVP%C'IQZ0?DWY,^C'IQZ0?DWY,^M<G4<*D'Y-^3/J!
M,F'2CTD_)OV8],-:Q*0?DWY,^C'I_XZ2_L_T7^.*A'3&.3"V"V"%+Y;O,F-X
M&W#0L%H,^"N,GESRU?AB!AZ=W@Z,B&;]D1G>&1[M6^,7_O.OAA,:-ID'A+H3
M8@^,FY#^]!BZ$?W%"R,:P0P:*5\'IA>RV822I]"1;VR2Q[D?1)LQG4G#3<NB
M_[TE<;2SLWD;.ZZ]235BW=%H*=Q,GJ8J>QM1ETV);*;";+J.%S\.)M'=X/']
M_K?]78$:7&)Z\?R@&8):A^#75(T"B GQKIIT;/QE^?.GK\81_9<I86B,'9=J
M69\F'F?5(LQ+[MEI)!#H,O!9Q,@:U:B_S5(,PT#";V43&U!(G1W'! 6V+-3)
MF<^3"(-_#:>$1)U99'_?I@^S'S?G;CRA=E%@F0%N?KZY.+T>_.?HK'F(Q,Z<
M!,Q<3,\B@J'$(SC![R&)KI()^C"PILZ]B)8C)27T"OSWMW2.'TS^J8SKOVSB
MDH@J_YC]9=JW'3J.:,#PI%7YU4Z?W=&6J#_AP;O-FCWHK\62/FE,Y[HL>+Y,
M3$'H-;VQ,XD#<DW,&4,1^U]N]RU=;'_.+G/>"\I'?NS:!BM_CVE*F+CR7L9:
MG5L8Y(90YHL8?VOAI$NCG=@.'0NB'L61_AV.=%E'Q4[4H9]CA\LI,CH:.M? 
MI)^MJ?_58*53ULNE$9@:=#H23Y)O3-H1XWF0QN/<(W3OI:8@M^P6)$Q1'U'G
MTY8K@,8]Y8\M&OXX'.P-MGXT&J&IWWQKNO.I:1QP]V?YLSD;%E1-_+,9.;=N
MU88S]/#>,_[#"/:WAEN[PS?&QC&Q#&//V-[:>O?S&^.,B;E)9ON[T>;$LHS=
MP7"P]<8(Z( SJ9?F.FLD/8VB^<'FYM0,9K[W-##G)M7N@"H*$Z-J8F3P*<VC
M#'\U+GR#/#H<F:HZ].. 1M:&Z;'YS? H5>IS(O(8O3%LG\'0;I_2OYAHO19+
M68-$J^# GB7ADG#P"A(OS[QW)B85$H,Q#,94.FI]@[$DWED8]N B^_3< 1F 
M,0S*,"C#H R#LO4-RDI.[/GJX"(>7D%@]I#MN6 #.HE#,43#$$VEH]8W1%L8
M]V!IW>FH7NPUNJ:_)$6KYX[;VG*+P1P&<QC,83"WOL%<LV=[EKA.A9U7$.(%
MEFBP8DB'(9WFD([M+.R[[D:->G!ES9\[9FM@!D,R#,DP),.0;'U#LH7C>L;*
M6FWKKR#@NG?( ^XZPY#KE531DL'*C7HP#_PY"2*'A(/(O+VE+O4P45;XK &8
ME#D,R# @PX , [)U#\@:'-DS!FE@CEY\X/:W'=GD-IY@Y(:1FTI'K6GD1LUY
MP.TY'<B'<>3/6*<\6[U,PA'&:+48B_GT]Z,K@RG.".^<^9P.+CHE66R*#2;4
MG?YY3H,3&K4P<<-XSGJ380Q$8T 0^_W%75U &)VO?"I?S3DSN8VP"(+,YE'I
MR%F1X>LIA;),C]T09YF46]NX?4HB$J;!SU1;-.+CGC'VJ$Q4#\1VGUY54//*
MPE^T2,P 7F\&4+*RU0?\4@9>8GR?GT>O:51.FSLP[ASJ76QNG&%\^W:>=&XC
M7G9O2CI51[[OA@/3BP;,LFTR#@?L+I3!F-U"PS\E=PN] ]RA*2')$..(L,\Y
MRD/(%6TPRGFJD%MS*E1OO#O/?_!.7#(C]&M&MO0XO8M,<DM>&'N+JX-^(QX)
MF'M(;@TZY#>T^<%V=IE0VH QXG,5G"Y+AR8F,Z\BX5,:'F:TA3")*))K,E6N
M0MI[#[ASLZ)W.[V8<I#=4'D3.?2G3/_%IVG_MFGGFEI-=N)_@W])+@;:!=QX
M6$.,!:H+)M.O"<$]P(503013_AA[89%J*]U29_\WZ[.4SQ'U8<1.R(8;V8_I
MK8;;@"N<*@U,B4M9'HRHA;GDB'G!$]Z4'V1M9JW5@:22P>]Y8DTN[DKCESZQ
M)R?)KP F!)#26Z*@2JY7[_ ]X%K!9D]WF/-(AYD;VAT"+GUKIGG$*@Q%.\X]
MZC#2T).B)T5/BI[TM7M2]'/HY]#/H9]#/X=^#OT<^CGT<R_;SV%FC)YTC3SI
MPAQ'Y-\QM0N'CNR,X]PCWL(^X%T+:(UHC1JL\=RT O^4;5!BU^9F3!>?)NU\
M:./8T2C1*#'85&P @TT,-M&3HB=%3]K5D]9ZD1+E[0]M-)SZZ/35=DVNL?QS
MZF$T^69)XPU027^UR3#T^62Q>*?I$^J3V?;Q]+5BU:=IKJ3P^BL-[>U^D%AZ
MW@E>4.=V3QH=X-9& F D$-KH;C3^GH;RK]Z-YSN<]W.Q;TM]NC=4>+EA#<GD
M97YEHBIOXL8W)N(;$Q7?F(A^9HW\#+X*LOVK( M?_K:CV,%SCGC.4:&C./=_
MC 00+C'O9*<AU_FTY.+,\WH<E6QB!\])UF)\-O&-M*_MS%_A"QYX>VT'WI[O
M+;?BUE_B4;=J?$>#;Y.%0LPR,=3#4$^AHUY"D)8S[P%5$KOKB_YWM7SZ;->2
MM6$3@SH,ZC"H*QL!!G4O-ZC+>[[G#?#$G+SX8,^-[@K!'I<9(SZ,^%0Z:DTC
M/FK;;!CG@ZBT)O:,U\[*F<)H#L,T#-,P3%O3,*W)@:T^3(-S\AK"-+93 0,U
M#-1>::"6;,19NU!-QA8&:XV2)[MX3AXM,F=[T@[H'!^[-A=M[-!X)?&'QH\P
ME?_8V%9YCPL#S[9PL4Y*=_RYU,WS-? CUPP76V]S .E)"(5=/PTM34C$OC4U
ML;T#V-XM:>(7-E1_;6QA&W">0])";M-;A;RRCFY.&8W<!L6?=G@#E>?9+84*
M^[K"AVCPX-ALG_. <6G207+F6W>\@<*#='-].]*C)\^:!K[G_)/NM@SI@W,:
M:YD3$FX4?DTWK2ML],HWQ(XKN.93M8WLAW1W^ >%[92U]&G\>NC9V>F((OGM
M#^\4^I@&88OMH8NW#3,!3NZ)%YWY_GQC^3@= ^\5=JTUTK\YK1)6V69;3]CD
MFQ9_VJW0WAYV9?JG76Z6)<*[^ZI;8VTS,F^I$V7NT;^ED^ ]L_+!%3'=&6OA
MBQ--TU,%&\G#]-A19ZU;/%RBAD.'UN)I52"%$P:TG4O7C%BR='/:0#\'D(RN
MW9:".#9A&[<7_N;T^"3O?I(=S*6'ZCNGZYU>>9-VD_=3.1G8W%(3^7W5N:%*
M)]%2 _WMH4(#N*D>-]4K;JJO;A#_\_PJ^<1L,-G0G>P2WRC\PA#U[3W?&2I$
M<;CWO/W><ZFA">F)3C;C_@ L/&/A^445GNMK \]3>H;R\N*+SVQ48Z49*\TJ
M'=6MTLR&5D^U9F;,:1%W4=YZY/6Z9SNO(V,):\P8EV%<AG'9FL9E2_>U^CA,
MU/:+C[O^IJ&E:!+%P L#KY<3>'%KSL<ZGS_1!\\>?$'8P@ , S ,P#  6], 
MK.S"GN' C)2#UQ&,Y9;=,2[#N$REH]8^+F.Q3WY;R<?D[UH$9U+>,$)K&:$!
MUD+YQQ<\/6,@AX'<RPKD2N[N^>(Y*2,O/JQC0^(V'H\I.QC1842GTE%K&]'Q
MC0DYPTX'\B?ZY&/RY%F#.A7V,*YK&=>]Y&D8 S8,V%Y&P%;ORE8?KT'Y>/'A
MFNGAW=,8J+V.4\_\I50\]$GOFDH&!GMI17*TYED./0.XPJ"L%J-00AMB[(:Q
M&\9N:QR[Y1W=ZB,V<>LO/DX+'_#$ $9IKZ.<QBY/2(8JMUMV]\MOT=VS!6@B
M=C RJ\5H_&'C_,G(G? V+NBL>;"]M_O^P\\'!M7JVR^'5Q>G%[\9__M_'QBT
M/[XEEVA\"YU_R#<Z2GPVHVY06#.*R&P>L2DC>VPDL/1/-&6?Z;]OASS F1)G
M,HV,+>07^7TU_,)3G+^XWPH(<Y5?><3*0^5>8A@%Q\FB9*:#IX& V^LIA;),
MS[@E] ]EU39NGY*HF](Q/O]YSK(:'BK$'A6(*H'8[M.K"MQ?68KWO9LCIKBO
M-L5=F-CJ\UM!TR\^N:7F-+/NUW>_2#Y"N*9M4-T<&'<.]7TV'SUA?/MVGEA?
M(U[C&\;9T+/).!RP<N=@S.ZMX9^2VXC> >Y^DI!DB'%$V.<<Y>$'P+4P,,IY
MJI![=BI4;[P[SW_P3EPR(][B7>L;I<?IA6N2N[SR+]C]C7@D8/ZK^.[<[>SZ
MH;0!8\1GTE?_XMZ*WNWTJL)!=F?A3>30GS+]%Y^F_=NFG6MJ-8,Y"=B<L,&_
M)%<)[0+N9:LA%M H>L%D^C4AN >X0JJ)8,H?8R\L4FVE6SH;_<WZ+.5S1!TN
ML1.RX4;V8WH]W3;@TJ=* U/B4I8'(VIA+CEB+ON$-^4'69M9:W4@J61JKX!?
MW*[&E\?9D_1Z!0 3 DCIO5)0)=>K=_@><'=BLZ<[S'FDP\P-[0X!U\0UTSQB
M!<&B'><>=1AIZ$G1DZ(G14_ZVCTI^CGT<^CGT,^AGT,_I^CG7L!N!73#Z(;1
M#:^1&\;$_04Z^M?K21?F."+_CJE=.'1D9QSG'O$6]K?1&M$:5V*-YZ85^*=L
MNZ-GD073Q:=).Q_:.'8T2C1*##85&\!@$X--]*3H2=&3=O6DM5ZD1'G[0QL-
MISXZ?;U@DVLL_YQZ&$V^6=)X U327VTR#'T^62S>:?J$^N3<>UBK3]-<2>%]
M7AK:VY6]EC7O!"^H<[LGC0YP:R,!,!((;70W&G]/0_E7[\;S'<[[N=BWI3[=
M&P*&@X!D\G;",M$/+5X+AZ^ Q%=  E\!B7YFC?P,OMNRV[LM\:RO*GIO-[*P
MC?WIF1S+N@_3N<YUCWPF]3.=]Y4SA:=^FRP6+UKIX13>NHW.M1N9."IQ5+Z.
ML[&%+W@V]#6=#<T[K]1W/<?K^P!,O/CSHDPL+J1'\%8DO!5IA9E2WY>,)T.7
MFC4+>RY(]&RAF( ;C,,P#L,X#..P-8W#BI[KF:X.%[3_XJ,O&LM\_O-\'/@S
M:G#!:$XL9^P0NWFV*\P)_EA!HM SY^'4CS:G]MWFW^Q_ =F\=;Q-3I*:_R'W
MR\;OB9LVLG4<.IUL6#_S01OPJ[6&'S[0"8)-#,8UA4_11OXX>C #8GSR8\].
M;ORB,X\3A8;K6,0+_2!\8YC4?24K5G0NJIOY:J04S'P)=.N9+T'O9>9+2*O<
M!IA@?-X>G;S='VP=&,9/_Y5]^6\Q^!X'UV0),ENE7F=.@L@APBMF[,B<8SJ!
MZ<0*TXG>2KO4F.G(S>Y#8S+2"/Y97CA9RPBF$)A"8 J!*<2:IA %I_4,+XL4
M-__B$XC8Q"@+HRR5CEK3*"LVT[CF.1?-JTQ@=(71%497&%VM:725.:S5!U;-
M+;_$F.KCS>G9L3&Z.3HZ&8T^W0@"+B'DM4_G=(,%5 ?&_LY[@QI<3%NE RDD
MU&?8/_R0#M !E6<>T[#4'X3Q;&8&SC_II-PJ),EZ*7G&IH3A]M;>M^'>UO8/
MW0:VC+)N=K/?ZMG>W^6,AQTY7S3R P]+!V3LILJ/_-B:IM) QJVH$?J,4?XA
M/V%\$M_>ST<40]Q,(CY.=[ S2,88)4;G$2H]BQ[XO#/01YP-X+H&?F"AB4]'
M3W*M_R [6CA(XYZ#'WZ8I$=54Y#%Q)($%Y_-\IL'*^&^>G07?,L&T&.D3'*I
MB(A/T05Y.E +DK"V2.X'.TY.Z##U<&,9.-[ -1<1<I?DIVA^"5%=PS)'K3P.
M=[?:#L.4Z _LQ0_LI 15ON\-V$BAV5 44]/Y@:TI,6\:\R6D3X>G9R?'R7M>
M^.LOJ/_T'Q@3Y-$B\XA;X'7QAR"@$;5O67$04-$?IFQ8I!3ISQ%[+06U>>IO
MFWE/#P5E;&=GA.BD>K#WX<#0W^#2BKC:>$N[.UL'QLG-M3$V*46;-QL0@RVR
M+5^8P7^DF6'XPR^;YJ^_;-((B?Y[Z]M/] ^;BG_]?U!+ 0(4 PH    ( !8-
MAC<.V'/0$&8  )L="  2              "D@0    !E>&5C=71I;VY?;&]G
;+FAT;6Q02P4&      $  0!     0&8      
end

Mime
View raw message