harmony-alerts mailing list archives

Site index · List index
Message view « Date » · « Thread »
Top « Date » · « Thread »
From nom...@intel.com
Subject [build-test alert] FAILED Linux x86: jdktools-test debug
Date Wed, 05 Dec 2007 15:41:50 GMT

BUILD FAILED:
	Ant Error Message:
/export/users/cc/cc-common/scripts/cc-exec-adaptor.xml:104: The following error occurred while
executing this line: /export/users/cc/cc-common/adaptors/jdktools-test/adaptor.xml:28: The
following error occurred while executing this line: /export/users/cc/cc-common/build/checkouts/hdk/working_jdktools/build.xml:242:
The following error occurred while executing this line: /export/users/cc/cc-common/build/checkouts/hdk/working_jdktools/make/build-test.xml:60:
The following error occurred while executing this line: /export/users/cc/cc-common/build/checkouts/hdk/working_jdktools/make/properties.xml:325:
The following error occurred while executing this line: /export/users/cc/cc-common/build/checkouts/hdk/working_jdktools/modules/samsa/build.xml:144:
exec returned: 134

Date of build:	2007-12-05 21:41:24 +0600
Time to build:	19 seconds
Last changed:	12/05/2007 20:40:19
Last log entry:	hdk

***********************************************************
Errors/Warnings:	(259)
            
Tests FAILED
========================================
Testing jdktools binaries...
========================================
Compiling JPDA tests
Since fork is false, ignoring memoryMaximumSize setting
----------
1. WARNING in /export/users/cc/cc-common/build/checkouts/hdk/working_jdktools/modules/jpda/test/common/unit/org/apache/harmony/jpda/tests/framework/DebuggeeRegister.java
(at line 58)
registered.add(debuggee);
^^^^^^^^^^^^^^^^^^^^^^^^
Type safety: The method add(Object) belongs to the raw type LinkedList. References to generic
type LinkedList<E> should be parameterized
----------
----------
2. WARNING in /export/users/cc/cc-common/build/checkouts/hdk/working_jdktools/modules/jpda/test/common/unit/org/apache/harmony/jpda/tests/framework/TestOptions.java
(at line 505)
internalProperties.put(name, value);
^^^^^^^^^^^^^^^^^^^^^^^^^^^^^^^^^^^
Type safety: The method put(Object, Object) belongs to the raw type HashMap. References to
generic type HashMap<K,V> should be parameterized
----------
----------
3. WARNING in /export/users/cc/cc-common/build/checkouts/hdk/working_jdktools/modules/jpda/test/common/unit/org/apache/harmony/jpda/tests/framework/jdwp/PacketDispatcher.java
(at line 114)
eventQueue.add(eventPacket);
^^^^^^^^^^^^^^^^^^^^^^^^^^^
Type safety: The method add(Object) belongs to the raw type List. References to generic type
List<E> should be parameterized
----------
4. WARNING in /export/users/cc/cc-common/build/checkouts/hdk/working_jdktools/modules/jpda/test/common/unit/org/apache/harmony/jpda/tests/framework/jdwp/PacketDispatcher.java
(at line 249)
replies.put(new Integer(replyPacket.getId()),
replyPacket);
^^^^^^^^^^^^^^^^^^^^^^^^^^^^^^^^^^^^^^^^^^^^^^^^^^^^^^^^^^^^^^^^^^^^^^^^^^^^^^^^^^^^^^^^^^
Type safety: The method put(Object, Object) belongs to the raw type Hashtable. References
to generic type Hashtable<K,V> should be parameterized
----------
5. WARNING in /export/users/cc/cc-common/build/checkouts/hdk/working_jdktools/modules/jpda/test/common/unit/org/apache/harmony/jpda/tests/framework/jdwp/PacketDispatcher.java
(at line 284)
commands.put(Id, command);
^^^^^^^^^^^^^^^^^^^^^^^^^
Type safety: The method put(Object, Object) belongs to the raw type Hashtable. References
to generic type Hashtable<K,V> should be parameterized
----------
6. WARNING in /export/users/cc/cc-common/build/checkouts/hdk/working_jdktools/modules/jpda/test/common/unit/org/apache/harmony/jpda/tests/framework/jdwp/PacketDispatcher.java
(at line 355)
commands.put(Id, command);
^^^^^^^^^^^^^^^^^^^^^^^^^
Type safety: The method put(Object, Object) belongs to the raw type Hashtable. References
to generic type Hashtable<K,V> should be parameterized
----------
----------
7. WARNING in /export/users/cc/cc-common/build/checkouts/hdk/working_jdktools/modules/jpda/test/common/unit/org/apache/harmony/jpda/tests/framework/jdwp/VmMirror.java
(at line 1834)
frames.add(frame);
^^^^^^^^^^^^^^^^^
Type safety: The method add(Object) belongs to the raw type ArrayList. References to generic
type ArrayList<E> should be parameterized
----------
8. WARNING in /export/users/cc/cc-common/build/checkouts/hdk/working_jdktools/modules/jpda/test/common/unit/org/apache/harmony/jpda/tests/framework/jdwp/VmMirror.java
(at line 1902)
vars.add(var);
^^^^^^^^^^^^^
Type safety: The method add(Object) belongs to the raw type ArrayList. References to generic
type ArrayList<E> should be parameterized
----------
9. WARNING in /export/users/cc/cc-common/build/checkouts/hdk/working_jdktools/modules/jpda/test/common/unit/org/apache/harmony/jpda/tests/framework/jdwp/VmMirror.java
(at line 2122)
fields.add(superClassFields.toArray()[i]);
^^^^^^^^^^^^^^^^^^^^^^^^^^^^^^^^^^^^^^^^^
Type safety: The method add(Object) belongs to the raw type ArrayList. References to generic
type ArrayList<E> should be parameterized
----------
10. WARNING in /export/users/cc/cc-common/build/checkouts/hdk/working_jdktools/modules/jpda/test/common/unit/org/apache/harmony/jpda/tests/framework/jdwp/VmMirror.java
(at line 2132)
fields.add(field);
^^^^^^^^^^^^^^^^^
Type safety: The method add(Object) belongs to the raw type ArrayList. References to generic
type ArrayList<E> should be parameterized
----------
----------
11. WARNING in /export/users/cc/cc-common/build/checkouts/hdk/working_jdktools/modules/jpda/test/common/unit/org/apache/harmony/jpda/tests/jdwp/DebuggerOnDemand/OnthowDebuggerLaunchDebuggee.java
(at line 94)
class ExceptionForDebugger extends Exception {
^^^^^^^^^^^^^^^^^^^^
The serializable class ExceptionForDebugger does not declare a static final serialVersionUID
field of type long
----------
----------
12. WARNING in /export/users/cc/cc-common/build/checkouts/hdk/working_jdktools/modules/jpda/test/common/unit/org/apache/harmony/jpda/tests/jdwp/Events/ClassUnloadDebuggee.java
(at line 32)
import java.util.LinkedList;
^^^^^^^^^^^^^^^^^^^^
The import java.util.LinkedList is never used
----------
13. WARNING in /export/users/cc/cc-common/build/checkouts/hdk/working_jdktools/modules/jpda/test/common/unit/org/apache/harmony/jpda/tests/jdwp/Events/ClassUnloadDebuggee.java
(at line 97)
boolean isOutOfMemory = false;
^^^^^^^^^^^^^
The local variable isOutOfMemory is never read
----------
14. WARNING in /export/users/cc/cc-common/build/checkouts/hdk/working_jdktools/modules/jpda/test/common/unit/org/apache/harmony/jpda/tests/jdwp/Events/ClassUnloadDebuggee.java
(at line 171)
public Class loadClass(String name) throws ClassNotFoundException {
^^^^^
Type safety: The return type Class for loadClass(String) from the type ClassUnloadDebuggee.CustomLoader
needs unchecked conversion to conform to Class<?> from the type ClassLoader
----------
15. WARNING in /export/users/cc/cc-common/build/checkouts/hdk/working_jdktools/modules/jpda/test/common/unit/org/apache/harmony/jpda/tests/jdwp/Events/ClassUnloadDebuggee.java
(at line 179)
public Class findClass(String name) throws ClassNotFoundException {
^^^^^
Type safety: The return type Class for findClass(String) from the type ClassUnloadDebuggee.CustomLoader
needs unchecked conversion to conform to Class<?> from the type ClassLoader
----------
----------
16. WARNING in /export/users/cc/cc-common/build/checkouts/hdk/working_jdktools/modules/jpda/test/common/unit/org/apache/harmony/jpda/tests/jdwp/Events/CombinedEvents002Test.java
(at line 100)
boolean expectColocatedEvents = (testedMethodStartCodeIndex == testedMethodEndCodeIndex);
^^^^^^^^^^^^^^^^^^^^^
The local variable expectColocatedEvents is never read
----------
----------
17. WARNING in /export/users/cc/cc-common/build/checkouts/hdk/working_jdktools/modules/jpda/test/common/unit/org/apache/harmony/jpda/tests/jdwp/Events/CombinedEvents003Test.java
(at line 53)
private boolean eventMethodExitReceived = false;
^^^^^^^^^^^^^^^^^^^^^^^
The field CombinedEvents003Test.eventMethodExitReceived is never read locally
----------
18. WARNING in /export/users/cc/cc-common/build/checkouts/hdk/working_jdktools/modules/jpda/test/common/unit/org/apache/harmony/jpda/tests/jdwp/Events/CombinedEvents003Test.java
(at line 76)
int EXPECTED_EVENTS_COUNT = EXPECTED_EVENTS_ARRAY.length;
^^^^^^^^^^^^^^^^^^^^^
The local variable EXPECTED_EVENTS_COUNT is never read
----------
----------
19. WARNING in /export/users/cc/cc-common/build/checkouts/hdk/working_jdktools/modules/jpda/test/common/unit/org/apache/harmony/jpda/tests/jdwp/Events/CombinedEventsTest.java
(at line 84)
int EXPECTED_EVENTS_COUNT = EXPECTED_EVENTS_ARRAY.length;
^^^^^^^^^^^^^^^^^^^^^
The local variable EXPECTED_EVENTS_COUNT is never read
----------
20. WARNING in /export/users/cc/cc-common/build/checkouts/hdk/working_jdktools/modules/jpda/test/common/unit/org/apache/harmony/jpda/tests/jdwp/Events/CombinedEventsTest.java
(at line 212)
int EXPECTED_EVENTS_COUNT = EXPECTED_EVENTS_ARRAY.length;
^^^^^^^^^^^^^^^^^^^^^
The local variable EXPECTED_EVENTS_COUNT is never read
----------
21. WARNING in /export/users/cc/cc-common/build/checkouts/hdk/working_jdktools/modules/jpda/test/common/unit/org/apache/harmony/jpda/tests/jdwp/Events/CombinedEventsTest.java
(at line 348)
int EXPECTED_EVENTS_COUNT = EXPECTED_EVENTS_ARRAY.length;
^^^^^^^^^^^^^^^^^^^^^
The local variable EXPECTED_EVENTS_COUNT is never read
----------
22. WARNING in /export/users/cc/cc-common/build/checkouts/hdk/working_jdktools/modules/jpda/test/common/unit/org/apache/harmony/jpda/tests/jdwp/Events/CombinedEventsTest.java
(at line 732)
String failureMessage = "## FAILURE during checking events! !";
^^^^^^^^^^^^^^
The local variable failureMessage is never read
----------
23. WARNING in /export/users/cc/cc-common/build/checkouts/hdk/working_jdktools/modules/jpda/test/common/unit/org/apache/harmony/jpda/tests/jdwp/Events/CombinedEventsTest.java
(at line 894)
String failureMessage = "## FAILURE during checking events !";
^^^^^^^^^^^^^^
The local variable failureMessage is never read
----------
----------
24. WARNING in /export/users/cc/cc-common/build/checkouts/hdk/working_jdktools/modules/jpda/test/common/unit/org/apache/harmony/jpda/tests/jdwp/Events/CombinedEventsTestCase.java
(at line 135)
long methodStartCodeIndex = lineTableReply.getNextValueAsLong();
^^^^^^^^^^^^^^^^^^^^
The local variable methodStartCodeIndex is never read
----------
25. WARNING in /export/users/cc/cc-common/build/checkouts/hdk/working_jdktools/modules/jpda/test/common/unit/org/apache/harmony/jpda/tests/jdwp/Events/CombinedEventsTestCase.java
(at line 187)
long methodStartCodeIndex = reply.getNextValueAsLong();
^^^^^^^^^^^^^^^^^^^^
The local variable methodStartCodeIndex is never read
----------
----------
26. WARNING in /export/users/cc/cc-common/build/checkouts/hdk/working_jdktools/modules/jpda/test/common/unit/org/apache/harmony/jpda/tests/jdwp/Events/ExceptionTest.java
(at line 188)
long frameID = reply.getNextValueAsFrameID();
^^^^^^^
The local variable frameID is never read
----------
----------
27. WARNING in /export/users/cc/cc-common/build/checkouts/hdk/working_jdktools/modules/jpda/test/common/unit/org/apache/harmony/jpda/tests/jdwp/ThreadReference/FramesTest.java
(at line 450)
frames.add(new FrameStruct(frameID, loc));
^^^^^^^^^^^^^^^^^^^^^^^^^^^^^^^^^^^^^^^^^
Type safety: The method add(Object) belongs to the raw type Vector. References to generic
type Vector<E> should be parameterized
----------
----------
28. WARNING in /export/users/cc/cc-common/build/checkouts/hdk/working_jdktools/modules/jpda/test/common/unit/org/apache/harmony/jpda/tests/jdwp/share/JDWPUnitDebuggeeProcessWrapper.java
(at line 233)
argv.add(val);
^^^^^^^^^^^^^
Type safety: The method add(Object) belongs to the raw type Vector. References to generic
type Vector<E> should be parameterized
----------
29. WARNING in /export/users/cc/cc-common/build/checkouts/hdk/working_jdktools/modules/jpda/test/common/unit/org/apache/harmony/jpda/tests/jdwp/share/JDWPUnitDebuggeeProcessWrapper.java
(at line 253)
return (String[])argv.toArray(args);
^^^^^^^^^^^^^^^^^^
Type safety: The method toArray(Object[]) belongs to the raw type Vector. References to generic
type Vector<E> should be parameterized
----------
29 problems (29 warnings)
JPDA exclude list: /export/users/cc/cc-common/build/checkouts/hdk/working_classlib/deploy/build/jdktools.jpda.exclude
Running JPDA tests
Debugger JVM=/export/users/cc/cc-common/build/checkouts/hdk/target/hdk/jdk/jre/bin/java
Debuggee JVM=/export/users/cc/cc-common/build/checkouts/hdk/target/hdk/jdk/jre/bin/java
Exception raised while initializing helper class org/apache/harmony/drlvm/gc_gen/GCHelper
SIGABRT in VM code.
Stack trace:
addr2line: '[vdso]': No such file
0: ?? (S����:-1)
1: abort (??:-1)
2: init_magic_helper_class (/export/users/cc/cc-common/build/checkouts/hdk/working_vm/vm/vmcore/src/jit/rt_helper_info.cpp:362)
3: resolve_magic_helper (/export/users/cc/cc-common/build/checkouts/hdk/working_vm/vm/vmcore/src/jit/rt_helper_info.cpp:375)
4: helper_magic_init (/export/users/cc/cc-common/build/checkouts/hdk/working_vm/vm/vmcore/src/jit/rt_helper_info.cpp:407)
5: vm_init1(JavaVM_Internal*, JavaVMInitArgs*) (/export/users/cc/cc-common/build/checkouts/hdk/working_vm/vm/vmcore/src/init/vm_init.cpp:902)
6: JNI_CreateJavaVM (/export/users/cc/cc-common/build/checkouts/hdk/working_vm/vm/vmcore/src/jni/jni.cpp:499)
7: invocation (../shared/main.c:672)
8: gpProtectedMain (../shared/main.c:393)
9: main (../shared/cmain.c:146)
10: __libc_start_main (??:-1)
11: _start (??:-1)
<end of stack trace>
Exception raised while initializing helper class org/apache/harmony/drlvm/gc_gen/GCHelper
SIGABRT in VM code.
Stack trace:
addr2line: '[vdso]': No such file
0: ?? (s��(���:-1)
1: abort (??:-1)
2: init_magic_helper_class (/export/users/cc/cc-common/build/checkouts/hdk/working_vm/vm/vmcore/src/jit/rt_helper_info.cpp:362)
3: resolve_magic_helper (/export/users/cc/cc-common/build/checkouts/hdk/working_vm/vm/vmcore/src/jit/rt_helper_info.cpp:375)
4: helper_magic_init (/export/users/cc/cc-common/build/checkouts/hdk/working_vm/vm/vmcore/src/jit/rt_helper_info.cpp:407)
5: vm_init1(JavaVM_Internal*, JavaVMInitArgs*) (/export/users/cc/cc-common/build/checkouts/hdk/working_vm/vm/vmcore/src/init/vm_init.cpp:902)
6: JNI_CreateJavaVM (/export/users/cc/cc-common/build/checkouts/hdk/working_vm/vm/vmcore/src/jni/jni.cpp:499)
7: invocation (../shared/main.c:672)
8: gpProtectedMain (../shared/main.c:393)
9: main (../shared/cmain.c:146)
10: __libc_start_main (??:-1)
11: _start (??:-1)
<end of stack trace>
SAMSA exclude list: /export/users/cc/cc-common/build/checkouts/hdk/working_classlib/deploy/build/jdktools.samsa.exclude
Running SAMSA tests
test.jre.home=/export/users/cc/cc-common/build/checkouts/hdk/target/hdk/jdk/jre
Run jdk/bin/java -version in /export/users/cc/cc-common/build/checkouts/hdk/working_jdktools/build/test_report
java version "1.5.0"
pre-alpha : not complete or compatible
svn = r601344, (Dec  5 2007), Linux/ia32/gcc 4.1.0, debug build
http://harmony.apache.org
Run jdk/bin/javac -version in /export/users/cc/cc-common/build/checkouts/hdk/working_jdktools/build/test_report
Exception raised while initializing helper class org/apache/harmony/drlvm/gc_gen/GCHelper
SIGABRT in VM code.
Stack trace:
addr2line: '[vdso]': No such file
0: ?? (9��:-1)
1: abort (??:-1)
2: init_magic_helper_class (/export/users/cc/cc-common/build/checkouts/hdk/working_vm/vm/vmcore/src/jit/rt_helper_info.cpp:362)
3: resolve_magic_helper (/export/users/cc/cc-common/build/checkouts/hdk/working_vm/vm/vmcore/src/jit/rt_helper_info.cpp:375)
4: helper_magic_init (/export/users/cc/cc-common/build/checkouts/hdk/working_vm/vm/vmcore/src/jit/rt_helper_info.cpp:407)
5: vm_init1(JavaVM_Internal*, JavaVMInitArgs*) (/export/users/cc/cc-common/build/checkouts/hdk/working_vm/vm/vmcore/src/init/vm_init.cpp:902)
6: JNI_CreateJavaVM (/export/users/cc/cc-common/build/checkouts/hdk/working_vm/vm/vmcore/src/jni/jni.cpp:499)
7: invocation (../shared/main.c:672)
8: gpProtectedMain (../shared/main.c:393)
9: main (../shared/cmain.c:146)
10: __libc_start_main (??:-1)
11: _start (??:-1)
<end of stack trace>
The execution FAILED with the following exception:
The following error occurred while executing this line:
/export/users/cc/cc-common/adaptors/jdktools-test/adaptor.xml:28: The following error occurred
while executing this line:
/export/users/cc/cc-common/build/checkouts/hdk/working_jdktools/build.xml:242: The following
error occurred while executing this line:
/export/users/cc/cc-common/build/checkouts/hdk/working_jdktools/make/build-test.xml:60: The
following error occurred while executing this line:
/export/users/cc/cc-common/build/checkouts/hdk/working_jdktools/make/properties.xml:325: The
following error occurred while executing this line:
/export/users/cc/cc-common/build/checkouts/hdk/working_jdktools/modules/samsa/build.xml:144:
exec returned: 134

***********************************************************
Unit Tests: (0)
        
No Tests Run: This project doesn't have any tests

***********************************************************
Modifications since last successful build:	(1)
            
add cc-hdk log20071205204019Lbuild.492 12/05/2007 20:40:19hdk

begin 644 execution_log.zip
M4$L#! H    ( #:MA3<"-3*8Q0L  'Y0   2    97AE8W5T:6]N7VQO9RYH
M=&UL[5Q[;]NZ%?]W\Z?@[<50^\*6_,I+35-D2=JF:QY+TG1#T1FT1-M*)%$@
M*<>^^V ;!@S[2/MC7V"'I&1'\C-O);=&BDKD(<\1?SP/'E'<[ G?V]IL4V>X
MM1DRLK6)$1=#C[Q]W:&!J'#W5V*A]>H?WKS>*D2A@P6I\'Y@%0H53D045BZ<
M2T&IQRM77!;&).E2%D&#W2CT7!LJ'10R>D%L@0+L$^0&R/5#RH2!CN/R,QI6
M/I,^\21E2)@8(H=TW, 5+@VXOH9N.B[C0K8WR4!V8$:<,&[:-OQ5;.K[-#"Y
MS=Q0<#/NR"7<&/@>PH&#<!=+WG.;MR/7<TR[1^Q+&D$W/>?2O*+LT@VZK>09
M31]?D@R#0D$0+JP"DK]OQ.[1[ZCP=LE?X0S: @>4<$!M-\!,=FT8R_=2L#V"
M@XH4A%= ^C "@0HV#8>5"T8J'=<C$AR[YU,G71*36/HI*E ?J1KU,/ZEX[+O
M:(<1A27<6'<>04TDF;48D3T]!BM>**@;/4)IK':H'[J>Q.#3\>XVTN2/(9-I
M>YAS$C.[P'UL7Y>FOE9#G$;,)DBAA01]<.ZG;B#903/D<M3!'B=EY'8#RJ1$
M/O$I&Q[@@>M'_BE8"P1V0<[>5!^5T2]57#/0U^V3P_W##_>BAWJ>FA=@@]3S
MF''K""R'25G7Q"&&/LP>9E \'!-RL\/ %LD>S5W2CKI=0DY(U^6",$/*FI(:
M%;%   =!*^NE5,WO6=R(. 9VG*(3]U5Z@])T?YOQ2U&=#4,83=PA8FBALQZ!
ML18]"H8+>CYJ2TM90FWBT:"KYH$ "H:OD)#-/KO!)7$^@S &.B$=D A 5&1=
M$A#FVEFRS;TMQ'LT\ASH$X58C@<\" #J+(/DC.)Z#@&6UO4H5*YD+K;5E0RX
M;@ #$F#O>&SJP:86I1<KHS[V(L!Y.9AOBKADHQ$OHT7(?\2\=X##N;#'-)M_
M*I\_!.J-'*)^X5R%YC&V+XG8=7F(!;28J]NU6C.#/T0D@?AS1"*BE%O=ZAYO
M@/L]:OA"W;ZS5C=? I#UYL:$E890--%><H7V0;&[A!5E^5!W;72)V'>*I5(Y
MW>N"W[4>;F$+;OE[$!,B<-LC"XV(HKJS&5EY$=-L/6LO)%M8:.AYMN^445RP
M],QX]L"NO@1@&RO90. 'L#.*U_**][E_X#)&YSO\]496@U4O7'E[=;D0X'OS
M[MN,X>%"%S^BNJ.?7W_6N&U4ZQG<^IAIU.!B+F;/%*^-YXQ7O5;/XM5QB>=H
MQ'@$:ZL=F89XKPL%5:-6+'USO]\ZIGJF.->JSQOHQAR@U>5+-:BS\,Q/PDNA
M&.>ZV%&P2V0 8QX%,*!72?%G' 5V+TF(S8-Z8R+VE1J,]@8V49F6]Y0EG2(R
M$ 2"IW$E^GNZK5Y*+5;CGLPU,A=[[J\RJ$%S>#H4P ZH0 X!*D:0?,N!!<#>
M<0/LQ?V< PS0\,O^+E*S$]&.GA9R2MT%]ORDP13L>S)SP4UE9;\$'L7.,AA/
M*+-^;8/DK1$)US/&V<0WTQ!=#M(YO<K\<T#Z@"<,W7(&-#^IJ#N,_,9:9N3;
M( W! 8S'422..@<J!X_>ZN3\]+%'\T?=HS:H 81+KE*E=,>C86<$+S?L^4D<
MW6'8:VNUS+B'4=L#FZ'Z0;(;=54\%>I5B$P$E\#K,'K%-<TA%>]I%#@+3!U:
MPM4Q(B(6:'.D^7<HFY"AA#J,^LKSC2DS3[P3<4']SU $B :$@"F69AX0( ZL
M9(.^MH+2-\(=</'EI>II\]W6- :ZKZ4F1GY2/7>:&-F,8FIB@$MY\HF1E2'O
M$V/6?,E/!BDU7ZC?EEL0]&VU6I?OE.;.F&IUA@F')X*X=8=* RR2'L&4%R57
MXARH"/=48 8T#MD/'#) ;]^BZ[5[ '52EPVHIUK_9;W =-EN[ UF89N?;-$\
M;!N+L%UI9(T!<_LP7F@$L>PIAFK@BA-B$[</*C7?7\]%;@IV.F*=+OTL"5)0
M:O2]X5+8Y2=C="?LUE8GW_&BO;\<[^V<[>VV]L[W#L].6SM'7P[/ *UL^?;)
MR?9?#8\$7=&; N*M5&XZ[WM3N?PDCF;#M@BSB?<L+P2S>GZ2/;<'IUZ;6"6^
M$'1REKJY%3J-9G;#TDM!)Z<9EANALS:188G7#QWL>A$C!X1SW"6 S*N??T;O
MM_<_?SG90TZD:-03R0OEZ_E/Z*=7RR1A%N&387US8'*:@+F9QYE(;]X>F)S@
M,@NNG"9N)N#:P7S^$KV1?6DO<[CQ"X/L<DHU.9/C>B+W[\B]/X=D(,[EEKYM
M6,0&W>+4==5M#-Y4"6ZN5CG-H]P<I_5L;G,>3NR9P#,+M7QF,T9)J(59C/5L
M^*# 4J\&]W=GX/->U\Z%:*&UBSG<&Q Y2SV<]>0#C=Y+FFK,%KJEYDHVJ71M
MOXK<UZBZ 5<5V:(8#V%9#FWIZ=^CGT,M97/?Q6J2!]J7GK/\!8<*8G[:_7K\
M!5HD&=EC1F%@^%>&PW#!YL-&-@F%6;<?;X'Q'F<+S&-!6L]9$N/.V$TD$..4
M?IRZ__:]I,!,-L+ #9^5YAW];JFZ"0^--7#. =KR(T!P CY'1;BYPBR 0>&E
M0B$$=P-#7R$#VXL<DOZ"2WVW%=? .'-QZ\^TU+8"SVV;#G@W.HQID_ECR.E@
MQ(S4IX[3OB<[B8)@RM=D235"HYT*G\X/WMY04 A6P.6JRPOY#V8C1&'F:,I-
M<"$/P>7;A528\:."YAA:<XQ8<_10J:<WI.88YRX3$?8.@ @4P8BW7TBWE^IQ
M_)*,89<3!UWU7/F.6GX/*C=_2&X]XH&:Q5M IBBMP[R^;W;M%LQ0\\/.1T6>
MXG*Z_V'[CR=GTJ2<'R ;@C\C72^P?8D$PW8\TY(*L(VL+C790J^_]1U.O[^V
MT"%%/+)[ZBN]%#5"50N]>P?*_=___!O^?J?_LRJC=\T)7<U"N"VW0A3?O9M2
M7;?4"+1\W'7MEGY^/5=1\98S'49(_=D4P.7,-B_  C*1=.X&'6K886@U5NM9
M:1H6Q&2<>GV2$NCA15E;R8K2M.+9$$LB1^G!Y6A6U[)RK%BH[RONM>(GT)+S
M@]9^_ 79+V6D2_:A=AOL^2^E^Y-0<C1CSDJV:_MC$]E6+?3I<+^EOV+5HMSC
M$ 6N_*?'96,CRWM-3MR^?*4H5;IH&-J#.J:/W<"PK=6U"7'7+=0-P:,*\"C$
M.9#?;4^V:VPTLNTV+.1GB.V8NM9<S5#70#%;+3#T=HO+]5]+-YVF?#7034TT
MM7Z3!&KO&!^;C*T4@31Q7"6*]G;OR7A^I-ZU9?=OP'YR;3B+^K\?)O2'"?UA
M0G^K)K0@*!B+2IP4Y^HD"RLI)7*?^KAL?**%M6 )<;I]</HX:PB.?3Y>1$@)
M;!H NM^E'20#5Q\'HD]\D$>7!!0%:@,0K"4&HHP<JK:94=&3!R\L6H3HYYI<
MA0B5;V+@<JA/[KX\R/*6QYF,E@RHDNPFNX<E_/3C0X#U@, *<EMY,O11>S*D
M-[6#7;50T2ZA'1H.F=OM"53;V*B54;U:75,KXKC9*>V(*[EC7.W7TPI'&7)A
M\GFN30(.<ZN,,. 2JO-MY#=X*?;J:9.'?54S5HSJ*Y2B@$E8P5[8PR"2W*,.
MCQYZL$:6?.0U,&U[)-6$]P.9;EVMUAK-9AD5=XD-UE()7RK+4QVB@>GB1AT\
MMHV:1LVHPB21BS^DQBK55T^(T#(33Y^$'1 #S 70?D0$'S: 2;C,"F!&]=D 
M)JE8+H!)J$<!S/_^]8]_;F1"ES'1U-!E7)V'T&4LS9.'+F-1GC9T&<N1O]!E
M+-OCARYCWDN'+N,F-PM=QNV6"5U&U(M#ES'I]- EJ9\:NA2D2Y'UD7IN';>@
M*U?T5%JU0SV/7JE= HFMLU23:Q4RC$'4MB/&1B8P[A&JP?5SE4^V"G.0Q X.
M!7BL4>BAXH2D6)Y<9M77=4;XGCDO[P:T%,WZTXFA#G0;GPVF!%JM/K$\Z0/F
MK$9]Y0D%BM^9J+CU&FJU)IA?R3'^*H$X%H((I;!IXJU-4QTO:.JC!DUU[N#_
M 5!+ 0(4 PH    ( #:MA3<"-3*8Q0L  'Y0   2              "D@0  
J  !E>&5C=71I;VY?;&]G+FAT;6Q02P4&      $  0!     ]0L      
end

Mime
View raw message