harmony-alerts mailing list archives

Site index · List index
Message view « Date » · « Thread »
Top « Date » · « Thread »
From nom...@intel.com
Subject [build-test alert] FAILED Linux x86: drlvm-reg-test debug
Date Wed, 05 Dec 2007 15:41:20 GMT

BUILD FAILED:
	Ant Error Message:
/export/users/cc/cc-common/scripts/cc-exec-adaptor.xml:104: The following error occurred while
executing this line: /export/users/cc/cc-common/adaptors/drlvm-reg-test/adaptor.xml:74: There
were drlvm-reg-test failures

Date of build:	2007-12-05 21:33:21 +0600
Time to build:	7 minutes 50 seconds
Last changed:	12/05/2007 20:40:19
Last log entry:	hdk

***********************************************************
Errors/Warnings:	(134)
            
[junit] Test org.apache.harmony.drlvm.tests.regression.h0000.DirectByteBufferTest FAILED
[junit] Test org.apache.harmony.drlvm.tests.regression.h1578.NaNTest FAILED
[junit] Test org.apache.harmony.drlvm.tests.regression.h1654.H1654Test FAILED
[junit] Test org.apache.harmony.drlvm.tests.regression.h1748.IntfAccessTest FAILED
[junit] Test org.apache.harmony.drlvm.tests.regression.h1788.abcdTest FAILED
[junit] Test org.apache.harmony.drlvm.tests.regression.h1800.ExecTest FAILED
[junit] Test org.apache.harmony.drlvm.tests.regression.h1802.UnresolvedParamTest FAILED
[junit] Test org.apache.harmony.drlvm.tests.regression.h1802.UnresolvedHandlerTest FAILED
[junit] Test org.apache.harmony.drlvm.tests.regression.h1840.SimplestTest FAILED
[junit] Test org.apache.harmony.drlvm.tests.regression.h1840.SimplestTest FAILED
[junit] Test org.apache.harmony.drlvm.tests.regression.h1852.DivIntTest FAILED
[junit] Test org.apache.harmony.drlvm.tests.regression.h1857.Test FAILED
[junit] Test org.apache.harmony.drlvm.tests.regression.h1859.Test FAILED
[junit] Test org.apache.harmony.drlvm.tests.regression.h1859.Test FAILED
[junit] Test org.apache.harmony.drlvm.tests.regression.h1861.Test FAILED
[junit] Test org.apache.harmony.drlvm.tests.regression.h1863.H1863Test FAILED
[junit] Test org.apache.harmony.drlvm.tests.regression.h2057.SyncTest FAILED
[junit] Test org.apache.harmony.drlvm.tests.regression.h2083.Test FAILED
[junit] Test org.apache.harmony.drlvm.tests.regression.h2083.Test FAILED
[junit] Test org.apache.harmony.drlvm.tests.regression.h2083.Test FAILED
[junit] Test org.apache.harmony.drlvm.tests.regression.h2084.Test FAILED
[junit] Test org.apache.harmony.drlvm.tests.regression.h2086.Test FAILED
[junit] Test org.apache.harmony.drlvm.tests.regression.h2092.Test FAILED
[junit] Test org.apache.harmony.drlvm.tests.regression.h2092.Test FAILED
[junit] Test org.apache.harmony.drlvm.tests.regression.h2103.Test FAILED
[junit] Test org.apache.harmony.drlvm.tests.regression.h2113.Test FAILED
[junit] Test org.apache.harmony.drlvm.tests.regression.h2151.VMInit1Test FAILED
[java] Java Result: 134
[junit] Test org.apache.harmony.drlvm.tests.regression.h2259.H2259 FAILED
[junit] Test org.apache.harmony.drlvm.tests.regression.h2261.RCETest FAILED
[junit] Test org.apache.harmony.drlvm.tests.regression.h2335.SimplestLibraryPathTest FAILED
[junit] Test org.apache.harmony.drlvm.tests.regression.h2644.BootDelegationTest FAILED
[junit] Test org.apache.harmony.drlvm.tests.regression.h2679.DupTest FAILED
[junit] Test org.apache.harmony.drlvm.tests.regression.h2748.Test FAILED
[junit] Test org.apache.harmony.drlvm.tests.regression.h2773.InfinityTest FAILED
[junit] Test org.apache.harmony.drlvm.tests.regression.h2808.finTest FAILED
[junit] Test org.apache.harmony.drlvm.tests.regression.h2846.NoVerifyTest FAILED
[junit] Test org.apache.harmony.drlvm.tests.regression.h2873.RemTest FAILED
[junit] Test org.apache.harmony.drlvm.tests.regression.h2874.Test FAILED
[junit] Test org.apache.harmony.drlvm.tests.regression.h2899.ManyArgsTest FAILED
[junit] Test org.apache.harmony.drlvm.tests.regression.h2926.Test FAILED
[junit] Test org.apache.harmony.drlvm.tests.regression.h2926.Test FAILED
[junit] Test org.apache.harmony.drlvm.tests.regression.h3027.AgentLibTest FAILED
[junit] Test org.apache.harmony.drlvm.tests.regression.h3048.H3048 FAILED
[junit] Test org.apache.harmony.drlvm.tests.regression.h3067.Test FAILED
[junit] Test org.apache.harmony.drlvm.tests.regression.h3074.Test FAILED
[junit] Test org.apache.harmony.drlvm.tests.regression.h3098.JsrNoRetTest FAILED
[junit] Test org.apache.harmony.drlvm.tests.regression.h3098.JsrNoRetTest FAILED
[junit] Test org.apache.harmony.drlvm.tests.regression.h3110.FieldTest FAILED
[junit] Test org.apache.harmony.drlvm.tests.regression.h3121.H3121 FAILED
[junit] Test org.apache.harmony.drlvm.tests.regression.h3130.CallNativeTest FAILED
[junit] Test org.apache.harmony.drlvm.tests.regression.h3150.Test FAILED
[junit] Test org.apache.harmony.drlvm.tests.regression.h3175.Test FAILED
[junit] Test org.apache.harmony.drlvm.tests.regression.h3216.ASETest FAILED
[junit] Test org.apache.harmony.drlvm.tests.regression.h3225.PositiveJsrTest FAILED
[junit] Test org.apache.harmony.drlvm.tests.regression.h3225.NegativeJsrTest FAILED
[junit] Test org.apache.harmony.drlvm.tests.regression.h3225.J9CompatibleJsrTest FAILED
[junit] Test org.apache.harmony.drlvm.tests.regression.h3228.H3228 FAILED
[java] Java Result: 134
[junit] Test org.apache.harmony.drlvm.tests.regression.h3283.JavaLibraryPathTest FAILED
[junit] Test org.apache.harmony.drlvm.tests.regression.h3285.Test FAILED
[junit] Test org.apache.harmony.drlvm.tests.regression.h3317.GetFieldDeclaringClassTest FAILED
[junit] Test org.apache.harmony.drlvm.tests.regression.h3341.StopThreadInWait FAILED
[junit] Test org.apache.harmony.drlvm.tests.regression.h3380.LongToBitsTest FAILED
[junit] Test org.apache.harmony.drlvm.tests.regression.h3382.Test FAILED
[java] Java Result: 134
[junit] Test org.apache.harmony.drlvm.tests.regression.h3404.H3404 FAILED
[junit] Test org.apache.harmony.drlvm.tests.regression.h3446.SubSubTest FAILED
[junit] Test org.apache.harmony.drlvm.tests.regression.h3505.GetFieldModifiersTest FAILED
[junit] Test org.apache.harmony.drlvm.tests.regression.h3582.Test FAILED
[junit] Test org.apache.harmony.drlvm.tests.regression.h3619.ObjectLongWaitTest FAILED
[junit] Test org.apache.harmony.drlvm.tests.regression.h3652.Test FAILED
[junit] Test org.apache.harmony.drlvm.tests.regression.h3658.Test FAILED
[junit] Test org.apache.harmony.drlvm.tests.regression.h3658.Test FAILED
[junit] Test org.apache.harmony.drlvm.tests.regression.h3691.Test FAILED
[junit] Test org.apache.harmony.drlvm.tests.regression.h3698.ExceptionLocation FAILED
[junit] Test org.apache.harmony.drlvm.tests.regression.h3716.Test FAILED
[junit] Test org.apache.harmony.drlvm.tests.regression.h3730.StepM2N FAILED
[junit] Test org.apache.harmony.drlvm.tests.regression.h3738.Test FAILED
[junit] Test org.apache.harmony.drlvm.tests.regression.h3751.Test FAILED
[junit] Test org.apache.harmony.drlvm.tests.regression.h3784.Test FAILED
[junit] Test org.apache.harmony.drlvm.tests.regression.h3816.Test FAILED
[junit] Test org.apache.harmony.drlvm.tests.regression.h3822.Test FAILED
[junit] Test org.apache.harmony.drlvm.tests.regression.h3862.SubrBounds FAILED
[junit] Test org.apache.harmony.drlvm.tests.regression.h3894.ThreadGroupChildren FAILED
[junit] Test org.apache.harmony.drlvm.tests.regression.h3908.InvokeTest FAILED
[junit] Test org.apache.harmony.drlvm.tests.regression.h3909.FinalizerThreadGroup FAILED
[junit] Test org.apache.harmony.drlvm.tests.regression.h3954.Test FAILED
[junit] Test org.apache.harmony.drlvm.tests.regression.h3982.EmptyStackTrace FAILED
[junit] Test org.apache.harmony.drlvm.tests.regression.h4073.Test FAILED
[junit] Test org.apache.harmony.drlvm.tests.regression.h4073.Test FAILED
[junit] Test org.apache.harmony.drlvm.tests.regression.h4265.Test FAILED
[junit] Test org.apache.harmony.drlvm.tests.regression.h4265.Test FAILED
[junit] Test org.apache.harmony.drlvm.tests.regression.h4267.UnresolvedArrayElem FAILED
[junit] Test org.apache.harmony.drlvm.tests.regression.h4292.Test FAILED
[junit] Test org.apache.harmony.drlvm.tests.regression.h4292.Test FAILED
[junit] Test org.apache.harmony.drlvm.tests.regression.h4511.GCTagged FAILED
[junit] Test org.apache.harmony.drlvm.tests.regression.h4512.GetCurrentThreadCpuTime FAILED
[junit] Test org.apache.harmony.drlvm.tests.regression.h4514.Test FAILED
[junit] Test org.apache.harmony.drlvm.tests.regression.h4514.Test FAILED
[junit] Test org.apache.harmony.drlvm.tests.regression.h4579.test FAILED
[junit] Test org.apache.harmony.drlvm.tests.regression.h4595.Test FAILED
[junit] Test org.apache.harmony.drlvm.tests.regression.h4596.Test FAILED
[junit] Test org.apache.harmony.drlvm.tests.regression.h4654.Test FAILED
[junit] Test org.apache.harmony.drlvm.tests.regression.h4675.DivLongTest FAILED
[junit] Test org.apache.harmony.drlvm.tests.regression.h4706.Test FAILED
[junit] Test org.apache.harmony.drlvm.tests.regression.h4751.Test FAILED
[junit] Test org.apache.harmony.drlvm.tests.regression.h4866.Test FAILED
[junit] Test org.apache.harmony.drlvm.tests.regression.h4874.Test FAILED
[junit] Test org.apache.harmony.drlvm.tests.regression.h4874.Test FAILED
[junit] Test org.apache.harmony.drlvm.tests.regression.h4979.AttachCurrentThread FAILED
[junit] Test org.apache.harmony.drlvm.tests.regression.h5021.Test FAILED
[junit] Test org.apache.harmony.drlvm.tests.regression.h5067.Test FAILED
[junit] Test org.apache.harmony.drlvm.tests.regression.h5094.InlinedStackTest FAILED
[junit] Test org.apache.harmony.drlvm.tests.regression.h5094.InlinedStackTest FAILED
[junit] Test org.apache.harmony.drlvm.tests.regression.h5094.InlinedStackTest FAILED
[junit] Test org.apache.harmony.drlvm.tests.regression.h5094.InlinedStackTest FAILED
[java] Java Result: 134
[java] Java Result: 134
[java] Java Result: 134
[java] Java Result: 134
[java] Java Result: 134
[java] Java Result: 134
[java] Java Result: 134
[junit] Test org.apache.harmony.drlvm.tests.regression.h5206.VolatileLongTest FAILED
[junit] Test org.apache.harmony.drlvm.tests.regression.h5206.VolatileLongTest FAILED
[junit] Test org.apache.harmony.drlvm.tests.regression.h5257.ProtectedInnerAccessTest FAILED
[junit] Test org.apache.harmony.drlvm.tests.regression.h788.Test FAILED
BUILD FAILED
/export/users/cc/cc-common/build/checkouts/hdk/working_vm/build/make/build.xml:578: The following
error occurred while executing this line:
/export/users/cc/cc-common/build/checkouts/hdk/working_vm/build/make/targets/reg.test.run.xml:108:
There were test failures
Total time: 7 minutes 47 seconds
The execution FAILED with the following exception:
The following error occurred while executing this line:
/export/users/cc/cc-common/adaptors/drlvm-reg-test/adaptor.xml:74: There were drlvm-reg-test
failures

***********************************************************
Unit Tests: (6)
        
failure: test org.apache.harmony.drlvm.tests.regression.h3256.InterruptTimedWaitingTest
failure: test org.apache.harmony.drlvm.tests.regression.h3382.TestX
failure: test org.apache.harmony.drlvm.tests.regression.h5201-0
failure: test org.apache.harmony.drlvm.tests.regression.h5201-3
failure: test org.apache.harmony.drlvm.tests.regression.h5201-4
failure: test org.apache.harmony.drlvm.tests.regression.h5201-5
Unit Test Error Details:	(6)
                
Test: testClass: org.apache.harmony.drlvm.tests.regression.h3256.InterruptTimedWaitingTestExit
code: 134 Err: Exception raised while initializing helper class org/apache/harmony/drlvm/gc_gen/GCHelper
SIGABRT in VM code.
Stack trace:
addr2line: '[vdso]': No such file
  0: ?? (\u3cf7\ufffd\u0418\ufffd:-1)
  1: abort (??:-1)
  2: init_magic_helper_class (/export/users/cc/cc-common/build/checkouts/hdk/working_vm/vm/vmcore/src/jit/rt_helper_info.cpp:362)
  3: resolve_magic_helper (/export/users/cc/cc-common/build/checkouts/hdk/working_vm/vm/vmcore/src/jit/rt_helper_info.cpp:375)
  4: helper_magic_init (/export/users/cc/cc-common/build/checkouts/hdk/working_vm/vm/vmcore/src/jit/rt_helper_info.cpp:407)
  5: vm_init1(JavaVM_Internal*, JavaVMInitArgs*) (/export/users/cc/cc-common/build/checkouts/hdk/working_vm/vm/vmcore/src/init/vm_init.cpp:902)
  6: JNI_CreateJavaVM (/export/users/cc/cc-common/build/checkouts/hdk/working_vm/vm/vmcore/src/jni/jni.cpp:499)
  7: invocation (../shared/main.c:672)
  8: gpProtectedMain (../shared/main.c:393)
  9: main (../shared/cmain.c:146)
 10: __libc_start_main (??:-1)
 11: _start (??:-1)
<end of stack trace>
Test: testClass: org.apache.harmony.drlvm.tests.regression.h3382.TestXExit code: 134 Err:
Exception raised while initializing helper class org/apache/harmony/drlvm/gc_gen/GCHelper
SIGABRT in VM code.
Stack trace:
addr2line: '[vdso]': No such file
  0: ?? (\ufffd\ufffd\ufffdx\ufffd\ufffd\ufffd:-1)
  1: abort (??:-1)
  2: init_magic_helper_class (/export/users/cc/cc-common/build/checkouts/hdk/working_vm/vm/vmcore/src/jit/rt_helper_info.cpp:362)
  3: resolve_magic_helper (/export/users/cc/cc-common/build/checkouts/hdk/working_vm/vm/vmcore/src/jit/rt_helper_info.cpp:375)
  4: helper_magic_init (/export/users/cc/cc-common/build/checkouts/hdk/working_vm/vm/vmcore/src/jit/rt_helper_info.cpp:407)
  5: vm_init1(JavaVM_Internal*, JavaVMInitArgs*) (/export/users/cc/cc-common/build/checkouts/hdk/working_vm/vm/vmcore/src/init/vm_init.cpp:902)
  6: JNI_CreateJavaVM (/export/users/cc/cc-common/build/checkouts/hdk/working_vm/vm/vmcore/src/jni/jni.cpp:499)
  7: invocation (../shared/main.c:672)
  8: gpProtectedMain (../shared/main.c:393)
  9: main (../shared/cmain.c:146)
 10: __libc_start_main (??:-1)
 11: _start (??:-1)
<end of stack trace>
Test: testClass: org.apache.harmony.drlvm.tests.regression.h5201-0Exit code: 134 Err: Exception
raised while initializing helper class org/apache/harmony/drlvm/gc_gen/GCHelper
SIGABRT in VM code.
Stack trace:
addr2line: '[vdso]': No such file
  0: ?? (\u04f1\ufffdX\ufffd:-1)
  1: abort (??:-1)
  2: init_magic_helper_class (/export/users/cc/cc-common/build/checkouts/hdk/working_vm/vm/vmcore/src/jit/rt_helper_info.cpp:362)
  3: resolve_magic_helper (/export/users/cc/cc-common/build/checkouts/hdk/working_vm/vm/vmcore/src/jit/rt_helper_info.cpp:375)
  4: helper_magic_init (/export/users/cc/cc-common/build/checkouts/hdk/working_vm/vm/vmcore/src/jit/rt_helper_info.cpp:407)
  5: vm_init1(JavaVM_Internal*, JavaVMInitArgs*) (/export/users/cc/cc-common/build/checkouts/hdk/working_vm/vm/vmcore/src/init/vm_init.cpp:902)
  6: JNI_CreateJavaVM (/export/users/cc/cc-common/build/checkouts/hdk/working_vm/vm/vmcore/src/jni/jni.cpp:499)
  7: invocation (../shared/main.c:672)
  8: gpProtectedMain (../shared/main.c:393)
  9: main (../shared/cmain.c:146)
 10: __libc_start_main (??:-1)
 11: _start (??:-1)
<end of stack trace>
Test: testClass: org.apache.harmony.drlvm.tests.regression.h5201-3Exit code: 134 Err: Exception
raised while initializing helper class org/apache/harmony/drlvm/gc_gen/GCHelper
SIGABRT in VM code.
Stack trace:
addr2line: '[vdso]': No such file
  0: ?? (#\ufffd\ufffd\ufffd:-1)
  1: abort (??:-1)
  2: init_magic_helper_class (/export/users/cc/cc-common/build/checkouts/hdk/working_vm/vm/vmcore/src/jit/rt_helper_info.cpp:362)
  3: resolve_magic_helper (/export/users/cc/cc-common/build/checkouts/hdk/working_vm/vm/vmcore/src/jit/rt_helper_info.cpp:375)
  4: helper_magic_init (/export/users/cc/cc-common/build/checkouts/hdk/working_vm/vm/vmcore/src/jit/rt_helper_info.cpp:407)
  5: vm_init1(JavaVM_Internal*, JavaVMInitArgs*) (/export/users/cc/cc-common/build/checkouts/hdk/working_vm/vm/vmcore/src/init/vm_init.cpp:902)
  6: JNI_CreateJavaVM (/export/users/cc/cc-common/build/checkouts/hdk/working_vm/vm/vmcore/src/jni/jni.cpp:499)
  7: invocation (../shared/main.c:672)
  8: gpProtectedMain (../shared/main.c:393)
  9: main (../shared/cmain.c:146)
 10: __libc_start_main (??:-1)
 11: _start (??:-1)
<end of stack trace>
Test: testClass: org.apache.harmony.drlvm.tests.regression.h5201-4Exit code: 134 Err: Exception
raised while initializing helper class org/apache/harmony/drlvm/gc_gen/GCHelper
SIGABRT in VM code.
Stack trace:
addr2line: '[vdso]': No such file
  0: ?? (\udbab\uddd8\ufffd\u03ff:-1)
  1: abort (??:-1)
  2: init_magic_helper_class (/export/users/cc/cc-common/build/checkouts/hdk/working_vm/vm/vmcore/src/jit/rt_helper_info.cpp:362)
  3: resolve_magic_helper (/export/users/cc/cc-common/build/checkouts/hdk/working_vm/vm/vmcore/src/jit/rt_helper_info.cpp:375)
  4: helper_magic_init (/export/users/cc/cc-common/build/checkouts/hdk/working_vm/vm/vmcore/src/jit/rt_helper_info.cpp:407)
  5: vm_init1(JavaVM_Internal*, JavaVMInitArgs*) (/export/users/cc/cc-common/build/checkouts/hdk/working_vm/vm/vmcore/src/init/vm_init.cpp:902)
  6: JNI_CreateJavaVM (/export/users/cc/cc-common/build/checkouts/hdk/working_vm/vm/vmcore/src/jni/jni.cpp:499)
  7: invocation (../shared/main.c:672)
  8: gpProtectedMain (../shared/main.c:393)
  9: main (../shared/cmain.c:146)
 10: __libc_start_main (??:-1)
 11: _start (??:-1)
<end of stack trace>
Test: testClass: org.apache.harmony.drlvm.tests.regression.h5201-5Exit code: 134 Err: Exception
raised while initializing helper class org/apache/harmony/drlvm/gc_gen/GCHelper
SIGABRT in VM code.
Stack trace:
addr2line: '[vdso]': No such file
  0: ?? (\ufffd\ufffd\ufffd\ufffdg\ufffd\ufffd:-1)
  1: abort (??:-1)
  2: init_magic_helper_class (/export/users/cc/cc-common/build/checkouts/hdk/working_vm/vm/vmcore/src/jit/rt_helper_info.cpp:362)
  3: resolve_magic_helper (/export/users/cc/cc-common/build/checkouts/hdk/working_vm/vm/vmcore/src/jit/rt_helper_info.cpp:375)
  4: helper_magic_init (/export/users/cc/cc-common/build/checkouts/hdk/working_vm/vm/vmcore/src/jit/rt_helper_info.cpp:407)
  5: vm_init1(JavaVM_Internal*, JavaVMInitArgs*) (/export/users/cc/cc-common/build/checkouts/hdk/working_vm/vm/vmcore/src/init/vm_init.cpp:902)
  6: JNI_CreateJavaVM (/export/users/cc/cc-common/build/checkouts/hdk/working_vm/vm/vmcore/src/jni/jni.cpp:499)
  7: invocation (../shared/main.c:672)
  8: gpProtectedMain (../shared/main.c:393)
  9: main (../shared/cmain.c:146)
 10: __libc_start_main (??:-1)
 11: _start (??:-1)
<end of stack trace>

***********************************************************
Modifications since last successful build:	(2)
            
add cc-hdk log20071205204019Lbuild.492 12/05/2007 20:40:19hdk
add cc-hdk log20071205204019Lbuild.492 12/05/2007 20:40:19hdk

begin 644 execution_log.zip
M4$L#! H    ( ":MA3??E1DFH!<  !(\ P 2    97AE8W5T:6]N7VQO9RYH
M=&UL[=W-;^-F?@?P0R[I')H N0QZ>H"B&,>H*9(2)4H[+^OQ3,8>V,Y@[*0I
M!E.5(A]+G*%(+4EYY*! KWOHH?]!+P5:H,D>%L7.;H$V0-.73=%T"[3=#787
M;8$L>BK00_Z!/@])R98EDI)'$OUXOH9L2Q9)/7R>A[^/GQ<]NMD)N\[MFRW/
M.KE]L^?3VS<-$H0G#KUUX\ASPXW _I@VB"[_UK=NW+[6[UE&2#>"8[=Q[=I&
M_(C=\_OL,2'DB44=&M*GY![_;;MMHB@J.;(=&I CW^N2$AWT/#\L]0/J!R73
M9+<-T^MV/;?4ZMN.5?)IT'?"H&3YSG%WPZ?MC9 &(3\V._HSX]AX2N[R#?DQ
M&Z1K/*?QCM*@ZXQM-?: I7?#8@DSPT;V1CW?ZV5L0@<A]=VF1<]M%-^G9L=C
M]S\(^(EO[6X>'.SNW"6W\D_:[%#SN==GI]VQGI=>>/YS=H2FZ1A!X-BM].3$
MIR1Y@63X9D<R!P/)/&IGI-]V[5#JN_8@;YL7MINW"3L#5EN"@%I2U[-H5L;2
M4 IHUPXDR_:#G WC+#:<K.UZ3K]MNY+AAB:KH;[=RM_6[/5"(WB>=51^5NG%
MNN6Y1W:[[QNA[;D9I<^_MKT@JOP/V=.L_!5)D^2F7"5K!WV7[-FF[P4G04B[
M =EQ3>G=S(,-:P'Q/2]<<&6:2/CIEQ>PU]JUW?Y@MCUX!61[V$99G?$E6&UE
M.[1-<];MC]IL>XNV^NWL/=AU3'QZ; >LH-@>55DI5RIY+\)KL^=2-PRB%^DY
MWDENNCHGDNM)@<W3=<1J+,W<@VWM>*;A2!_STIRVQ]@#%OHD'OHR*BQ/,PN#
MHR@9L/!%>X9/)ZOGD^YS=NVQ6NQ3%K$MPAXT+EJ5CKO)TXX[:/(";[)";$8%
M4XJ241JFG1V45SL:7)KTN.SR/<[(]<DL?991 'F[LK^?*XHGK!;PNR8/*'S[
MR$A9(X'7]TV:4!EZ195-SAG%V7=YJE><GM*VS+Y*3:_U;/(*9(],EML*R]30
M<$XSN$6'YV=)J7L=A(8?17)63L^SKU7:;7$)#=<^FKAJ+T,6J8JF((NRLTBO
MUY%%V5E45ZO(HLPL*LMJ#5F4DT6U"K(H.XN4,D3+R:*R@@LM+XLJ0#\GBRHR
M8E%.%FFRABS*SJ)J74<696=1#:+E9I&.6)2317H=69231749S=B\+-)59%%F
M%E4T!?\ZYF81:E%.%M5KB$796:3)ZF6^T,8>.$;?-3OQ8,#ER4F?\E>8'&0:
MCK[E#N3=FN4K]RB'+#'LK!]^N+>4LXX')4O/V.;/?%IJV6Z)IV5%)W>QS(VG
M0M"!Z?2M>'#KXB/8+&\"WXP*GY<]GWI@LUV2@P?#.Y+#!ZVE@5XE.:/T>6=V
MDW9[X<GMF0XR]6#CUUG?W9@<SXWO]ET[?$H>]UV79Y?GMR6C9[!<D#J&S[+E
M1(IFP\2U73H]=ZG#Q[VD>[9/S?#N24CO]H^.J']X?L+,V1>Y/S!ICT]A(+YA
M!ZRZONCP4N%S'VS#L3_F">A0IT?]>.8!3TTI3DTI24T\-Z?4-IMMZI8>;&U'
MFZ>^XL'.@\V[CP_92Y /]UC<8D64OFUHF,])Z!OFM$'&9"/#LGR5E3)MD!M/
MCJW >WJC0?8]$O3-3E3'4O<D1&Z0.W?(VO]]]M?Q;;O.?C0VE,DY&*?[* UB
MM%B%)6MW[N1LJC:BG&QVC;9M-N-\C*=>D+6+5_OH9GKLHN<7P#.;U?]P>'#;
M/?+XY)9&N:IFI:S<8)$^\)QC.I:XY2>KIF4EJ])(:EN2*IY[2T]31:YEI4EK
MD.-NE!)E[2%[_L.]YHX;3TI:_VT2_V6'/;OIMX/U=Q>76OZ*I>25HW36Y<PB
MK3;(P_V=9JQMG*P%9IUK\^\XO^KUK'34>*4_]LQH9A19DZ12P"(%M4I=@T^\
M:E1KF:>A-TB[]\CW^%0V:NVQ?:8<HUPO9QVCSJ<"CN]H)GLJE6K&G@H+",VF
M8[?,9L#_7VK&A\F[T!46$^(=<K>]25V+>$<D. UMDZ0,-^:A>R'QG[RWN;-[
M_]Z*.5*TFB[M&_L0*+VJ)@)MQ?ZLM> /_!E/$_R!/X+X<S;@3R/G53VI:A5I
MF_^$*+FBF$F+YE;\&Z@ %: "5 1$92SJ%]22J55TB5T@1YNFR?X&?M*KZ7B#
M1C\$/^ '_( ?8?F9#/U%&:3KDM$R+>B37DL3?7XS5N?'GT(?Z -]H(^X^IP)
M^LOH4M-E6;H_H"90R45E-$O@N@56P I8 2O"LG(V[%^\.3.QOM,J%Q$II2(S
MVF$X*9"?KUK:LZ/5B:+=%VRH*GW@)F'2>F3X1A><IE]T":<'(T]'-X *4 $J
M0!42U*D&I#391(3SL.-[+XR60Y<NZ+;A6@XFKL]@Z#NQFYTG\!-^PD_X>47\
M/"- 08-M>D66#NQNSV%/ :+T"GN^;Y3=_O?//@-$@ @0 2(1(3H7^)<RZ 9<
M+H2+SK[_%;@ %^ "7*XJ+JMHW&BJ=,\^9I<)]$FOI1/3/FY\"7M@#^R!/4+:
M,Q;T7XM)'UIM%6-76DT"H^D7W/B4?$SW *; %)@*CVD<] MKP-5A3KXY;R1K
M8, :6#.>)E@#:\2QIIYJ#2!9Y3P[=KN/I@LX 2?@Y$IRLHJF2U6!./GB).LG
M=3K !MB,IPG8 !MAL$FB_5+:+M6RM,U_@I-<3I+1E^U-< ).P DX$963,R&_
MF :,*FLUZ>#$Q8I),ZNC[Z/3#/  'L C*CQC0?\UF#JGRGHY>[VDX:<>C@1U
MR</[AXN%5B^CIW#FL:G.UW^,V>D %L "6"&!38)]6D?A%&_>?P1OSFZ[VDEU
M[&:C30=RQM,$<D#.%2;'YG6YY[,V7'K,!CW3-UK,6W'[[/MMO(,(^D ?Z'-5
M]5G%*)9>@3@SB3.Z_0;,@3DP!^8(;$YE6;/QV+&K "4?%!-K($ 3: )-KH(F
MU4);,'45X,PS7'/G9Y@@ &V@#;014ILDW"^E[0)*YOC$ONN/?@%(  D@ 22 
M9/S8BHQQ_-G;)&OH!0,GX 2<B,S),.07U NF*!!GMG'\;6@#;: -M!%:&Z58
M;31%BB\&!>BD5\_SD\>V?_W'Z#$#.D 'Z B)SGC4?P5[)MY2,T\JZE5IU_-Z
MS):I]@SO\TI*'M.@[X0-HI0KJ8E87U]/3H7?72>-5TD.66,O1>B 11:.S[NK
MEEG5ZM(V_PF39S-9QTK><!DNPV5Q71[%_():@VI5D1YOW4=+,+UN3GD;$=@!
M.V '[(C+SFG8+PB><ED;?8SZKMWR#?_DD1%V %%Z;3TW\^++[\,@&#2>)A@$
M@T0Q*$. UV%YUFJE4CKHLXM[B^^\^ \UYR\@W?6\D.=$.ZK@P#7],DQP+2>X
M'GWQ62/SLH6LD!6RIJ<#LA8GZ_3(7U!#KUJK2_?Z/=B37E''/VKC3?0NPA_X
M W_$]><TY!>$3JVB8TI]OCCOG!W.^@?,;P0Y( ?DB$C.,. 7Y4VM+.VX1[S&
MGL"=]/J9N!.,T/D#-'8@#^2!/.+*<R[T+V--"EW6)?8*D"57EH.1+'6P E; 
M"E@1DY4S(7\IHE2JTK[W(?7M(S189FZP#-!: 2M@!:R(R\JYN%]0?YG.&DV/
M:1?RI%?1T[<=84( U($Z4$=@=4[#?6'@X+/R9M#FFQ^]_.Y;_XZ) * &U( :
M,:E)_WR\53A3KTM[AGO"+P5XDUX_$V\>19\%_C8:.% 'ZD =<=4Y%_87N;Z>
M2Q[N'"X4J;J*SWF=K>N-#_A\@>808 ),@$E$F(:A/FT.P11M;%Z7>SX-,\(U
MU)F^T0+4 3; !M@ FRN&S?+[WLJR6I,V6=SGJPD!FO3Z.?&IXNSV3VCDP!VX
M W<$=&<B\+\&R\>5Y8I>VCL92;;X]>/X*TC;_"<<S70T><M1!X-88!2,@E%Q
M&1T&_"6\X:@L5VOH_<O')%F1I_,$FD 3: )-Q-4D"?A%=09BPO<<ZUU?9]^?
M8\5K8 -L@(V(V!0ZZ[LLUW7I8>#O>X]I"'32ZV>"SM>?OMQ&XP;>C*<)WL ;
M8;PY%_"7TF,&5"[PZ0GLUD+?&7@!+^#E2O.R@F:-HLC2>S9U+/"37DF';9KO
MO\0'@T,>R -Y1)9G+.07Q8ZJ2-O\)\C))">9P+W]UD\P>1OB0!R((Z0XPVA?
ME#9E6=HR'&>?%?XQ14LGO8HF[!"^*,+;__V#ET 'Z  =H",B.A-!_W5XSY"B
MR?%^AUZ45IKRKJ$IBT*\_VBA2Q#QI&!Z7KZUHR[%-]&Y"'6A+M056MTDZ"]V
M=;R%TU330--,-'6Z( DD@220)"Y)2; OJ/-15:K2YL%]<)->-<<'NWC?X]]B
MN O@ !R (R(X9R)^4>:HFO3("VS>\_DP\&%/>BU-[)%#/N*%A@[<&4\3W($[
MPK@S&?67\:8E_C+[M&T ESGZT8XY+]]&7QJ( 3$@1FABSL7^91'SL+[E=7OL
ME5H.F)EMUIX;S=K[!+/V  R  3"B C,E\A?6C\:72V4_(4^F/.]@ZAKH 3V@
M1VQZDF"_R+EK\[R^5I6BB\/O]\)#NTNMWS%L/ME\:M-G>)]75O*8!GTG;!"E
M7$E-TOKZ>G)B_.XZ:2PN<62-O3"A Q9ON$?OKIQIO2SQ?-BU6[[AGSPRP@Z:
MB^E7^,1J2M\&W(![/$V &W + _?T\%]4FU''W/(Y5B5?Y_9@47+0 WI CX#T
M%#JWO*S4I <TC%9SND=9H//9$;:BM_]"H-3:F@CT^:>C!M ?HO4#@D 0"!*0
MH&P#BH*IHD@'H=<[[+"J:>VXO+,0'&5R%* [#B"EI0D@ 21A0)H2^XMB2)>E
M7<]M'WIW[1!MHIE[Y3JWDMD<Z)@#0D ("(F'T$3D+XP@%<-!\TQ&P#Q"T -Z
M0(_ ]*BI8T+Q_8O/$1P>^Z,I1XWO\TJW@OF HX04/?>O(E>D;?X3P&8"^V^?
MQ+#>A*_P%;["5V%]'47\@EITE4I5.NBWV WMNO3J.=ZN&SP%.V '[( =<=D9
M"_L%V:/)VFBRQYYGV4<VJWM@*+VZ#EL_?\GPX>LP?86%94$0" )!(A*4&OV7
ML0:3AH&K>3ZA]SMHW8 6T ):!*4E9]#J522I*G7I_=8S5BQ\1@:?#@A7<EW9
MBEW1,1D<KL 5N"*H*]-C?T&]9U4-39IY/I'V^J\!'^ SGB;@ WR$P4=+;]2L
MA!L=W.1S\\V/7GX7G[P$:,ZE"=  &G&@T9?7>P9%YFJT?/2K/\$8/R@!):#D
MJE&RBC9+78$V<VC#;C=^"F_@#;R!-T)ZDP3\PKS1I1$INTD5 #Z9^"3OJ7F3
M??\]Z $]H ?TB$G/E-A?D$,UI8IVSSQ3 ^Y\"7I #^@!/2+2,PSW16E3EJ6#
MD/;VU'V ,W-'VXO_!#D@!^2 '"').8WYA:F#F02SD:,'6*X&W( ;<",P-X7.
M(ZAIF$<P3_-&;X$;<#.>)G #;H3A1BMT&D%-KX";F6<.X(,68 [,@3FBFY,$
M_8+,T3%E8*:E-W_ E]W\<U #:L;3!&I C2C4Z!GS!5[9$16KTLPY$^!-: )-
MH DT$503M=!U:?2JRC_)P+_K]5TK #N9[!PDGXB-#C.X W?@CM#NC 7^HO2I
M5Z3##JN&U@/?Z_>V&"J63_&>SVR&RE-&;C(K.1R"0W H/1UPJ$"'IA.PC,ZU
MNJQ+.ZR<GU-TL>4B<U:7)VCM0!DH V6$568\]!?4VJG+=>D]V^6&4/^,>9 H
M4Z(W1@[]WK_@39\P" ;!(#$-FA[^B])(PS3I&?1Y)UE)&F,^$ @"02"A!=(*
MG21=UU7I?K<7GD2Q^Y"?'/"9K1/NJS\"/L '^  ?<?&9C/[%.,2NJ3):/OGX
M!'AK*. !/(!';'A&X7X)4PI R6R4;"6=:(_^"P,X@ 20 )*K!LD*FBUJ58,U
M\TU<0_,%ZD =J".R.L.POXSF"TB9CQ3^SL\\(& )+($EL$0T2V9KP3RQJ$-#
M^I3<X[]976B0B]>A^&G''31MHZPVVZ;9M&BKWRY%22^QI,<G48IB(@U*J;J,
M=DC.M<3/M59Z3+O>,=VC4G2 !=-9DSYPDR!I;?J^<7+?H5U(FB=IYW?1'H.A
MXVF"H3!4'$.G!OZB.@7K6#!NKKD,WT*'(  "0 !(7(#JZ2O&@9/5=@BN'8,3
M< ).P,F5Y&0%#1A-4:0'6X=&NTTMJ#.;.CK[_BEFTL$<F -S1#3G;- OS!U5
M>D##K;[O4S>,EV/8ZO4/[2[>E)K-4++\Z$>_^HO/L.PH!() $$A$@5+#?V$@
M83V>N49R\,$_$.A<FB 0!!)'H/3%>&#)ZC]( 6T92 ))(,G5DF05#9=:/?HS
ML,G$YIM/7O[PP7]@U ;.P!DX(Z0S2: ORIDZWJPZVRR!;4Q* S6@!M2(2TW]
M5=^H^HK45$%-/C5F,@D:W( ;< -N!.:FNK2QF"H^9V<62S[_*T;( (R $3 "
M1L1DI%KHY^M4JC5-NF<?[WIN&^"D5\\$G(.S@_\_P[@,V $[8$=(=L;C_C(:
M,349'6)S34[^Y9^B*0-38 I,$=.48< OJ"E3TQ1X,]-8_^C6Q2@,S($Y,$=<
M<Y*@7Y Y>A5MG%D&:GZ(S]:!..EI@C@01Q1QAB&_*'%JF!HP>Z_:=AW8 )OQ
M- $;8",,-K7EO>$?DLPDR=??>\D,V?\[C/:#$3 "1JX:(RMHL]1K=6DS9&?6
M&5L[#?!DP_/IR^O[_PAVP [8 3LBLI,2]Y?0F-%D%8/_<P[^L]O/H0MT@2[0
M14!=1B&_F$:-)E=K$&<.<:[?^&=H VV@#;014ILDW!>E3;TB[;@\%%M1Y(8\
MZ75T>EL'$P' SWB:P _X$8:?*?%_*?UH<.8"SGR'?;_]^T &R  9( -D@,RB
MD3E=>>:M7Z ;#<2 &! #8D#, HE)5F:^_C]_ V  #( !,%<9F!G';*('_E-R
MEU<5[@![U" 7KU/QTXX[:-I&66VV3;-IT5:_78I.I<1.)3ZI4A0C:1#]75-E
M94.6V$M/IN\)-3O>Q8R,CCKEB/%]?OV0QS3H.V&#*.5*ZDNOKZ\G&<SOKI/&
M_(D@:^P%"!VP4,<MG*P[EZ<8E*44@W(9BD$1J!C4I12#>AF*016H&,I+*8;R
M92B&LD#%4%E*,4S+W9470T6@8M"64@S:92@&3:!BJ"ZE&*J7H1BJ><7PQ*(.
M#>E3<H__9N?)BB#L]EBKP;6/V#$W^&%6/7E)E:O2AY[#FD,.Q4KS,W7&O#'J
M[S_Z MTQZ(Y!=PRZ8T3LCID6^I?1WP]BYB:F'/ORU?<8,)F5%[[ %_@"7UYK
M7[2:-"JC'=>E_J9ILF?A3*XS9]^!L8<YL@ 'X  <<<')@& )\-1T'>\RSS<F
M6>YW( ,7X )<@(N0N R#?>Y\I:[QG&[XE%>-\; :OW+\#'OTGA$:#KGO^Y[/
M4G/_X'!CCM2H2KTJ[7I>CQ'#4R4-NDZCUE!9"6^ZO(XP7BSRT=XN,=FA#%;<
M+/Y\X-I<A :1!XK^+GEA!.3(Z[,\8^40=BBA#NU2EP]>L6N0_699R?]L>6:?
M_UW*.)M#MAW78!5CBO%K!J5%Y!FQ ^)Z(3'(:8Z-SI?LA/SYGL<.T').6+[X
M?K_'KIRLG'BU<DVF,<6ER:^8F4JS_/H5YFE&7<HB5(<79'G&(GP-K\?3C+J4
M15C%53A'1BV^" ]]PPV./+]+0KO+,EA1E%HW2)V_<6O&K_2Y)Z/S(OQ$>=LL
M3DI4JD'(_EWCQ3IE&O*B4K#"@NZ$76>Q)S+V($HH^R>(3[L)&NG;W?U@9_?>
MM/^H7C4K^#]A\=WH*M9J[!^CZ(+R',=[P<N6\M! /-/DJY\.6^9T0,U^5/1A
MAU78J-V[^'2Q?V;;]$RQ2'[?C9*IR'$R?4I>\!_\27)DV$Z?965Z+AYZ/-;%
M5TF-=&VWSW8DE1H)*(L[UOB>XQ.BDJ=,KW?RE&RQG_S<%3D*/ $)O?P33@HY
M[J=@1=Z.YBA=2RK4QW;OS*PS]FB&66?3C]A49;FFJ++65)5R66*'NG:-EVA2
M9.RJ369OO;##3A1DSY3UL!^F<>VBE2 CU89E]%AT.)_@X=]C1BIC!3N^Y6D1
MWRP9MV^6>CYE/UN>=<)^\2OU]O\#4$L! A0#"@    @ )JV%-]^5&2:@%P  
M$CP# !(              *2!     &5X96-U=&EO;E]L;V<N:'1M;%!+!08 
1     0 ! $    #0%P     ! 
end

Mime
View raw message