harmony-alerts mailing list archives

Site index · List index
Message view « Date » · « Thread »
Top « Date » · « Thread »
From nom...@intel.com
Subject [build-test alert] FAILED Linux x86_64: jdktools-test debug
Date Wed, 05 Dec 2007 15:23:21 GMT

BUILD FAILED:
	Ant Error Message:
/export/users/cc/cc-common/scripts/cc-exec-adaptor.xml:104: The following error occurred while
executing this line: /export/users/cc/cc-common/adaptors/jdktools-test/adaptor.xml:23: The
following error occurred while executing this line: /export/users/cc/cc-common/build/checkouts/hdk/working_jdktools/build.xml:242:
The following error occurred while executing this line: /export/users/cc/cc-common/build/checkouts/hdk/working_jdktools/make/build-test.xml:60:
The following error occurred while executing this line: /export/users/cc/cc-common/build/checkouts/hdk/working_jdktools/make/properties.xml:325:
The following error occurred while executing this line: /export/users/cc/cc-common/build/checkouts/hdk/working_jdktools/modules/samsa/build.xml:144:
exec returned: 134

Date of build:	2007-12-05 21:22:57 +0600
Time to build:	17 seconds
Last changed:	12/05/2007 20:28:29
Last log entry:	hdk

***********************************************************
Errors/Warnings:	(289)
            
Tests FAILED
========================================
Testing jdktools binaries...
========================================
Compiling JPDA tests
Since fork is false, ignoring memoryMaximumSize setting
----------
1. WARNING in /export/users/cc/cc-common/build/checkouts/hdk/working_jdktools/modules/jpda/test/common/unit/org/apache/harmony/jpda/tests/framework/DebuggeeRegister.java
(at line 58)
registered.add(debuggee);
^^^^^^^^^^^^^^^^^^^^^^^^
Type safety: The method add(Object) belongs to the raw type LinkedList. References to generic
type LinkedList<E> should be parameterized
----------
----------
2. WARNING in /export/users/cc/cc-common/build/checkouts/hdk/working_jdktools/modules/jpda/test/common/unit/org/apache/harmony/jpda/tests/framework/TestOptions.java
(at line 505)
internalProperties.put(name, value);
^^^^^^^^^^^^^^^^^^^^^^^^^^^^^^^^^^^
Type safety: The method put(Object, Object) belongs to the raw type HashMap. References to
generic type HashMap<K,V> should be parameterized
----------
----------
3. WARNING in /export/users/cc/cc-common/build/checkouts/hdk/working_jdktools/modules/jpda/test/common/unit/org/apache/harmony/jpda/tests/framework/jdwp/PacketDispatcher.java
(at line 114)
eventQueue.add(eventPacket);
^^^^^^^^^^^^^^^^^^^^^^^^^^^
Type safety: The method add(Object) belongs to the raw type List. References to generic type
List<E> should be parameterized
----------
4. WARNING in /export/users/cc/cc-common/build/checkouts/hdk/working_jdktools/modules/jpda/test/common/unit/org/apache/harmony/jpda/tests/framework/jdwp/PacketDispatcher.java
(at line 249)
replies.put(new Integer(replyPacket.getId()),
replyPacket);
^^^^^^^^^^^^^^^^^^^^^^^^^^^^^^^^^^^^^^^^^^^^^^^^^^^^^^^^^^^^^^^^^^^^^^^^^^^^^^^^^^^^^^^^^^
Type safety: The method put(Object, Object) belongs to the raw type Hashtable. References
to generic type Hashtable<K,V> should be parameterized
----------
5. WARNING in /export/users/cc/cc-common/build/checkouts/hdk/working_jdktools/modules/jpda/test/common/unit/org/apache/harmony/jpda/tests/framework/jdwp/PacketDispatcher.java
(at line 284)
commands.put(Id, command);
^^^^^^^^^^^^^^^^^^^^^^^^^
Type safety: The method put(Object, Object) belongs to the raw type Hashtable. References
to generic type Hashtable<K,V> should be parameterized
----------
6. WARNING in /export/users/cc/cc-common/build/checkouts/hdk/working_jdktools/modules/jpda/test/common/unit/org/apache/harmony/jpda/tests/framework/jdwp/PacketDispatcher.java
(at line 355)
commands.put(Id, command);
^^^^^^^^^^^^^^^^^^^^^^^^^
Type safety: The method put(Object, Object) belongs to the raw type Hashtable. References
to generic type Hashtable<K,V> should be parameterized
----------
----------
7. WARNING in /export/users/cc/cc-common/build/checkouts/hdk/working_jdktools/modules/jpda/test/common/unit/org/apache/harmony/jpda/tests/framework/jdwp/VmMirror.java
(at line 1834)
frames.add(frame);
^^^^^^^^^^^^^^^^^
Type safety: The method add(Object) belongs to the raw type ArrayList. References to generic
type ArrayList<E> should be parameterized
----------
8. WARNING in /export/users/cc/cc-common/build/checkouts/hdk/working_jdktools/modules/jpda/test/common/unit/org/apache/harmony/jpda/tests/framework/jdwp/VmMirror.java
(at line 1902)
vars.add(var);
^^^^^^^^^^^^^
Type safety: The method add(Object) belongs to the raw type ArrayList. References to generic
type ArrayList<E> should be parameterized
----------
9. WARNING in /export/users/cc/cc-common/build/checkouts/hdk/working_jdktools/modules/jpda/test/common/unit/org/apache/harmony/jpda/tests/framework/jdwp/VmMirror.java
(at line 2122)
fields.add(superClassFields.toArray()[i]);
^^^^^^^^^^^^^^^^^^^^^^^^^^^^^^^^^^^^^^^^^
Type safety: The method add(Object) belongs to the raw type ArrayList. References to generic
type ArrayList<E> should be parameterized
----------
10. WARNING in /export/users/cc/cc-common/build/checkouts/hdk/working_jdktools/modules/jpda/test/common/unit/org/apache/harmony/jpda/tests/framework/jdwp/VmMirror.java
(at line 2132)
fields.add(field);
^^^^^^^^^^^^^^^^^
Type safety: The method add(Object) belongs to the raw type ArrayList. References to generic
type ArrayList<E> should be parameterized
----------
----------
11. WARNING in /export/users/cc/cc-common/build/checkouts/hdk/working_jdktools/modules/jpda/test/common/unit/org/apache/harmony/jpda/tests/jdwp/DebuggerOnDemand/OnthowDebuggerLaunchDebuggee.java
(at line 94)
class ExceptionForDebugger extends Exception {
^^^^^^^^^^^^^^^^^^^^
The serializable class ExceptionForDebugger does not declare a static final serialVersionUID
field of type long
----------
----------
12. WARNING in /export/users/cc/cc-common/build/checkouts/hdk/working_jdktools/modules/jpda/test/common/unit/org/apache/harmony/jpda/tests/jdwp/Events/ClassUnloadDebuggee.java
(at line 32)
import java.util.LinkedList;
^^^^^^^^^^^^^^^^^^^^
The import java.util.LinkedList is never used
----------
13. WARNING in /export/users/cc/cc-common/build/checkouts/hdk/working_jdktools/modules/jpda/test/common/unit/org/apache/harmony/jpda/tests/jdwp/Events/ClassUnloadDebuggee.java
(at line 97)
boolean isOutOfMemory = false;
^^^^^^^^^^^^^
The local variable isOutOfMemory is never read
----------
14. WARNING in /export/users/cc/cc-common/build/checkouts/hdk/working_jdktools/modules/jpda/test/common/unit/org/apache/harmony/jpda/tests/jdwp/Events/ClassUnloadDebuggee.java
(at line 171)
public Class loadClass(String name) throws ClassNotFoundException {
^^^^^
Type safety: The return type Class for loadClass(String) from the type ClassUnloadDebuggee.CustomLoader
needs unchecked conversion to conform to Class<?> from the type ClassLoader
----------
15. WARNING in /export/users/cc/cc-common/build/checkouts/hdk/working_jdktools/modules/jpda/test/common/unit/org/apache/harmony/jpda/tests/jdwp/Events/ClassUnloadDebuggee.java
(at line 179)
public Class findClass(String name) throws ClassNotFoundException {
^^^^^
Type safety: The return type Class for findClass(String) from the type ClassUnloadDebuggee.CustomLoader
needs unchecked conversion to conform to Class<?> from the type ClassLoader
----------
----------
16. WARNING in /export/users/cc/cc-common/build/checkouts/hdk/working_jdktools/modules/jpda/test/common/unit/org/apache/harmony/jpda/tests/jdwp/Events/CombinedEvents002Test.java
(at line 100)
boolean expectColocatedEvents = (testedMethodStartCodeIndex == testedMethodEndCodeIndex);
^^^^^^^^^^^^^^^^^^^^^
The local variable expectColocatedEvents is never read
----------
----------
17. WARNING in /export/users/cc/cc-common/build/checkouts/hdk/working_jdktools/modules/jpda/test/common/unit/org/apache/harmony/jpda/tests/jdwp/Events/CombinedEvents003Test.java
(at line 53)
private boolean eventMethodExitReceived = false;
^^^^^^^^^^^^^^^^^^^^^^^
The field CombinedEvents003Test.eventMethodExitReceived is never read locally
----------
18. WARNING in /export/users/cc/cc-common/build/checkouts/hdk/working_jdktools/modules/jpda/test/common/unit/org/apache/harmony/jpda/tests/jdwp/Events/CombinedEvents003Test.java
(at line 76)
int EXPECTED_EVENTS_COUNT = EXPECTED_EVENTS_ARRAY.length;
^^^^^^^^^^^^^^^^^^^^^
The local variable EXPECTED_EVENTS_COUNT is never read
----------
----------
19. WARNING in /export/users/cc/cc-common/build/checkouts/hdk/working_jdktools/modules/jpda/test/common/unit/org/apache/harmony/jpda/tests/jdwp/Events/CombinedEventsTest.java
(at line 84)
int EXPECTED_EVENTS_COUNT = EXPECTED_EVENTS_ARRAY.length;
^^^^^^^^^^^^^^^^^^^^^
The local variable EXPECTED_EVENTS_COUNT is never read
----------
20. WARNING in /export/users/cc/cc-common/build/checkouts/hdk/working_jdktools/modules/jpda/test/common/unit/org/apache/harmony/jpda/tests/jdwp/Events/CombinedEventsTest.java
(at line 212)
int EXPECTED_EVENTS_COUNT = EXPECTED_EVENTS_ARRAY.length;
^^^^^^^^^^^^^^^^^^^^^
The local variable EXPECTED_EVENTS_COUNT is never read
----------
21. WARNING in /export/users/cc/cc-common/build/checkouts/hdk/working_jdktools/modules/jpda/test/common/unit/org/apache/harmony/jpda/tests/jdwp/Events/CombinedEventsTest.java
(at line 348)
int EXPECTED_EVENTS_COUNT = EXPECTED_EVENTS_ARRAY.length;
^^^^^^^^^^^^^^^^^^^^^
The local variable EXPECTED_EVENTS_COUNT is never read
----------
22. WARNING in /export/users/cc/cc-common/build/checkouts/hdk/working_jdktools/modules/jpda/test/common/unit/org/apache/harmony/jpda/tests/jdwp/Events/CombinedEventsTest.java
(at line 732)
String failureMessage = "## FAILURE during checking events! !";
^^^^^^^^^^^^^^
The local variable failureMessage is never read
----------
23. WARNING in /export/users/cc/cc-common/build/checkouts/hdk/working_jdktools/modules/jpda/test/common/unit/org/apache/harmony/jpda/tests/jdwp/Events/CombinedEventsTest.java
(at line 894)
String failureMessage = "## FAILURE during checking events !";
^^^^^^^^^^^^^^
The local variable failureMessage is never read
----------
----------
24. WARNING in /export/users/cc/cc-common/build/checkouts/hdk/working_jdktools/modules/jpda/test/common/unit/org/apache/harmony/jpda/tests/jdwp/Events/CombinedEventsTestCase.java
(at line 135)
long methodStartCodeIndex = lineTableReply.getNextValueAsLong();
^^^^^^^^^^^^^^^^^^^^
The local variable methodStartCodeIndex is never read
----------
25. WARNING in /export/users/cc/cc-common/build/checkouts/hdk/working_jdktools/modules/jpda/test/common/unit/org/apache/harmony/jpda/tests/jdwp/Events/CombinedEventsTestCase.java
(at line 187)
long methodStartCodeIndex = reply.getNextValueAsLong();
^^^^^^^^^^^^^^^^^^^^
The local variable methodStartCodeIndex is never read
----------
----------
26. WARNING in /export/users/cc/cc-common/build/checkouts/hdk/working_jdktools/modules/jpda/test/common/unit/org/apache/harmony/jpda/tests/jdwp/Events/ExceptionTest.java
(at line 188)
long frameID = reply.getNextValueAsFrameID();
^^^^^^^
The local variable frameID is never read
----------
----------
27. WARNING in /export/users/cc/cc-common/build/checkouts/hdk/working_jdktools/modules/jpda/test/common/unit/org/apache/harmony/jpda/tests/jdwp/ThreadReference/FramesTest.java
(at line 450)
frames.add(new FrameStruct(frameID, loc));
^^^^^^^^^^^^^^^^^^^^^^^^^^^^^^^^^^^^^^^^^
Type safety: The method add(Object) belongs to the raw type Vector. References to generic
type Vector<E> should be parameterized
----------
----------
28. WARNING in /export/users/cc/cc-common/build/checkouts/hdk/working_jdktools/modules/jpda/test/common/unit/org/apache/harmony/jpda/tests/jdwp/share/JDWPUnitDebuggeeProcessWrapper.java
(at line 233)
argv.add(val);
^^^^^^^^^^^^^
Type safety: The method add(Object) belongs to the raw type Vector. References to generic
type Vector<E> should be parameterized
----------
29. WARNING in /export/users/cc/cc-common/build/checkouts/hdk/working_jdktools/modules/jpda/test/common/unit/org/apache/harmony/jpda/tests/jdwp/share/JDWPUnitDebuggeeProcessWrapper.java
(at line 253)
return (String[])argv.toArray(args);
^^^^^^^^^^^^^^^^^^
Type safety: The method toArray(Object[]) belongs to the raw type Vector. References to generic
type Vector<E> should be parameterized
----------
29 problems (29 warnings)
JPDA exclude list: /export/users/cc/cc-common/build/checkouts/hdk/working_classlib/deploy/build/jdktools.jpda.exclude
Running JPDA tests
Debugger JVM=/export/users/cc/cc-common/build/checkouts/hdk/target/hdk/jdk/jre/bin/java
Debuggee JVM=/export/users/cc/cc-common/build/checkouts/hdk/target/hdk/jdk/jre/bin/java
Exception raised while initializing helper class org/apache/harmony/drlvm/gc_gen/GCHelper
SIGABRT in VM code.
Stack trace:
0: raise (??:-1)
1: abort (??:-1)
addr2line: '[stack]': No such file
2: ?? (bort:-1)
addr2line: '[stack]': No such file
3: ?? (bort:-1)
4: log4cxx::helpers::ObjectImpl::releaseRef() const (/export/users/cc/cc-common/build/checkouts/hdk/working_vm/build/pre-copied/common/LOG4CXX/src/objectimpl.cpp:40)
5: ~synchronized (/export/users/cc/cc-common/build/checkouts/hdk/working_vm/build/pre-copied/common/LOG4CXX/src/synchronized.cpp:43)
6: ~ObjectPtrT (/export/users/cc/cc-common/build/checkouts/hdk/working_vm/build/lnx_em64t_gcc_debug/semis/extra/log4cxx/src/include/log4cxx/helpers/objectptr.h:75)
7: log4cxx::Hierarchy::shutdown() (/export/users/cc/cc-common/build/checkouts/hdk/working_vm/build/pre-copied/common/LOG4CXX/src/hierarchy.cpp:280)
addr2line: '[stack]': No such file
8: ?? (og4cxx::Hierarchy::shutdown():-1)
9: ?? (??:-1)
10: ?? (??:-1)
addr2line: '[stack]': No such file
11: ?? (og4cxx::Hierarchy::shutdown():-1)
addr2line: '[stack]': No such file
12: ?? (og4cxx::Hierarchy::shutdown():-1)
13: init_magic_helper_class (/export/users/cc/cc-common/build/checkouts/hdk/working_vm/vm/vmcore/src/jit/rt_helper_info.cpp:362)
14: ?? (??:-1)
15: ?? (??:-1)
16: ?? (??:-1)
17: ?? (??:-1)
<end of stack trace>
Exception raised while initializing helper class org/apache/harmony/drlvm/gc_gen/GCHelper
SIGABRT in VM code.
Stack trace:
0: raise (??:-1)
1: abort (??:-1)
addr2line: '[stack]': No such file
2: ?? (bort:-1)
addr2line: '[stack]': No such file
3: ?? (bort:-1)
4: log4cxx::helpers::ObjectImpl::releaseRef() const (/export/users/cc/cc-common/build/checkouts/hdk/working_vm/build/pre-copied/common/LOG4CXX/src/objectimpl.cpp:40)
5: ~synchronized (/export/users/cc/cc-common/build/checkouts/hdk/working_vm/build/pre-copied/common/LOG4CXX/src/synchronized.cpp:43)
6: ~ObjectPtrT (/export/users/cc/cc-common/build/checkouts/hdk/working_vm/build/lnx_em64t_gcc_debug/semis/extra/log4cxx/src/include/log4cxx/helpers/objectptr.h:75)
7: log4cxx::Hierarchy::shutdown() (/export/users/cc/cc-common/build/checkouts/hdk/working_vm/build/pre-copied/common/LOG4CXX/src/hierarchy.cpp:280)
addr2line: '[stack]': No such file
8: ?? (og4cxx::Hierarchy::shutdown():-1)
9: ?? (??:-1)
10: ?? (??:-1)
addr2line: '[stack]': No such file
11: ?? (og4cxx::Hierarchy::shutdown():-1)
addr2line: '[stack]': No such file
12: ?? (og4cxx::Hierarchy::shutdown():-1)
13: init_magic_helper_class (/export/users/cc/cc-common/build/checkouts/hdk/working_vm/vm/vmcore/src/jit/rt_helper_info.cpp:362)
14: ?? (??:-1)
15: ?? (??:-1)
16: ?? (??:-1)
17: ?? (??:-1)
<end of stack trace>
SAMSA exclude list: /export/users/cc/cc-common/build/checkouts/hdk/working_classlib/deploy/build/jdktools.samsa.exclude
Running SAMSA tests
test.jre.home=/export/users/cc/cc-common/build/checkouts/hdk/target/hdk/jdk/jre
Run jdk/bin/java -version in /export/users/cc/cc-common/build/checkouts/hdk/working_jdktools/build/test_report
java version "1.5.0"
pre-alpha : not complete or compatible
svn = r601343, (Dec  5 2007), Linux/em64t/gcc 4.1.0, debug build
http://harmony.apache.org
Run jdk/bin/javac -version in /export/users/cc/cc-common/build/checkouts/hdk/working_jdktools/build/test_report
Exception raised while initializing helper class org/apache/harmony/drlvm/gc_gen/GCHelper
SIGABRT in VM code.
Stack trace:
0: raise (??:-1)
1: abort (??:-1)
addr2line: '[stack]': No such file
2: ?? (bort:-1)
addr2line: '[stack]': No such file
3: ?? (bort:-1)
4: log4cxx::helpers::ObjectImpl::releaseRef() const (/export/users/cc/cc-common/build/checkouts/hdk/working_vm/build/pre-copied/common/LOG4CXX/src/objectimpl.cpp:40)
5: ~synchronized (/export/users/cc/cc-common/build/checkouts/hdk/working_vm/build/pre-copied/common/LOG4CXX/src/synchronized.cpp:43)
6: ~ObjectPtrT (/export/users/cc/cc-common/build/checkouts/hdk/working_vm/build/lnx_em64t_gcc_debug/semis/extra/log4cxx/src/include/log4cxx/helpers/objectptr.h:75)
7: log4cxx::Hierarchy::shutdown() (/export/users/cc/cc-common/build/checkouts/hdk/working_vm/build/pre-copied/common/LOG4CXX/src/hierarchy.cpp:280)
addr2line: '[stack]': No such file
8: ?? (og4cxx::Hierarchy::shutdown():-1)
9: ?? (??:-1)
10: ?? (??:-1)
addr2line: '[stack]': No such file
11: ?? (og4cxx::Hierarchy::shutdown():-1)
addr2line: '[stack]': No such file
12: ?? (og4cxx::Hierarchy::shutdown():-1)
13: init_magic_helper_class (/export/users/cc/cc-common/build/checkouts/hdk/working_vm/vm/vmcore/src/jit/rt_helper_info.cpp:362)
14: ?? (??:-1)
15: ?? (??:-1)
16: ?? (??:-1)
17: ?? (??:-1)
<end of stack trace>
The execution FAILED with the following exception:
The following error occurred while executing this line:
/export/users/cc/cc-common/adaptors/jdktools-test/adaptor.xml:23: The following error occurred
while executing this line:
/export/users/cc/cc-common/build/checkouts/hdk/working_jdktools/build.xml:242: The following
error occurred while executing this line:
/export/users/cc/cc-common/build/checkouts/hdk/working_jdktools/make/build-test.xml:60: The
following error occurred while executing this line:
/export/users/cc/cc-common/build/checkouts/hdk/working_jdktools/make/properties.xml:325: The
following error occurred while executing this line:
/export/users/cc/cc-common/build/checkouts/hdk/working_jdktools/modules/samsa/build.xml:144:
exec returned: 134

***********************************************************
Unit Tests: (0)
        
No Tests Run: This project doesn't have any tests

***********************************************************
Modifications since last successful build:	(1)
            
add cc-hdk log20071205202829Lbuild.452 12/05/2007 20:28:29hdk

begin 644 execution_log.zip
M4$L#! H    ( .BJA3<88K4Z_0L  -I5   2    97AE8W5T:6]N7VQO9RYH
M=&UL[5Q[;]LX$O_[_"FX71QJ ['D5U[:-$4N2=OLY75)FMU#T0L8B;:82*) 
M4K&]!]QGOR$EV;%LRZ^D58(8"2#Q,3.<'SDS&E+:<:7O[>[<,J>_NQ-RLKN#
MD9!]CWQXWV:!K KZ%['05NWOO[W?+46A@R6IBH? *I6J@L@HK-XY]Y(Q3U2[
M0A4F349+>00=#J+0HS94.BCD[([8$@78)X@&B/HAX]) YTGY%0NKQ^2!>*IE
M2+CL(X>T:4 E98&(KX%,FW(A57^3]!0!,Q*$"].VX:]J,]]G@2EL3D,IS(00
M)<+H^1["@8-P!RO>N=UO(^HYINT2^YY%0,9U[LTNX_<TZ-RD8S1]?$\R#$HE
M282T2DC]OA';9=]1Z<.<O](5] 4.*.6 ;FF N2)M&/-3*=D>P4%5"2*J('T8
M@4 EFX7]ZATGU3;UB +'=GWFC)8D3:QX%%6HCW2-'HQ_[U#^'>USHK&$&VME
M#<:-%+,;3A2E'\%*E$KZ)M;0*%;[S ^IIS#X_?Q@#\7-?X1,INUA(4C"[ X_
M8/NQ-(W-.A(LXC9!&BTDV;-SOZ2!8@?=$!6HC3U!UA#M!(PKB7SB,]X_P3WJ
M1_XE6 L$=D'-WA$:U<%OI+ANH#_V+DZ/3C\_R3J,YZEY!S9(C\=,>D=@.4S&
M.R8.,= P7<RAN#]L*,PV!UND*)H'Y#;J= BY(!TJ).&&DG5$:E3&$@$<!*UO
M549J_L:33L0QL..4G816Y3<TVNX_4WXCK:[Z(6@3MXGL6^C*):!KZ3(P7$#Y
M[%99R@JZ)1X+.GH>2&C!<1=)U>V8!O?$.09A#'1!VB 1@*B;=4A .+6SS78.
M=Y%P6>0Y0!.%6.D#!@* .O,@.:6X44" E74]"[4KR<6VMIX!EP:@D ![YT-3
M#S:UK+S8&GK 7@0XSP?SHH@K-C'B:V@6\E^P<$]PF M[TF;GGVO7SX%ZLX"H
MWSG=T#S']CV1!U2$6$*/W+5=K[<R^$-$$LA_120B>G'KVYCB K@_X0J?N;97
M7M6MUP!DH[4]9J4A%$U7+^FB(UC8'<++JKP?DS8Z1!XYY4IE;93JC-\C"DO8
M@B5_SV)")+[UR$PCHENM;$;67\4TV\K:"\46'C3B>7;DK*&D8.Z9\>*!W7@-
MP#;7LX' &[!3BC>+BO>U?T(Y9_D.?ZN97<&:BM#>7E_.!/C)O/L>Y[@_T\4/
M6JWHY[=>-&[;M48&MP?,8]3@(A>S%XK7]DO&JU%O9/%J4^(Y,6(B@F>K?96&
M^!072J:U5JY\H]^7CJE>*,[UVLL&NID#M+Y\K09U&I[%27AI%)-<%S\+#H@*
M8,RS !3:38N/<138;IH0RX-Z>RSV52L8'?9LHC,MGQA/B2+2DP2"IV$E^N]H
MW_A1:O8R=E6ND5/LT;]44(-R>#H,P Z81 Z!5IP@M<N!)<#>I@'V$CK7  -T
M_'IT@/3L1*P=3PLUI5:!O3AI, W[H<I<"%-;V:^!Q[ S#\9CBSG>MD'JUH@D
M]8QA-O&W28C.!VD.595_#L@#X FJF\^ %B<5M8+FMS<SFK\%:0@.0!]GD3QK
MG^@<//H0)^<GZQ[E:]UC-BP#")>H7DJCA =JYP3/I_;B)(Y64'M]LY[1>QC=
M>F S-!VDR.BK\J746R$J$5P!K\-95\1M3IG\Q*+ F6'JT!RNCA,9\2 V1S'_
M-N-C,E10FS-?>[YAR\R(]R,AF7\,18!H0 B88F7F 0'BP)-L\!!;0>4;X0ZX
M^.I24]KYN#N)04QKKHE1G%3/2A,CFU$<F1C@4G[ZQ,C*4/2),6V^%">#-#)?
MF'^KCB#$M[5:0^TIY<Z86FV*"8<10=RZSY0!EBE%,.5EQ94X)SK"O9280QN'
M' 4.Z:$/']#CVD. .JW+!M03K?^\7F"R; M[@VG8%B=;E(=M<Q:VZ\VL,>#T
M ?2%!A K2@E4/2HOB$WH RRI?'^=B]P$[.*(=;+TTR08@3)&W^O/A5UQ,D8K
M8;>Y,;['BP[_/#_<OSH\N#F\/CR]NKS9/_MZ>@5H9<OW+B[V_FUX).A(=P*(
M2RVYR;R?;,D5)W$T';99F(WML[P2S!K%2?8L#TZC/O:4^$K0*5CJ9BETFJWL
M@:77@DY!,RP+H;,YEF%)GA_:F'H1)R=$"-PA@,R[7W]%G_:.CK]>'"(GTFWT
MB-2%]O7B%_3+NWF2,+/PR;!>')B")F 6\SACZ<WE@2D(+M/@*FCB9@RN?2SR
M']&;V4U[E<---@RRCU.ZRY72ZX4ZOZ/._IR2GKQ61_KVX"$VZ)0G/E<M8_ F
M2K#XLBIH'F5QG+:RN<T\G/@+@6<::L7,9@R24#.S&%O9\$&#I;<&CPZFX/,I
MKLV%:*:U2S@\&1 %2SU<N6I @WU)4^MLIEMJK6>32H_.JZASC9H,N*K(EN5$
MA6M*M96?OX]^#;6,Y^[%QDV>Z5QZP?(7 BJ(^?O!'^=?H4>:D3WG#!0C_N X
M#&<</FQFDU"8=QZ2(S#>CSD"\Z,@;10LB;$R=F,)Q"2EGZ3NOWVO:##3@S!P
M(Z:E>0>_)9=NRB/&&C@7 &WU$B X 5^@,MQT,0] *:)2*H7@;D#U5=*SO<@A
MHV]PZ?>VDAK0LY!+OZ:ECQ5X]-9TP+NQ?M(VG3^&F@Y&PDB_ZCCI?;*+* @F
MO$V65B,T.*GP^_7)AP4%A6 %7*Z^O%/_,!LA"C,'4VZ,"WD.+M_NU((9#A56
MCA&O'"-9.;&J].@-M7*,:\IEA+T3: 0+P4B.7RBW-T)QN$G&,17$05V7JCUJ
M]3ZH.ORAN+G$@V66' &9L&@=[CWX9L>^@1EJ?M[_HIN/<+D\^KSWCXLK95*N
M3Y -P9\Q6B^Q?8\DQW8RT](*A&I6+!DJ?_QH50>;QFEUW4+X5IUIF%0-EI4W
ME!VPT/MO0O'X_MY"IPR)R';U2WX9:@T+??R(RHK@ZL2:.<00:ED0+71:=J]G
M6;&"A67%IN'(#SW+XL0C$."##2A7U)Z@@#$NN<H G;@:5C6T#REQ4D-\?/:Y
MM?_GGZ;@MLDT=PK<#3L,K58M*_.ZA?XG^H'M<A8H&_/< CWF%8O4S(JT 2+%
M6CN7_&IU@;R@=T/\C9:\Z=CVC7['T!3$IP((P_PT$\RT>#30AFE0EL"8Z#&4
MW'"MS?6LQ)N/@/]""<?<=ON6)=Q(.JP; -C/K%4W9:I5VMBJK3C/M^)YGCNF
M"0M@.^XV:577:U/K%I6N7E]&NH6Y-);201U,A+*T-S[N4/LFGC^Q3UQE$N@_
MFX$347#?0:3%94J<!FVF<6]N-++2M'(06<^IV\BIVYQ:MT,"?0A0#&W_[D@#
MY:N$SO@='CR1%_S"O$?YDS='^.8(WQSAFR-\<X1OCO#%.,*29*#Z:K)')?2'
M9:RTE*C71H9EPP_,6#.>Z"_W3BY_S".]P+X8/M,K"<"DVQB&";.*]&C\=9[X
M RSJ2T(!0X$^CP>/]CVYAARF3WTRZ:KOH,S*"<3C&D\*2)W^Y1 X,)^L_K2>
MY:V^+C1X@D?5]'#G$V34)G_-!UCWB/T=[>EX!'V)XQ$4OV,"$8N%RG8%[;.P
MSVG'E:B^O5U?0XU:;5,GJ))NEZPMN^H%#GU\%NM@B'%$8?)YU":!@+FUAC#@
M$NK/3:E78D?8Z]&F@WU7-]:-VCLTTD(99.R%+@:1U"LC,/30(Y(H/NH:F-YZ
M9*2+> C4[L=&K=YL-==0^8#8X("U\)4U]9&5J&=J1P6!EXU:1MVHP2Q1_@II
M98T0<Z4,+3,-V-+H$4*Y7 3M'PCA\\:A*9=I<>B@/AN'IA53XM!A]<0X-*V>
MTYT,J4V*0Y<F-BD.'=:^G#AT*'-AXM"A2"\E#AU*7-0X=.EYOE <.NPV'H<.
MZB;$H<M*MU@<NC27A>+08;<BQ*%#:<;CT&'=>!PZK!N/0X=UXW%H6C<Q#BVI
M^$#51]HGQ4$HZE+IZBVK-O,\UM4GL%*_9>DNCRI43(J8;4><#]Q90A&J(8X3
M>J_.*N4H&#LXE!!^#.)('?2EQ>JKD%:C&>^V/3'G^5UZ+$6K\?/$T!_+''YW
M40NT4?O)\HQ^O--J-M9_HD#)?K1^"'F$6KT%2TUQ3-[X(HX%MJ!5VC'Q[HZI
M/]UJQI]Q-?4W7?\/4$L! A0#"@    @ Z*J%-QABM3K]"P  VE4  !(     
M         *2!     &5X96-U=&EO;E]L;V<N:'1M;%!+!08      0 ! $  
(   M#      ! 
end

Mime
View raw message