harmony-alerts mailing list archives

Site index · List index
Message view « Date » · « Thread »
Top « Date » · « Thread »
From nom...@intel.com
Subject [build-test alert] FAILED Linux x86_64: drlvm-reg-test debug
Date Wed, 05 Dec 2007 15:22:51 GMT

BUILD FAILED:
	Ant Error Message:
/export/users/cc/cc-common/scripts/cc-exec-adaptor.xml:104: The following error occurred while
executing this line: /export/users/cc/cc-common/adaptors/drlvm-reg-test/adaptor.xml:74: There
were drlvm-reg-test failures

Date of build:	2007-12-05 21:15:26 +0600
Time to build:	7 minutes 17 seconds
Last changed:	12/05/2007 20:28:29
Last log entry:	hdk

***********************************************************
Errors/Warnings:	(128)
            
[junit] Test org.apache.harmony.drlvm.tests.regression.h0000.DirectByteBufferTest FAILED
[junit] Test org.apache.harmony.drlvm.tests.regression.h1578.NaNTest FAILED
[junit] Test org.apache.harmony.drlvm.tests.regression.h1654.H1654Test FAILED
[junit] Test org.apache.harmony.drlvm.tests.regression.h1748.IntfAccessTest FAILED
[junit] Test org.apache.harmony.drlvm.tests.regression.h1788.abcdTest FAILED
[junit] Test org.apache.harmony.drlvm.tests.regression.h1800.ExecTest FAILED
[junit] Test org.apache.harmony.drlvm.tests.regression.h1802.UnresolvedParamTest FAILED
[junit] Test org.apache.harmony.drlvm.tests.regression.h1802.UnresolvedHandlerTest FAILED
[junit] Test org.apache.harmony.drlvm.tests.regression.h1840.SimplestTest FAILED
[junit] Test org.apache.harmony.drlvm.tests.regression.h1840.SimplestTest FAILED
[junit] Test org.apache.harmony.drlvm.tests.regression.h1852.DivIntTest FAILED
[junit] Test org.apache.harmony.drlvm.tests.regression.h1857.Test FAILED
[junit] Test org.apache.harmony.drlvm.tests.regression.h1861.Test FAILED
[junit] Test org.apache.harmony.drlvm.tests.regression.h1863.H1863Test FAILED
[junit] Test org.apache.harmony.drlvm.tests.regression.h2057.SyncTest FAILED
[junit] Test org.apache.harmony.drlvm.tests.regression.h2083.Test FAILED
[junit] Test org.apache.harmony.drlvm.tests.regression.h2083.Test FAILED
[junit] Test org.apache.harmony.drlvm.tests.regression.h2083.Test FAILED
[junit] Test org.apache.harmony.drlvm.tests.regression.h2084.Test FAILED
[junit] Test org.apache.harmony.drlvm.tests.regression.h2086.Test FAILED
[junit] Test org.apache.harmony.drlvm.tests.regression.h2092.Test FAILED
[junit] Test org.apache.harmony.drlvm.tests.regression.h2092.Test FAILED
[junit] Test org.apache.harmony.drlvm.tests.regression.h2103.Test FAILED
[junit] Test org.apache.harmony.drlvm.tests.regression.h2113.Test FAILED
[junit] Test org.apache.harmony.drlvm.tests.regression.h2151.VMInit1Test FAILED
[java] Java Result: 134
[junit] Test org.apache.harmony.drlvm.tests.regression.h2259.H2259 FAILED
[junit] Test org.apache.harmony.drlvm.tests.regression.h2261.RCETest FAILED
[junit] Test org.apache.harmony.drlvm.tests.regression.h2335.SimplestLibraryPathTest FAILED
[junit] Test org.apache.harmony.drlvm.tests.regression.h2644.BootDelegationTest FAILED
[junit] Test org.apache.harmony.drlvm.tests.regression.h2679.DupTest FAILED
[junit] Test org.apache.harmony.drlvm.tests.regression.h2748.Test FAILED
[junit] Test org.apache.harmony.drlvm.tests.regression.h2773.InfinityTest FAILED
[junit] Test org.apache.harmony.drlvm.tests.regression.h2808.finTest FAILED
[junit] Test org.apache.harmony.drlvm.tests.regression.h2846.NoVerifyTest FAILED
[junit] Test org.apache.harmony.drlvm.tests.regression.h2873.RemTest FAILED
[junit] Test org.apache.harmony.drlvm.tests.regression.h2874.Test FAILED
[junit] Test org.apache.harmony.drlvm.tests.regression.h2899.ManyArgsTest FAILED
[junit] Test org.apache.harmony.drlvm.tests.regression.h2926.Test FAILED
[junit] Test org.apache.harmony.drlvm.tests.regression.h2926.Test FAILED
[junit] Test org.apache.harmony.drlvm.tests.regression.h3027.AgentLibTest FAILED
[junit] Test org.apache.harmony.drlvm.tests.regression.h3048.H3048 FAILED
[junit] Test org.apache.harmony.drlvm.tests.regression.h3067.Test FAILED
[junit] Test org.apache.harmony.drlvm.tests.regression.h3074.Test FAILED
[junit] Test org.apache.harmony.drlvm.tests.regression.h3098.JsrNoRetTest FAILED
[junit] Test org.apache.harmony.drlvm.tests.regression.h3098.JsrNoRetTest FAILED
[junit] Test org.apache.harmony.drlvm.tests.regression.h3110.FieldTest FAILED
[junit] Test org.apache.harmony.drlvm.tests.regression.h3121.H3121 FAILED
[junit] Test org.apache.harmony.drlvm.tests.regression.h3130.CallNativeTest FAILED
[junit] Test org.apache.harmony.drlvm.tests.regression.h3150.Test FAILED
[junit] Test org.apache.harmony.drlvm.tests.regression.h3175.Test FAILED
[junit] Test org.apache.harmony.drlvm.tests.regression.h3216.ASETest FAILED
[junit] Test org.apache.harmony.drlvm.tests.regression.h3225.PositiveJsrTest FAILED
[junit] Test org.apache.harmony.drlvm.tests.regression.h3225.NegativeJsrTest FAILED
[junit] Test org.apache.harmony.drlvm.tests.regression.h3225.J9CompatibleJsrTest FAILED
[junit] Test org.apache.harmony.drlvm.tests.regression.h3228.H3228 FAILED
[java] Java Result: 134
[junit] Test org.apache.harmony.drlvm.tests.regression.h3283.JavaLibraryPathTest FAILED
[junit] Test org.apache.harmony.drlvm.tests.regression.h3285.Test FAILED
[junit] Test org.apache.harmony.drlvm.tests.regression.h3317.GetFieldDeclaringClassTest FAILED
[junit] Test org.apache.harmony.drlvm.tests.regression.h3341.StopThreadInWait FAILED
[junit] Test org.apache.harmony.drlvm.tests.regression.h3380.LongToBitsTest FAILED
[junit] Test org.apache.harmony.drlvm.tests.regression.h3382.Test FAILED
[java] Java Result: 134
[junit] Test org.apache.harmony.drlvm.tests.regression.h3404.H3404 FAILED
[junit] Test org.apache.harmony.drlvm.tests.regression.h3446.SubSubTest FAILED
[junit] Test org.apache.harmony.drlvm.tests.regression.h3505.GetFieldModifiersTest FAILED
[junit] Test org.apache.harmony.drlvm.tests.regression.h3582.Test FAILED
[junit] Test org.apache.harmony.drlvm.tests.regression.h3619.ObjectLongWaitTest FAILED
[junit] Test org.apache.harmony.drlvm.tests.regression.h3652.Test FAILED
[junit] Test org.apache.harmony.drlvm.tests.regression.h3658.Test FAILED
[junit] Test org.apache.harmony.drlvm.tests.regression.h3658.Test FAILED
[junit] Test org.apache.harmony.drlvm.tests.regression.h3691.Test FAILED
[junit] Test org.apache.harmony.drlvm.tests.regression.h3698.ExceptionLocation FAILED
[junit] Test org.apache.harmony.drlvm.tests.regression.h3716.Test FAILED
[junit] Test org.apache.harmony.drlvm.tests.regression.h3730.StepM2N FAILED
[junit] Test org.apache.harmony.drlvm.tests.regression.h3738.Test FAILED
[junit] Test org.apache.harmony.drlvm.tests.regression.h3751.Test FAILED
[junit] Test org.apache.harmony.drlvm.tests.regression.h3784.Test FAILED
[junit] Test org.apache.harmony.drlvm.tests.regression.h3816.Test FAILED
[junit] Test org.apache.harmony.drlvm.tests.regression.h3822.Test FAILED
[junit] Test org.apache.harmony.drlvm.tests.regression.h3862.SubrBounds FAILED
[junit] Test org.apache.harmony.drlvm.tests.regression.h3894.ThreadGroupChildren FAILED
[junit] Test org.apache.harmony.drlvm.tests.regression.h3908.InvokeTest FAILED
[junit] Test org.apache.harmony.drlvm.tests.regression.h3909.FinalizerThreadGroup FAILED
[junit] Test org.apache.harmony.drlvm.tests.regression.h3954.Test FAILED
[junit] Test org.apache.harmony.drlvm.tests.regression.h3982.EmptyStackTrace FAILED
[junit] Test org.apache.harmony.drlvm.tests.regression.h4073.Test FAILED
[junit] Test org.apache.harmony.drlvm.tests.regression.h4073.Test FAILED
[junit] Test org.apache.harmony.drlvm.tests.regression.h4267.UnresolvedArrayElem FAILED
[junit] Test org.apache.harmony.drlvm.tests.regression.h4511.GCTagged FAILED
[junit] Test org.apache.harmony.drlvm.tests.regression.h4512.GetCurrentThreadCpuTime FAILED
[junit] Test org.apache.harmony.drlvm.tests.regression.h4514.Test FAILED
[junit] Test org.apache.harmony.drlvm.tests.regression.h4514.Test FAILED
[junit] Test org.apache.harmony.drlvm.tests.regression.h4579.test FAILED
[junit] Test org.apache.harmony.drlvm.tests.regression.h4595.Test FAILED
[junit] Test org.apache.harmony.drlvm.tests.regression.h4596.Test FAILED
[junit] Test org.apache.harmony.drlvm.tests.regression.h4654.Test FAILED
[junit] Test org.apache.harmony.drlvm.tests.regression.h4675.DivLongTest FAILED
[junit] Test org.apache.harmony.drlvm.tests.regression.h4706.Test FAILED
[junit] Test org.apache.harmony.drlvm.tests.regression.h4751.Test FAILED
[junit] Test org.apache.harmony.drlvm.tests.regression.h4866.Test FAILED
[junit] Test org.apache.harmony.drlvm.tests.regression.h4874.Test FAILED
[junit] Test org.apache.harmony.drlvm.tests.regression.h4874.Test FAILED
[junit] Test org.apache.harmony.drlvm.tests.regression.h4979.AttachCurrentThread FAILED
[junit] Test org.apache.harmony.drlvm.tests.regression.h5021.Test FAILED
[junit] Test org.apache.harmony.drlvm.tests.regression.h5067.Test FAILED
[junit] Test org.apache.harmony.drlvm.tests.regression.h5094.InlinedStackTest FAILED
[junit] Test org.apache.harmony.drlvm.tests.regression.h5094.InlinedStackTest FAILED
[junit] Test org.apache.harmony.drlvm.tests.regression.h5094.InlinedStackTest FAILED
[junit] Test org.apache.harmony.drlvm.tests.regression.h5094.InlinedStackTest FAILED
[java] Java Result: 134
[java] Java Result: 134
[java] Java Result: 134
[java] Java Result: 134
[java] Java Result: 134
[java] Java Result: 134
[java] Java Result: 134
[junit] Test org.apache.harmony.drlvm.tests.regression.h5206.VolatileLongTest FAILED
[junit] Test org.apache.harmony.drlvm.tests.regression.h5206.VolatileLongTest FAILED
[junit] Test org.apache.harmony.drlvm.tests.regression.h5257.ProtectedInnerAccessTest FAILED
[junit] Test org.apache.harmony.drlvm.tests.regression.h788.Test FAILED
BUILD FAILED
/export/users/cc/cc-common/build/checkouts/hdk/working_vm/build/make/build.xml:578: The following
error occurred while executing this line:
/export/users/cc/cc-common/build/checkouts/hdk/working_vm/build/make/targets/reg.test.run.xml:108:
There were test failures
Total time: 7 minutes 13 seconds
The execution FAILED with the following exception:
The following error occurred while executing this line:
/export/users/cc/cc-common/adaptors/drlvm-reg-test/adaptor.xml:74: There were drlvm-reg-test
failures

***********************************************************
Unit Tests: (10)
        
failure: test org.apache.harmony.drlvm.tests.regression.h2196.LoopExcTest
failure: test org.apache.harmony.drlvm.tests.regression.h3256.InterruptTimedWaitingTest
failure: test org.apache.harmony.drlvm.tests.regression.h3382.TestX
failure: test org.apache.harmony.drlvm.tests.regression.h5201-0
failure: test org.apache.harmony.drlvm.tests.regression.h5201-1
failure: test org.apache.harmony.drlvm.tests.regression.h5201-2
failure: test org.apache.harmony.drlvm.tests.regression.h5201-3
failure: test org.apache.harmony.drlvm.tests.regression.h5201-4
failure: test org.apache.harmony.drlvm.tests.regression.h5201-5
failure: test org.apache.harmony.drlvm.tests.regression.h5201-6
Unit Test Error Details:	(10)
                
Test: testClass: org.apache.harmony.drlvm.tests.regression.h2196.LoopExcTestExit code: 134
Err: Exception raised while initializing helper class org/apache/harmony/drlvm/gc_gen/GCHelper
SIGABRT in VM code.
Stack trace:
  0: raise (??:-1)
  1: abort (??:-1)
addr2line: '[stack]': No such file
  2: ?? (bort:-1)
addr2line: '[stack]': No such file
  3: ?? (bort:-1)
  4: log4cxx::helpers::ObjectImpl::releaseRef() const (/export/users/cc/cc-common/build/checkouts/hdk/working_vm/build/pre-copied/common/LOG4CXX/src/objectimpl.cpp:40)
  5: ~synchronized (/export/users/cc/cc-common/build/checkouts/hdk/working_vm/build/pre-copied/common/LOG4CXX/src/synchronized.cpp:43)
  6: ~ObjectPtrT (/export/users/cc/cc-common/build/checkouts/hdk/working_vm/build/lnx_em64t_gcc_debug/semis/extra/log4cxx/src/include/log4cxx/helpers/objectptr.h:75)
  7: log4cxx::Hierarchy::shutdown() (/export/users/cc/cc-common/build/checkouts/hdk/working_vm/build/pre-copied/common/LOG4CXX/src/hierarchy.cpp:280)
addr2line: '[stack]': No such file
  8: ?? (og4cxx::Hierarchy::shutdown():-1)
  9: ?? (??:-1)
 10: ?? (??:-1)
addr2line: '[stack]': No such file
 11: ?? (og4cxx::Hierarchy::shutdown():-1)
addr2line: '[stack]': No such file
 12: ?? (og4cxx::Hierarchy::shutdown():-1)
 13: init_magic_helper_class (/export/users/cc/cc-common/build/checkouts/hdk/working_vm/vm/vmcore/src/jit/rt_helper_info.cpp:362)
 14: ?? (??:-1)
 15: ?? (??:-1)
 16: ?? (??:-1)
 17: ?? (??:-1)
<end of stack trace>
Test: testClass: org.apache.harmony.drlvm.tests.regression.h3256.InterruptTimedWaitingTestExit
code: 134 Err: Exception raised while initializing helper class org/apache/harmony/drlvm/gc_gen/GCHelper
SIGABRT in VM code.
Stack trace:
  0: raise (??:-1)
  1: abort (??:-1)
addr2line: '[stack]': No such file
  2: ?? (bort:-1)
addr2line: '[stack]': No such file
  3: ?? (bort:-1)
  4: log4cxx::helpers::ObjectImpl::releaseRef() const (/export/users/cc/cc-common/build/checkouts/hdk/working_vm/build/pre-copied/common/LOG4CXX/src/objectimpl.cpp:40)
  5: ~synchronized (/export/users/cc/cc-common/build/checkouts/hdk/working_vm/build/pre-copied/common/LOG4CXX/src/synchronized.cpp:43)
  6: ~ObjectPtrT (/export/users/cc/cc-common/build/checkouts/hdk/working_vm/build/lnx_em64t_gcc_debug/semis/extra/log4cxx/src/include/log4cxx/helpers/objectptr.h:75)
  7: log4cxx::Hierarchy::shutdown() (/export/users/cc/cc-common/build/checkouts/hdk/working_vm/build/pre-copied/common/LOG4CXX/src/hierarchy.cpp:280)
addr2line: '[stack]': No such file
  8: ?? (og4cxx::Hierarchy::shutdown():-1)
  9: ?? (??:-1)
 10: ?? (??:-1)
addr2line: '[stack]': No such file
 11: ?? (og4cxx::Hierarchy::shutdown():-1)
addr2line: '[stack]': No such file
 12: ?? (og4cxx::Hierarchy::shutdown():-1)
 13: init_magic_helper_class (/export/users/cc/cc-common/build/checkouts/hdk/working_vm/vm/vmcore/src/jit/rt_helper_info.cpp:362)
 14: ?? (??:-1)
 15: ?? (??:-1)
 16: ?? (??:-1)
 17: ?? (??:-1)
<end of stack trace>
Test: testClass: org.apache.harmony.drlvm.tests.regression.h3382.TestXExit code: 134 Err:
Exception raised while initializing helper class org/apache/harmony/drlvm/gc_gen/GCHelper
SIGABRT in VM code.
Stack trace:
  0: raise (??:-1)
  1: abort (??:-1)
addr2line: '[stack]': No such file
  2: ?? (bort:-1)
addr2line: '[stack]': No such file
  3: ?? (bort:-1)
  4: log4cxx::helpers::ObjectImpl::releaseRef() const (/export/users/cc/cc-common/build/checkouts/hdk/working_vm/build/pre-copied/common/LOG4CXX/src/objectimpl.cpp:40)
  5: ~synchronized (/export/users/cc/cc-common/build/checkouts/hdk/working_vm/build/pre-copied/common/LOG4CXX/src/synchronized.cpp:43)
  6: ~ObjectPtrT (/export/users/cc/cc-common/build/checkouts/hdk/working_vm/build/lnx_em64t_gcc_debug/semis/extra/log4cxx/src/include/log4cxx/helpers/objectptr.h:75)
  7: log4cxx::Hierarchy::shutdown() (/export/users/cc/cc-common/build/checkouts/hdk/working_vm/build/pre-copied/common/LOG4CXX/src/hierarchy.cpp:280)
addr2line: '[stack]': No such file
  8: ?? (og4cxx::Hierarchy::shutdown():-1)
  9: ?? (??:-1)
 10: ?? (??:-1)
addr2line: '[stack]': No such file
 11: ?? (og4cxx::Hierarchy::shutdown():-1)
addr2line: '[stack]': No such file
 12: ?? (og4cxx::Hierarchy::shutdown():-1)
 13: init_magic_helper_class (/export/users/cc/cc-common/build/checkouts/hdk/working_vm/vm/vmcore/src/jit/rt_helper_info.cpp:362)
 14: ?? (??:-1)
 15: ?? (??:-1)
 16: ?? (??:-1)
 17: ?? (??:-1)
<end of stack trace>
Test: testClass: org.apache.harmony.drlvm.tests.regression.h5201-0Exit code: 134 Err: Exception
raised while initializing helper class org/apache/harmony/drlvm/gc_gen/GCHelper
SIGABRT in VM code.
Stack trace:
  0: raise (??:-1)
  1: abort (??:-1)
addr2line: '[stack]': No such file
  2: ?? (bort:-1)
addr2line: '[stack]': No such file
  3: ?? (bort:-1)
  4: log4cxx::helpers::ObjectImpl::releaseRef() const (/export/users/cc/cc-common/build/checkouts/hdk/working_vm/build/pre-copied/common/LOG4CXX/src/objectimpl.cpp:40)
  5: ~synchronized (/export/users/cc/cc-common/build/checkouts/hdk/working_vm/build/pre-copied/common/LOG4CXX/src/synchronized.cpp:43)
  6: ~ObjectPtrT (/export/users/cc/cc-common/build/checkouts/hdk/working_vm/build/lnx_em64t_gcc_debug/semis/extra/log4cxx/src/include/log4cxx/helpers/objectptr.h:75)
  7: log4cxx::Hierarchy::shutdown() (/export/users/cc/cc-common/build/checkouts/hdk/working_vm/build/pre-copied/common/LOG4CXX/src/hierarchy.cpp:280)
addr2line: '[stack]': No such file
  8: ?? (og4cxx::Hierarchy::shutdown():-1)
  9: ?? (??:-1)
 10: ?? (??:-1)
addr2line: '[stack]': No such file
 11: ?? (og4cxx::Hierarchy::shutdown():-1)
addr2line: '[stack]': No such file
 12: ?? (og4cxx::Hierarchy::shutdown():-1)
 13: init_magic_helper_class (/export/users/cc/cc-common/build/checkouts/hdk/working_vm/vm/vmcore/src/jit/rt_helper_info.cpp:362)
 14: ?? (??:-1)
 15: ?? (??:-1)
 16: ?? (??:-1)
 17: ?? (??:-1)
<end of stack trace>
Test: testClass: org.apache.harmony.drlvm.tests.regression.h5201-1Exit code: 134 Err: Exception
raised while initializing helper class org/apache/harmony/drlvm/gc_gen/GCHelper
SIGABRT in VM code.
Stack trace:
  0: raise (??:-1)
  1: abort (??:-1)
addr2line: '[stack]': No such file
  2: ?? (bort:-1)
addr2line: '[stack]': No such file
  3: ?? (bort:-1)
  4: log4cxx::helpers::ObjectImpl::releaseRef() const (/export/users/cc/cc-common/build/checkouts/hdk/working_vm/build/pre-copied/common/LOG4CXX/src/objectimpl.cpp:40)
  5: ~synchronized (/export/users/cc/cc-common/build/checkouts/hdk/working_vm/build/pre-copied/common/LOG4CXX/src/synchronized.cpp:43)
  6: ~ObjectPtrT (/export/users/cc/cc-common/build/checkouts/hdk/working_vm/build/lnx_em64t_gcc_debug/semis/extra/log4cxx/src/include/log4cxx/helpers/objectptr.h:75)
  7: log4cxx::Hierarchy::shutdown() (/export/users/cc/cc-common/build/checkouts/hdk/working_vm/build/pre-copied/common/LOG4CXX/src/hierarchy.cpp:280)
addr2line: '[stack]': No such file
  8: ?? (og4cxx::Hierarchy::shutdown():-1)
  9: ?? (??:-1)
 10: ?? (??:-1)
addr2line: '[stack]': No such file
 11: ?? (og4cxx::Hierarchy::shutdown():-1)
addr2line: '[stack]': No such file
 12: ?? (og4cxx::Hierarchy::shutdown():-1)
 13: init_magic_helper_class (/export/users/cc/cc-common/build/checkouts/hdk/working_vm/vm/vmcore/src/jit/rt_helper_info.cpp:362)
 14: ?? (??:-1)
 15: ?? (??:-1)
 16: ?? (??:-1)
 17: ?? (??:-1)
<end of stack trace>
Test: testClass: org.apache.harmony.drlvm.tests.regression.h5201-2Exit code: 134 Err: Exception
raised while initializing helper class org/apache/harmony/drlvm/gc_gen/GCHelper
SIGABRT in VM code.
Stack trace:
  0: raise (??:-1)
  1: abort (??:-1)
addr2line: '[stack]': No such file
  2: ?? (bort:-1)
addr2line: '[stack]': No such file
  3: ?? (bort:-1)
  4: log4cxx::helpers::ObjectImpl::releaseRef() const (/export/users/cc/cc-common/build/checkouts/hdk/working_vm/build/pre-copied/common/LOG4CXX/src/objectimpl.cpp:40)
  5: ~synchronized (/export/users/cc/cc-common/build/checkouts/hdk/working_vm/build/pre-copied/common/LOG4CXX/src/synchronized.cpp:43)
  6: ~ObjectPtrT (/export/users/cc/cc-common/build/checkouts/hdk/working_vm/build/lnx_em64t_gcc_debug/semis/extra/log4cxx/src/include/log4cxx/helpers/objectptr.h:75)
  7: log4cxx::Hierarchy::shutdown() (/export/users/cc/cc-common/build/checkouts/hdk/working_vm/build/pre-copied/common/LOG4CXX/src/hierarchy.cpp:280)
addr2line: '[stack]': No such file
  8: ?? (og4cxx::Hierarchy::shutdown():-1)
  9: ?? (??:-1)
 10: ?? (??:-1)
addr2line: '[stack]': No such file
 11: ?? (og4cxx::Hierarchy::shutdown():-1)
addr2line: '[stack]': No such file
 12: ?? (og4cxx::Hierarchy::shutdown():-1)
 13: init_magic_helper_class (/export/users/cc/cc-common/build/checkouts/hdk/working_vm/vm/vmcore/src/jit/rt_helper_info.cpp:362)
 14: ?? (??:-1)
 15: ?? (??:-1)
 16: ?? (??:-1)
 17: ?? (??:-1)
<end of stack trace>
Test: testClass: org.apache.harmony.drlvm.tests.regression.h5201-3Exit code: 134 Err: Exception
raised while initializing helper class org/apache/harmony/drlvm/gc_gen/GCHelper
SIGABRT in VM code.
Stack trace:
  0: raise (??:-1)
  1: abort (??:-1)
addr2line: '[stack]': No such file
  2: ?? (bort:-1)
addr2line: '[stack]': No such file
  3: ?? (bort:-1)
  4: log4cxx::helpers::ObjectImpl::releaseRef() const (/export/users/cc/cc-common/build/checkouts/hdk/working_vm/build/pre-copied/common/LOG4CXX/src/objectimpl.cpp:40)
  5: ~synchronized (/export/users/cc/cc-common/build/checkouts/hdk/working_vm/build/pre-copied/common/LOG4CXX/src/synchronized.cpp:43)
  6: ~ObjectPtrT (/export/users/cc/cc-common/build/checkouts/hdk/working_vm/build/lnx_em64t_gcc_debug/semis/extra/log4cxx/src/include/log4cxx/helpers/objectptr.h:75)
  7: log4cxx::Hierarchy::shutdown() (/export/users/cc/cc-common/build/checkouts/hdk/working_vm/build/pre-copied/common/LOG4CXX/src/hierarchy.cpp:280)
addr2line: '[stack]': No such file
  8: ?? (og4cxx::Hierarchy::shutdown():-1)
  9: ?? (??:-1)
 10: ?? (??:-1)
addr2line: '[stack]': No such file
 11: ?? (og4cxx::Hierarchy::shutdown():-1)
addr2line: '[stack]': No such file
 12: ?? (og4cxx::Hierarchy::shutdown():-1)
 13: init_magic_helper_class (/export/users/cc/cc-common/build/checkouts/hdk/working_vm/vm/vmcore/src/jit/rt_helper_info.cpp:362)
 14: ?? (??:-1)
 15: ?? (??:-1)
 16: ?? (??:-1)
 17: ?? (??:-1)
<end of stack trace>
Test: testClass: org.apache.harmony.drlvm.tests.regression.h5201-4Exit code: 134 Err: Exception
raised while initializing helper class org/apache/harmony/drlvm/gc_gen/GCHelper
SIGABRT in VM code.
Stack trace:
  0: raise (??:-1)
  1: abort (??:-1)
addr2line: '[stack]': No such file
  2: ?? (bort:-1)
addr2line: '[stack]': No such file
  3: ?? (bort:-1)
  4: log4cxx::helpers::ObjectImpl::releaseRef() const (/export/users/cc/cc-common/build/checkouts/hdk/working_vm/build/pre-copied/common/LOG4CXX/src/objectimpl.cpp:40)
  5: ~synchronized (/export/users/cc/cc-common/build/checkouts/hdk/working_vm/build/pre-copied/common/LOG4CXX/src/synchronized.cpp:43)
  6: ~ObjectPtrT (/export/users/cc/cc-common/build/checkouts/hdk/working_vm/build/lnx_em64t_gcc_debug/semis/extra/log4cxx/src/include/log4cxx/helpers/objectptr.h:75)
  7: log4cxx::Hierarchy::shutdown() (/export/users/cc/cc-common/build/checkouts/hdk/working_vm/build/pre-copied/common/LOG4CXX/src/hierarchy.cpp:280)
addr2line: '[stack]': No such file
  8: ?? (og4cxx::Hierarchy::shutdown():-1)
  9: ?? (??:-1)
 10: ?? (??:-1)
addr2line: '[stack]': No such file
 11: ?? (og4cxx::Hierarchy::shutdown():-1)
addr2line: '[stack]': No such file
 12: ?? (og4cxx::Hierarchy::shutdown():-1)
 13: init_magic_helper_class (/export/users/cc/cc-common/build/checkouts/hdk/working_vm/vm/vmcore/src/jit/rt_helper_info.cpp:362)
 14: ?? (??:-1)
 15: ?? (??:-1)
 16: ?? (??:-1)
 17: ?? (??:-1)
<end of stack trace>
Test: testClass: org.apache.harmony.drlvm.tests.regression.h5201-5Exit code: 134 Err: Exception
raised while initializing helper class org/apache/harmony/drlvm/gc_gen/GCHelper
SIGABRT in VM code.
Stack trace:
  0: raise (??:-1)
  1: abort (??:-1)
addr2line: '[stack]': No such file
  2: ?? (bort:-1)
addr2line: '[stack]': No such file
  3: ?? (bort:-1)
  4: log4cxx::helpers::ObjectImpl::releaseRef() const (/export/users/cc/cc-common/build/checkouts/hdk/working_vm/build/pre-copied/common/LOG4CXX/src/objectimpl.cpp:40)
  5: ~synchronized (/export/users/cc/cc-common/build/checkouts/hdk/working_vm/build/pre-copied/common/LOG4CXX/src/synchronized.cpp:43)
  6: ~ObjectPtrT (/export/users/cc/cc-common/build/checkouts/hdk/working_vm/build/lnx_em64t_gcc_debug/semis/extra/log4cxx/src/include/log4cxx/helpers/objectptr.h:75)
  7: log4cxx::Hierarchy::shutdown() (/export/users/cc/cc-common/build/checkouts/hdk/working_vm/build/pre-copied/common/LOG4CXX/src/hierarchy.cpp:280)
addr2line: '[stack]': No such file
  8: ?? (og4cxx::Hierarchy::shutdown():-1)
  9: ?? (??:-1)
 10: ?? (??:-1)
addr2line: '[stack]': No such file
 11: ?? (og4cxx::Hierarchy::shutdown():-1)
addr2line: '[stack]': No such file
 12: ?? (og4cxx::Hierarchy::shutdown():-1)
 13: init_magic_helper_class (/export/users/cc/cc-common/build/checkouts/hdk/working_vm/vm/vmcore/src/jit/rt_helper_info.cpp:362)
 14: ?? (??:-1)
 15: ?? (??:-1)
 16: ?? (??:-1)
 17: ?? (??:-1)
<end of stack trace>
Test: testClass: org.apache.harmony.drlvm.tests.regression.h5201-6Exit code: 134 Err: Exception
raised while initializing helper class org/apache/harmony/drlvm/gc_gen/GCHelper
SIGABRT in VM code.
Stack trace:
  0: raise (??:-1)
  1: abort (??:-1)
addr2line: '[stack]': No such file
  2: ?? (bort:-1)
addr2line: '[stack]': No such file
  3: ?? (bort:-1)
  4: log4cxx::helpers::ObjectImpl::releaseRef() const (/export/users/cc/cc-common/build/checkouts/hdk/working_vm/build/pre-copied/common/LOG4CXX/src/objectimpl.cpp:40)
  5: ~synchronized (/export/users/cc/cc-common/build/checkouts/hdk/working_vm/build/pre-copied/common/LOG4CXX/src/synchronized.cpp:43)
  6: ~ObjectPtrT (/export/users/cc/cc-common/build/checkouts/hdk/working_vm/build/lnx_em64t_gcc_debug/semis/extra/log4cxx/src/include/log4cxx/helpers/objectptr.h:75)
  7: log4cxx::Hierarchy::shutdown() (/export/users/cc/cc-common/build/checkouts/hdk/working_vm/build/pre-copied/common/LOG4CXX/src/hierarchy.cpp:280)
addr2line: '[stack]': No such file
  8: ?? (og4cxx::Hierarchy::shutdown():-1)
  9: ?? (??:-1)
 10: ?? (??:-1)
addr2line: '[stack]': No such file
 11: ?? (og4cxx::Hierarchy::shutdown():-1)
addr2line: '[stack]': No such file
 12: ?? (og4cxx::Hierarchy::shutdown():-1)
 13: init_magic_helper_class (/export/users/cc/cc-common/build/checkouts/hdk/working_vm/vm/vmcore/src/jit/rt_helper_info.cpp:362)
 14: ?? (??:-1)
 15: ?? (??:-1)
 16: ?? (??:-1)
 17: ?? (??:-1)
<end of stack trace>

***********************************************************
Modifications since last successful build:	(2)
            
add cc-hdk log20071205202829Lbuild.452 12/05/2007 20:28:29hdk
add cc-hdk log20071205202829Lbuild.452 12/05/2007 20:28:29hdk

begin 644 execution_log.zip
M4$L#! H    ( -:JA3<APJ3VJA@  -4?!  2    97AE8W5T:6]N7VQO9RYH
M=&UL[=WO;YO(G\#QY_TKD+XZ;3;:8+"-?UVWJS3M-HF:MFJRO3U5E47PQ*;%
M8 %.DWUP?_O-@).&Q. TQB%KOZ/6L>.!^3 S#"^&P7X^BL?>B^>GP>#RQ?-)
M*%X\M[4HOO3$[[^<!7Z\$[G_B)[6,?[KOW]Y\6PZ&=BQV(G._=ZS9SOI*_DL
MG,K7FJ9]'@A/Q.*+]DK]=OVA9AI=[<SU1*2=A<%8JXF+21#&M6DDPJCF./+?
MCA.,QX%?.YVZWJ 6BFCJQ5%M$'KGXYU0#'=B$<5JW7+M7^US^XOV4B54Z^QI
M8_N;2!?4+\9>)E7FA8QW9R #<^)><:))&$P*DHB+6(1^?R!N)4J?"V<4R.=_
M16K#]][N'A^_/7BI_;YXHYV1<+X%4[G9H\&WVO<@_";7T'<\.XH\]S0_G'23
M]"#2[= 9Z<[%A>Z<#0OB=WTWUJ>^>[$HS7?77Y1$;H%L+5$D!OHX&(BB@A6Q
M'HFQ&^D#-XP6)$R+V/:*TDV\Z=#U==N/'=E"0_=T<5IG,HGMZ%O16M56Y5?K
M7N"?N<-I:,=NX!?4OOK9#Z*D\1_*MV7]F[JE&WVY(VP=3WWMR'7"(+J,8C&.
MM /?T7\M7-E5*]#"((A+;DQW O_Q$T0RK[>N/[VXWQ*J <HEQ+C5C.^9AVRN
M<HFAX]PW_=E0IA^(T^FP> FY(VNA.'<C65-RB99A-IJ-19FHYASXPH^C)).)
M%UPNC&MTJ?N!'KDJKC/99$7A$C*U%SBVI_^CJG/>$ID7LN_35=]7T&)5S+(?
MO.XF(]E_B8D=BKOM\_/XF]SY9#,.A>RR!YI\T7MH6SH?S][V_(M^4N-]68O]
MI&9J21RUJ^#E6E7#$]'3"<B7>_!Y0;G?+=2O!56P:%'Y]UN5\5FV _7447V*
M2I\>)BTM"J:A(V9'RSBHK'86;%):?D^HA:4!U?8-^5/K!Z=?[^Z%\I4CR]N4
MQ1K;WH\B/A57&SC0<Y<ZCNTPZ<YE37TKWE_%^%0=#FW?/;NSYSZ),JJ;EDD9
M+2BC3K=+&2THHVZ]11D5EU'#J+<IHT5EU&Y21@O*R&QP7%M41@V3?6UA&34Y
M]B\JHZ9!?[2HC"S#HHP6E%&KVZ&,%I11F^/:XC+JT!\M*J-.ES):5$9=@W/:
MA674J5-&Q674M$P,N;B,:$>+RJC;IC]:4$:647_*^UKFA6=/?6>47B%X0D49
M"I7%W8M/5Y?E%E[A^_T^/PO7<B*#D9M]^.EH-9N=7JZL?97IOX:B=NKZ-17,
M(VW=PTHWG24A+AQO.D@O>CW\XK8LG"ATDMI7E:]F);ARD=G*HZLGNJ>N9^L7
MG5:_U=067,-?M''_T5ZG:QW(O<ZQ9<1:<*;M[WX\>O_N?W>:]9:5N^B^V;&Z
MBU>LQ2-7[M5RHZYS.'[_6AO9_B"Y9BC?](-8[J?VX%(["T)MMF&NKQT>G-0^
M'6F7(O]:_'YAB/])VJSFA'8TDEU+X*NLB];5K3]\)\LM[VQ_-/5W[EX/3Y].
M?3?^HGV<^KXJF" <ZO;$EFU%']FA;#R7>C*=*.T4]!\M1!^I:X;Z*S<43OSR
M,A8OIV=G(CRY/>/H9B:R<L1$S0'10MN-9.U_'ZFVJR:/N+;G_J,"& EO(L)T
MZH:*II9&4YM%DTYNJ@V=_E#XM3=[^TGRW!R/#][LOOQXHNI5UJD3R(:<GS:V
MG6]:'-K.O"NTLT2:9O32Z+6M/_[H[9AW9Z#\2&KV-/M4[I,+D]J#05B7#5/T
MM%\^1RJ.+[_TM'>!%DV=4;*#%^12[VE__*%MJ8Q6ETGCGIEH6K.G><&PZ5Q<
M]'II94:]WOO3K[*9'(PG7J\7"D_8D?@HSK9^E57BRWUE:]F>?1(*F7[B"IDR
M7>SM^S?-O;__3CJW(,G=E;FKN4R]IE$4O]73_B^ZE$?D,/#=?V0C77%P-_-*
MPVL4A=>2X:6E^2$.3Y8/;MXQ,9EP)E<L]X7:K"Z34%T_Z5RO_S:KWEGY3N)0
M'_7:5E'T[1N-8]\5H9KZ=-GK1:-I/ B^^[)!K+BT1U>9)D5=[Q0TA:7VETZZ
MOQ1NZX(=J9NN8E$O8QKW2K?,UICFLENS5.[UI<O2E-V7.LKTQ_;0=?IINTWG
M]2W3X))_3B#9J)K65U<**KY:N>N?!4D;:[3J19$U[UG+UCW3M>Z9KGVO=,^%
M/U VBWX<&U_D)D[84P8@M#]W#]Z^?O7(GC&M=D=_9[^#,! &PD 8" -ARLH=
MPJPG86Z:89Y:;J[[(21I64U]7SV"$E "2D )* $E9>4.2M84)1DU5#28TFYV
M] ,_/MMU'/DW^ )?X M\@2_PI:S<X<N:\N4N':HR3*>CVZ?. +V@%_2"7M +
M>BDK=_2RKGJY@8957!+J&(;^^D(XH 24@!)0 DI 25FY@Y(U1<E--#Q\,.7.
M1Q0_ZL=@UG*-<KW U=UK:H/KM2,W^83=9/&2"5;7__+EZ\ [%X,/=FB/T1@:
M0V-H#(VAL;)R1V-KJ[&Y?L@9+?I7JNM$=NW?[5-/K)Q?^^J>?FX\SR0%8  ,
M@ $P  ; \B(#8',$4=%$HT[3T(_584*^!62 #) !,D &R)25.Y!95\C<@L-*
M)AR!$W "3L ). $G*\@=G&PP3AYC<,6JZZ_<\P,?O: 7]()>\J)'+^@%O:"7
M>6S8C$G35OLQIN]8;1V)(3$DAL20&!(K*W<DMK822\%0U?A1R\0K> 6OX)6\
MZ/$*7L$K>"4+AI5,QFDU]'WUB$@0"2)!)(@$D925.R)96Y'<4$,UPRAUPVKK
MQ[(+!B[ !;@ %^ "7,K*';BL)UPR:-B$*3AUH],H_MQ"[;-P1L$-@OG:X>N3
M<J76:7#!"Z6A-)26%SU*0VDH#:5EP9!WP6N.6=Y_P"PWTV*6_$PP"V;!+)@%
MLV"6O,2/81;7CT4H=_&XX*"/7?*Z%.R"7; +=L$NV 6[W$Q<JET>8R9/IXE7
M\ I>P2MYT>,5O()7\$H6#"NX(4JNNP5&P @8 2-YT8,1, )&P$@6#%4-GG3K
M> 6OX!6\DA<]7L$K> 6O9,&PDL$3,))-"D; "!@!(V $C.1%!D96@Q'38!IL
M)BD8 2-@!(R $3"2%]DF8^0*#!5=R3%-O)))BE?P"E[!*W@%K^1%MM%>,:OU
MBF7JGXX.Y/(F;($ML 6VP!;84E;NL&5=V9)UPQ)ZN?.9*C\31;>EOPV"B=3)
M7+U</3^4C]I'$4V]N"=;5#,WB.WM[=FFJ*?;6F^9<+0MF94F+MPXX<NO#RF=
M96Q7M[KZOGI$=:@.U:$Z5(?J4!VJ6RR&BD:CZBU3_[CWFI$HS()9, MFP2QE
MY8Y9UM4L/\Q0D5H:#4L_5@<&^=9;]U2VJ\L/=CQ",2@&Q: 8%(-BRLH=Q:RI
M8@H,L1%?<=EJ-FO'4]E:]M3".5]SN0S29 ;ZRR"(55$,;24O?(;/\!D^PV?X
MK*S<\=F:^FP^'RH:<&JUN_JKZ03  !@  V  #( I*W< LZZ ^6&&BM32;G:X
M-1ZR0!;(DA<]9($LD 6R9,%0E5?:#?W /U,-XQ*WX!;<@EMP"VXI*W?<LJYN
MN06'57PN<L?HZ#('7()+< DNP26XI*S<<<F:NN2&&59"DF9+?Q=\$J%[QG@)
M+L$EN"0O>ER"2W )+ID/AXJN]W3:#?VC&$,7Z )=H MT@2YEY0Y=UI4N/\Q0
MF5J:S*J%+) %LN1%#UD@"V2!+%DP5.65;E<_LOW+W7 8X1;<@EMP"V[!+67E
MCEO6U2VWX%#F5T[YVN'!2:G,Z=9;#,O &W@#;_*BAS?P!M[ FRP8\F;FSC&+
MZ\<BE+MX7'#0QRYY70IVP2[8!;M@%^R"76XF+M4NJ[^DU##J;7U7,D)]<0)N
MP2VX!;?@%MQ25NZX93W=<@<.F_!-2PVCV:D=75Y3J/RO6E(YZ/OJ$8@!,2 &
MQ( 8$ -B0&RQ&%;PN30-H]7F<A8:02-H)"]Z-()&T @:R8*AJLM9W-&=38I7
M\ I>P2MX!:_D1;;17JGTCNZ&T>WHAU'X+O@H8MR"6W +;L$MN*6LW''+NKKE
M%AQ6<O$'G( 3< ).P DX64'NX&2#<?((@RNF:>A_NL(;@!?P E[ "W@!+V7E
M#E[6%"\9-50EE[JI[ZM'U():4 MJ02VH!;6@EL5BJ$HL#4/?LSWOG1V[YX(!
M%^@"7: +=($N9>4.7=:5+G?HL!&?)6-:1KK<29 $*W(^36;.AQ>__U#J%RZH
M4+AK"K)!-LB6%SUD@VR0#;)EP5#N]TB5SIJV!6M@#:R!-7G1PQI8 VM@318,
M%5U#JYLM???X-62!+) %LD 6R%)6[I!E3<ERPPQ5J:5NZ1^"R%47[PZC$+V@
M%_2"7M +>BDK=_2RKGJY:X=5?)"-RN:=&-H0!:) %(@"42 *1($H#[3#JHAR
MV-T+QA.9TZD'4VXEA2DP!:; %)@"4_(BVW2FS/%#9=>$U'=2RD?\@E_P"W[!
M+_@%O^"7Q6(H\Y:BG\G?:ND'?BS"<#J)3]RQ&/R/[:H;R.>.PEP]/Y2/VD<1
M3;VX)UM6,S>D[>WMV8:II]M:K[S@M"V9L28NW#A!S:\/*;FEK-=IZ*H<WKJG
M<E^\_&#'(T:ND!_R0W[(#_F5E3OR6U?YS?=#52-7'>X9SR2%+_ %OL 7^ )?
M\B+;;+Y4>L]XPVSK;T2<?&'%*R%;0RC7L)=\K""*03$H!L6@&!2#8E#,PQE1
ME6V:IGX<!Y.342CLP8&O+GHA&D2#:! -HD$TB ;1_!0>JG),Q]#?!O[P)'CI
MQHS+H!@4@V+RHD<Q* ;%H)@\.E1FF#KS8I +<D$N>=$C%^2"7)!+%@QY'Y:S
MS,U:5^O^>\Y:T^>']J/<F'4=2-4W836-IKZO'O$9/L-G^ R?X3-\AL\6BZ&B
M :5FLZ4?3T_E/X:58 ML@2VPY9'8LA0(C$HYLC2&$M$\48XT[LF'I+NT!Y5L
M@574T]P32DNU@"MC+2:6M$;@G8M,,:V^@ H[,U/NX[,ETJA42UQY3$VC7123
M[#3.QTDDYI8:-_MTU$\^;,BWO>W?M/0O!_+=W7 8;2_5VV:C53G69CDG<7:-
MHMVC+GN>PW<'_;U0V+%(PRJQZ'Q7_4_+J]LMBL-4'<AYX-@)2[=TO19):<IC
MQ]AV?=WIM=J%FR'[G^'D0QC$\O@G!D=RF3GK:'2+]K.Z["G&MQ9T9DN:S5;1
MDK+OZ/<]]]3IRQTO5+V@6DVU9R*9,X&*3D<LP[J^ >(H&+AG\LC"5#W.3#@S
MX<PD+WK.3!A094#UUIG)Q@ZHY@IB%5\78S$=+YL4G: 3=().T DZR8MLHW6R
M8#K>,AAIF5T][2?5K0KJ1DMH DV@"32!)M"DK-RAR9K29#X?*KH.U+(86,DD
M12_H!;V@%_2"7O(BVVB]6/D#*X_BE0Y>P2MX!:_D18]7\ I>P2M9,*SD0A 8
MR28%(V $C( 1, )&\B(#(]4-GG1-O()7\ I>R8L>K^ 5O()7LF"HS"L=_9HD
M;V=WH(,7\ )>P MX 2_@!;S\G!XJDDS;;#'R E[ "WC)BQZ\@!?P EZR8*C*
M*PU#/X[%Y*C^#K) %L@"62 +9($LD.4^9JA,+<S'S22%+) %LD 6R )9\B+;
M;+)4.A^W;3$?-Y,4K^ 5O()7\ I>R8MLH[UB53H?M]UIXA6\@E?P2E[T> 6O
MX!6\D@5#15[I,.LVFQ2OX!6\@E?P"E[)BVR3O=(IF'5[<\4/PDB=3]K/) 4C
M8 2,@!$P D;R(MMHC-0K_:3]3JNN'T]/PY?!U!]$J 6UH!;4@EI0"VI!+?=D
M0U5VZ3;UDU$H[,&;,)A.]B1)!J'@H^- #(@!,2 &Q( 8$//3?EC%9:&NT=$/
M_//@F^#B$$)!* @%H2"4LG)'*&LJE"P;*AIFZ1I=_4_75_X0X0TOH1@4@V)0
M#(I!,2@&Q?PT(*KRC,7]S9FD^ 6_X!?\@E_P2UYD&^T7J]+[F[N=NOYZ/(DO
MDR/_B=HXZ )=H MT@2[0!;I EY^Q0S6*:1KM!J,NT 6Z0)>\Z*%+V719"@5&
MI219&D2):IXH21KW)$327=J#2K; *NII[HFEI5K E;,6,TLJ(_#.1::85E] 
MA9V9*??QV1)I5*HEKCPFJ:RBF&2G<3Y.(C&W#N7[GX[Z!WXL0M_VMG_3TK\<
MR'=WPV&TO51OFXU6Y5B;Y9S$V36*=H^Z['D.WQWT]T)AQR(-J\2B\UWU/RVO
M;K<H#E-U(.=7WRF^I>NU2$I3'CO&MNOK3J_5+MP,V?\,)Q_"();'/S$XDLO,
M64>C6[2?U65/,;ZUH#-;TFRVBI:4?4>_[[FG3E_N>*'J!=5JJCP;N3X'6,$,
M>\XO.+_0.+_@_(+S"X9&&1IE:'0IC-QO//3S0!Y,8O%%>Z5^RVKI::OH$)/8
M:S+V="MJ2<L1LN/+\\GU K.-K8V:]5:[]E&,@W-Q)/1D!:7B2ZY>_\N?G88-
M=L/0OGSMB3$6PV)8#(MA,2R&Q;#8S_JAHDO5EFGJ;_9.[.%0#" ,A($P$ ;"
M0!@( V'NA8;*W%+7WXAX;QJ&PH_3&RWW)M,3=\P- S &QL 8& -C8 R,>9 A
M*E,-']>020IA( R$@3 0!L+D1;;9A,G_N(:;*P8C>7T$& $C8 2,@!$P D9N
M)BX5(X\Q>-+N)G_&*W@%K^ 5O()7\ I>60B&JKS2M1A?P2MX!:_D18]7\ I>
MP2M9,%3FE19>P2MX!:_D18]7\ I>P2M9,*QB<DJ++S;+)@4C8 2,@!$P D;R
M(MMDC+0J_6*S9JMMZ:_<\[>!/X0ML 6VP!;8 EO*RAVVK"M;LFY8Q5!*V^"Z
M3B8I)L$DF 238!),DA?9)IOD"@P5#:6T+1.OX!6\@E?RHL<K> 6OX)4L&"KR
M2J?%^$HF*5[!*W@%K^ 5O)(7V29[Y0H,57FES=3:3%*\@E?P"E[!*W@E+[*-
M]DI[=1]""T9N)04C8 2,@!$P D;R(@,CE0V>=-M=?3>66S;*?*T0?($O\ 6^
MP)='X,M2,# J9<G2*$ID\T19TK@G(Y+NTAY4L@5644]S3S MU0*NK+686A(=
M@7<N,L6T^@(J[,Q,N8_/EDBC4BUQY3$UC7913++3.!\GD9A;A_+]3T?] S\6
MH6][V[]IZ5\.Y+N[X3#:7JJWS4:K<JS-<D[B[!I%NT==]CR'[P[Z>]*+L4C#
M*K'H?%?]3\NKVRV*PU0=R'G@V E+MW2]%DEIRF/'V'9]W>FUVH6;(?N?X>1#
M&,3R^"<&1W*9.>MH=(OVL[KL*<:W%G1F2YK-5M&2LN_H]SWWU.G+'2]4O:!:
M3:5G)#FG!"L8+;6,.E/C,TDYW>!T@],-3C<8+66T-"^R#1XMO09#-:.EEM%J
MXQ6\@E?P2E[T> 6OX!6\D@5#55[I-O4#7[7*07+LQR[8!;M@%^R"7<K*';NL
MJUWFX&$E%X% 2GY2D )20 I( 2D@)2\RD )20 I( 2D@96V1PB3YIXD/)LDS
M29Y)\GEQ,DG^QSK6:9(\YQV<=W#>P7D'YQWK?M[!X"B#H_,HOTZ#H_><B9:\
M"+]H+U6M*4O(5SUM%1UDLBTUN2WI5M62EB2BY.]6W3!W#%WF?3? S\(9!0^#
M5K+6.6M,GRNY:Q]%-/7BGFSMS=RLM[>W9R6LGFYKO9\/0MN2&6CB0IYD*5#=
M;3Q/J![,E=2#^13JP?PWU4-])?50?PKU4/\WU4-C)?70> KUT/@WU4-S)?4P
MKW@?O1Z:_Z9ZL%92#]93J ?KWU0/K9740^LIU$-K43U\'@A/Q.*+]DK]EMLI
MZR >3VICVW?/Y#IWU&H>XN%EQO7J1DO_%'AV+$_-KKXLFW$]QO48UV-<CW$]
MQO48UV-<[Z?PL(J+CR %I&13@A20DAL]2&'2(Y,>;R&%28],>F32(Y,>UV'2
MXZ.==UAM_;K<#WQ?A+N.(]_E_(/S#\X_./_@_(-!TK)R9Y!T70=)"Q"Q K2T
M.QT^&AB?X!-\DA<]/L$G^ 2?9+RP\'Z,L?U-[(1"U5+VR)SFG+XC\P]M/SH+
MPK$F^WK9TDRS:8ZC.^%>S;O[_9X_N2OX>+TMFMHXI9<T%.V['<DBDPUC()O=
MG+M(RHK@,292IILD5Q"/O7*W)/,BB516LIHO&?7RT[W\Z^#MJWDM9MFR4(TL
M?:I?C+V>U99=^,E(:&>!YP7?5>6*, Q"+7 <]9U@5W@5%\*9)G4?C]Q(2_JX
M\N.*[7 H;E2+'D[])$S32,,,A?9=/:@WM3/;]::R*/-+\22(;6^VF[2UL>M/
MY8*RF]0B(44VR"ZIAJ]_S&2=O24/L9=?M#WYJ+;=-))./-+B8/$&SRHYI;RL
M\F$RN?39K$']XTYNS!>6K^XQ7WC^&OMUPVB;=</JUTW3TN6JGCU3-3JK,KG;
MSJ;=?G?CD:R^3%U?G:KTGCVT$11$;0_LB>P>;@=\]?>D9MO-3,5F4_ZHXN<U
M^\5SA1[Y>!H,+N4OM:>^^']02P$"% ,*    " #6JH4W(<*D]JH8  #5'P0 
M$@              I($     97AE8W5T:6]N7VQO9RYH=&UL4$L%!@     !
-  $ 0    -H8      $! 
end

Mime
View raw message