harmony-alerts mailing list archives

Site index · List index
Message view « Date » · « Thread »
Top « Date » · « Thread »
From nom...@intel.com
Subject [build-test alert] FAILED Linux x86_64: drlvm-reg-test debug
Date Tue, 04 Dec 2007 15:38:45 GMT

BUILD FAILED:
	Ant Error Message:
/export/users/cc/cc-common/scripts/cc-exec-adaptor.xml:104: The following error occurred while
executing this line: /export/users/cc/cc-common/adaptors/drlvm-reg-test/adaptor.xml:74: There
were drlvm-reg-test failures

Date of build:	2007-12-04 21:36:14 +0600
Time to build:	2 minutes 24 seconds
Last changed:	12/04/2007 18:49:58
Last log entry:	hdk

***********************************************************
Errors/Warnings:	(119)
            
[junit] Test org.apache.harmony.drlvm.tests.regression.h0000.DirectByteBufferTest FAILED
[junit] Test org.apache.harmony.drlvm.tests.regression.h1578.NaNTest FAILED
[junit] Test org.apache.harmony.drlvm.tests.regression.h1654.H1654Test FAILED
[junit] Test org.apache.harmony.drlvm.tests.regression.h1748.IntfAccessTest FAILED
[junit] Test org.apache.harmony.drlvm.tests.regression.h1788.abcdTest FAILED
[junit] Test org.apache.harmony.drlvm.tests.regression.h1800.ExecTest FAILED
[junit] Test org.apache.harmony.drlvm.tests.regression.h1802.UnresolvedParamTest FAILED
[junit] Test org.apache.harmony.drlvm.tests.regression.h1802.UnresolvedHandlerTest FAILED
[junit] Test org.apache.harmony.drlvm.tests.regression.h1840.SimplestTest FAILED
[junit] Test org.apache.harmony.drlvm.tests.regression.h1840.SimplestTest FAILED
[junit] Test org.apache.harmony.drlvm.tests.regression.h1852.DivIntTest FAILED
[junit] Test org.apache.harmony.drlvm.tests.regression.h1857.Test FAILED
[junit] Test org.apache.harmony.drlvm.tests.regression.h1861.Test FAILED
[junit] Test org.apache.harmony.drlvm.tests.regression.h1863.H1863Test FAILED
[junit] Test org.apache.harmony.drlvm.tests.regression.h2057.SyncTest FAILED
[junit] Test org.apache.harmony.drlvm.tests.regression.h2083.Test FAILED
[junit] Test org.apache.harmony.drlvm.tests.regression.h2083.Test FAILED
[junit] Test org.apache.harmony.drlvm.tests.regression.h2084.Test FAILED
[junit] Test org.apache.harmony.drlvm.tests.regression.h2086.Test FAILED
[junit] Test org.apache.harmony.drlvm.tests.regression.h2092.Test FAILED
[junit] Test org.apache.harmony.drlvm.tests.regression.h2092.Test FAILED
[junit] Test org.apache.harmony.drlvm.tests.regression.h2103.Test FAILED
[junit] Test org.apache.harmony.drlvm.tests.regression.h2113.Test FAILED
[junit] Test org.apache.harmony.drlvm.tests.regression.h2151.VMInit1Test FAILED
[java] Java Result: 1
[junit] Test org.apache.harmony.drlvm.tests.regression.h2259.H2259 FAILED
[junit] Test org.apache.harmony.drlvm.tests.regression.h2261.RCETest FAILED
[junit] Test org.apache.harmony.drlvm.tests.regression.h2335.SimplestLibraryPathTest FAILED
[junit] Test org.apache.harmony.drlvm.tests.regression.h2644.BootDelegationTest FAILED
[junit] Test org.apache.harmony.drlvm.tests.regression.h2679.DupTest FAILED
[junit] Test org.apache.harmony.drlvm.tests.regression.h2748.Test FAILED
[junit] Test org.apache.harmony.drlvm.tests.regression.h2773.InfinityTest FAILED
[junit] Test org.apache.harmony.drlvm.tests.regression.h2808.finTest FAILED
[junit] Test org.apache.harmony.drlvm.tests.regression.h2846.NoVerifyTest FAILED
[junit] Test org.apache.harmony.drlvm.tests.regression.h2873.RemTest FAILED
[junit] Test org.apache.harmony.drlvm.tests.regression.h2874.Test FAILED
[junit] Test org.apache.harmony.drlvm.tests.regression.h2926.Test FAILED
[junit] Test org.apache.harmony.drlvm.tests.regression.h3027.AgentLibTest FAILED
[junit] Test org.apache.harmony.drlvm.tests.regression.h3048.H3048 FAILED
[junit] Test org.apache.harmony.drlvm.tests.regression.h3067.Test FAILED
[junit] Test org.apache.harmony.drlvm.tests.regression.h3074.Test FAILED
[junit] Test org.apache.harmony.drlvm.tests.regression.h3098.JsrNoRetTest FAILED
[junit] Test org.apache.harmony.drlvm.tests.regression.h3098.JsrNoRetTest FAILED
[junit] Test org.apache.harmony.drlvm.tests.regression.h3110.FieldTest FAILED
[junit] Test org.apache.harmony.drlvm.tests.regression.h3121.H3121 FAILED
[junit] Test org.apache.harmony.drlvm.tests.regression.h3150.Test FAILED
[junit] Test org.apache.harmony.drlvm.tests.regression.h3175.Test FAILED
[junit] Test org.apache.harmony.drlvm.tests.regression.h3216.ASETest FAILED
[junit] Test org.apache.harmony.drlvm.tests.regression.h3228.H3228 FAILED
[java] Java Result: 1
[junit] Test org.apache.harmony.drlvm.tests.regression.h3283.JavaLibraryPathTest FAILED
[junit] Test org.apache.harmony.drlvm.tests.regression.h3285.Test FAILED
[junit] Test org.apache.harmony.drlvm.tests.regression.h3317.GetFieldDeclaringClassTest FAILED
[junit] Test org.apache.harmony.drlvm.tests.regression.h3341.StopThreadInWait FAILED
[junit] Test org.apache.harmony.drlvm.tests.regression.h3380.LongToBitsTest FAILED
[junit] Test org.apache.harmony.drlvm.tests.regression.h3382.Test FAILED
[java] Java Result: 1
[junit] Test org.apache.harmony.drlvm.tests.regression.h3404.H3404 FAILED
[junit] Test org.apache.harmony.drlvm.tests.regression.h3446.SubSubTest FAILED
[junit] Test org.apache.harmony.drlvm.tests.regression.h3505.GetFieldModifiersTest FAILED
[junit] Test org.apache.harmony.drlvm.tests.regression.h3582.Test FAILED
[junit] Test org.apache.harmony.drlvm.tests.regression.h3619.ObjectLongWaitTest FAILED
[junit] Test org.apache.harmony.drlvm.tests.regression.h3652.Test FAILED
[junit] Test org.apache.harmony.drlvm.tests.regression.h3658.Test FAILED
[junit] Test org.apache.harmony.drlvm.tests.regression.h3658.Test FAILED
[junit] Test org.apache.harmony.drlvm.tests.regression.h3691.Test FAILED
[junit] Test org.apache.harmony.drlvm.tests.regression.h3698.ExceptionLocation FAILED
[junit] Test org.apache.harmony.drlvm.tests.regression.h3716.Test FAILED
[junit] Test org.apache.harmony.drlvm.tests.regression.h3730.StepM2N FAILED
[junit] Test org.apache.harmony.drlvm.tests.regression.h3738.Test FAILED
[junit] Test org.apache.harmony.drlvm.tests.regression.h3751.Test FAILED
[junit] Test org.apache.harmony.drlvm.tests.regression.h3784.Test FAILED
[junit] Test org.apache.harmony.drlvm.tests.regression.h3816.Test FAILED
[junit] Test org.apache.harmony.drlvm.tests.regression.h3822.Test FAILED
[junit] Test org.apache.harmony.drlvm.tests.regression.h3862.SubrBounds FAILED
[junit] Test org.apache.harmony.drlvm.tests.regression.h3894.ThreadGroupChildren FAILED
[junit] Test org.apache.harmony.drlvm.tests.regression.h3908.InvokeTest FAILED
[junit] Test org.apache.harmony.drlvm.tests.regression.h3909.FinalizerThreadGroup FAILED
[junit] Test org.apache.harmony.drlvm.tests.regression.h3954.Test FAILED
[junit] Test org.apache.harmony.drlvm.tests.regression.h3982.EmptyStackTrace FAILED
[junit] Test org.apache.harmony.drlvm.tests.regression.h4073.Test FAILED
[junit] Test org.apache.harmony.drlvm.tests.regression.h4073.Test FAILED
[junit] Test org.apache.harmony.drlvm.tests.regression.h4267.UnresolvedArrayElem FAILED
[junit] Test org.apache.harmony.drlvm.tests.regression.h4511.GCTagged FAILED
[junit] Test org.apache.harmony.drlvm.tests.regression.h4512.GetCurrentThreadCpuTime FAILED
[junit] Test org.apache.harmony.drlvm.tests.regression.h4514.Test FAILED
[junit] Test org.apache.harmony.drlvm.tests.regression.h4514.Test FAILED
[junit] Test org.apache.harmony.drlvm.tests.regression.h4579.test FAILED
[junit] Test org.apache.harmony.drlvm.tests.regression.h4595.Test FAILED
[junit] Test org.apache.harmony.drlvm.tests.regression.h4596.Test FAILED
[junit] Test org.apache.harmony.drlvm.tests.regression.h4654.Test FAILED
[junit] Test org.apache.harmony.drlvm.tests.regression.h4675.DivLongTest FAILED
[junit] Test org.apache.harmony.drlvm.tests.regression.h4706.Test FAILED
[junit] Test org.apache.harmony.drlvm.tests.regression.h4751.Test FAILED
[junit] Test org.apache.harmony.drlvm.tests.regression.h4866.Test FAILED
[junit] Test org.apache.harmony.drlvm.tests.regression.h4874.Test FAILED
[junit] Test org.apache.harmony.drlvm.tests.regression.h4874.Test FAILED
[junit] Test org.apache.harmony.drlvm.tests.regression.h4979.AttachCurrentThread FAILED
[junit] Test org.apache.harmony.drlvm.tests.regression.h5021.Test FAILED
[junit] Test org.apache.harmony.drlvm.tests.regression.h5067.Test FAILED
[junit] Test org.apache.harmony.drlvm.tests.regression.h5094.InlinedStackTest FAILED
[junit] Test org.apache.harmony.drlvm.tests.regression.h5094.InlinedStackTest FAILED
[junit] Test org.apache.harmony.drlvm.tests.regression.h5094.InlinedStackTest FAILED
[java] Java Result: 1
[java] Java Result: 1
[java] Java Result: 1
[java] Java Result: 1
[java] Java Result: 1
[java] Java Result: 1
[java] Java Result: 1
[junit] Test org.apache.harmony.drlvm.tests.regression.h5206.VolatileLongTest FAILED
[junit] Test org.apache.harmony.drlvm.tests.regression.h5206.VolatileLongTest FAILED
[junit] Test org.apache.harmony.drlvm.tests.regression.h788.Test FAILED
BUILD FAILED
/export/users/cc/cc-common/build/checkouts/hdk/working_vm/build/make/build.xml:578: The following
error occurred while executing this line:
/export/users/cc/cc-common/build/checkouts/hdk/working_vm/build/make/targets/reg.test.run.xml:108:
There were test failures
Total time: 2 minutes 20 seconds
The execution FAILED with the following exception:
The following error occurred while executing this line:
/export/users/cc/cc-common/adaptors/drlvm-reg-test/adaptor.xml:74: There were drlvm-reg-test
failures

***********************************************************
Unit Tests: (36)
        
failure: test org.apache.harmony.drlvm.tests.regression.h2196.LoopExcTest
failure: test org.apache.harmony.drlvm.tests.regression.h3256.InterruptTimedWaitingTest
failure: test org.apache.harmony.drlvm.tests.regression.h3382.TestX
failure: test org.apache.harmony.drlvm.tests.regression.h5201-0
failure: test org.apache.harmony.drlvm.tests.regression.h5201-1
failure: test org.apache.harmony.drlvm.tests.regression.h5201-2
failure: test org.apache.harmony.drlvm.tests.regression.h5201-6
Unit Test Error Details:	(7)
                
Test: testClass: org.apache.harmony.drlvm.tests.regression.h2196.LoopExcTestExit code: 1 Err:
Failure to open JIT dll /export/users/cc/cc-common/build/checkouts/hdk/working_vm/build/lnx_em64t_gcc_debug/deploy/jdk/jre/bin/default/libjitrino.so
20019
EM: JIT library loading error:'/export/users/cc/cc-common/build/checkouts/hdk/working_vm/build/lnx_em64t_gcc_debug/deploy/jdk/jre/bin/default/libjitrino.so'
Cannot instantiate EM
HMYEXEL062E Internal VM error: Failed to create Java VM
FAILED to invoke JVM.
apr code: /export/users/cc/cc-common/build/checkouts/hdk/working_vm/build/lnx_em64t_gcc_debug/deploy/jdk/jre/bin/default/libjitrino.so:
undefined symbol: class_lookup_class_by_name_using_bootstrap_class_loader
Test: testClass: org.apache.harmony.drlvm.tests.regression.h3256.InterruptTimedWaitingTestExit
code: 1 Err: Failure to open JIT dll /export/users/cc/cc-common/build/checkouts/hdk/working_vm/build/lnx_em64t_gcc_debug/deploy/jdk/jre/bin/default/libjitrino.so
20019
EM: JIT library loading error:'/export/users/cc/cc-common/build/checkouts/hdk/working_vm/build/lnx_em64t_gcc_debug/deploy/jdk/jre/bin/default/libjitrino.so'
Cannot instantiate EM
HMYEXEL062E Internal VM error: Failed to create Java VM
FAILED to invoke JVM.
apr code: /export/users/cc/cc-common/build/checkouts/hdk/working_vm/build/lnx_em64t_gcc_debug/deploy/jdk/jre/bin/default/libjitrino.so:
undefined symbol: class_lookup_class_by_name_using_bootstrap_class_loader
Test: testClass: org.apache.harmony.drlvm.tests.regression.h3382.TestXExit code: 1 Err: Failure
to open JIT dll /export/users/cc/cc-common/build/checkouts/hdk/working_vm/build/lnx_em64t_gcc_debug/deploy/jdk/jre/bin/default/libjitrino.so
20019
EM: JIT library loading error:'/export/users/cc/cc-common/build/checkouts/hdk/working_vm/build/lnx_em64t_gcc_debug/deploy/jdk/jre/bin/default/libjitrino.so'
Cannot instantiate EM
HMYEXEL062E Internal VM error: Failed to create Java VM
FAILED to invoke JVM.
apr code: /export/users/cc/cc-common/build/checkouts/hdk/working_vm/build/lnx_em64t_gcc_debug/deploy/jdk/jre/bin/default/libjitrino.so:
undefined symbol: class_lookup_class_by_name_using_bootstrap_class_loader
Test: testClass: org.apache.harmony.drlvm.tests.regression.h5201-0Exit code: 1 Err: Failure
to open JIT dll /export/users/cc/cc-common/build/checkouts/hdk/working_vm/build/lnx_em64t_gcc_debug/deploy/jdk/jre/bin/default/libjitrino.so
20019
EM: JIT library loading error:'/export/users/cc/cc-common/build/checkouts/hdk/working_vm/build/lnx_em64t_gcc_debug/deploy/jdk/jre/bin/default/libjitrino.so'
Cannot instantiate EM
HMYEXEL062E Internal VM error: Failed to create Java VM
FAILED to invoke JVM.
apr code: /export/users/cc/cc-common/build/checkouts/hdk/working_vm/build/lnx_em64t_gcc_debug/deploy/jdk/jre/bin/default/libjitrino.so:
undefined symbol: class_lookup_class_by_name_using_bootstrap_class_loader
Test: testClass: org.apache.harmony.drlvm.tests.regression.h5201-1Exit code: 1 Err: Failure
to open JIT dll /export/users/cc/cc-common/build/checkouts/hdk/working_vm/build/lnx_em64t_gcc_debug/deploy/jdk/jre/bin/default/libjitrino.so
20019
EM: JIT library loading error:'/export/users/cc/cc-common/build/checkouts/hdk/working_vm/build/lnx_em64t_gcc_debug/deploy/jdk/jre/bin/default/libjitrino.so'
Cannot instantiate EM
HMYEXEL062E Internal VM error: Failed to create Java VM
FAILED to invoke JVM.
apr code: /export/users/cc/cc-common/build/checkouts/hdk/working_vm/build/lnx_em64t_gcc_debug/deploy/jdk/jre/bin/default/libjitrino.so:
undefined symbol: class_lookup_class_by_name_using_bootstrap_class_loader
Test: testClass: org.apache.harmony.drlvm.tests.regression.h5201-2Exit code: 1 Err: Failure
to open JIT dll /export/users/cc/cc-common/build/checkouts/hdk/working_vm/build/lnx_em64t_gcc_debug/deploy/jdk/jre/bin/default/libjitrino.so
20019
EM: JIT library loading error:'/export/users/cc/cc-common/build/checkouts/hdk/working_vm/build/lnx_em64t_gcc_debug/deploy/jdk/jre/bin/default/libjitrino.so'
Cannot instantiate EM
HMYEXEL062E Internal VM error: Failed to create Java VM
FAILED to invoke JVM.
apr code: /export/users/cc/cc-common/build/checkouts/hdk/working_vm/build/lnx_em64t_gcc_debug/deploy/jdk/jre/bin/default/libjitrino.so:
undefined symbol: class_lookup_class_by_name_using_bootstrap_class_loader
Test: testClass: org.apache.harmony.drlvm.tests.regression.h5201-6Exit code: 1 Err: Failure
to open JIT dll /export/users/cc/cc-common/build/checkouts/hdk/working_vm/build/lnx_em64t_gcc_debug/deploy/jdk/jre/bin/default/libjitrino.so
20019
EM: JIT library loading error:'/export/users/cc/cc-common/build/checkouts/hdk/working_vm/build/lnx_em64t_gcc_debug/deploy/jdk/jre/bin/default/libjitrino.so'
Cannot instantiate EM
HMYEXEL062E Internal VM error: Failed to create Java VM
FAILED to invoke JVM.
apr code: /export/users/cc/cc-common/build/checkouts/hdk/working_vm/build/lnx_em64t_gcc_debug/deploy/jdk/jre/bin/default/libjitrino.so:
undefined symbol: class_lookup_class_by_name_using_bootstrap_class_loader

***********************************************************
Modifications since last successful build:	(2)
            
add cc-hdk log20071204184958Lbuild.446 12/04/2007 18:49:58hdk
add cc-hdk log20071204184958Lbuild.446 12/04/2007 18:49:58hdk

begin 644 execution_log.zip
M4$L#! H    ( -2LA#?0=-S\[Q   +O- 0 2    97AE8W5T:6]N7VQO9RYH
M=&UL[9W[;YO(%L=_[U^!M+KJ;K09 S88^[:5\NHF5=*MFFSOKJHJPC"V:8!!
M/%)[__I[!NPDKA_$"7@@'"MRP(;AS)GY?,^\#&_&L>>^>S-@]O3=FR"D[]Z8
M4A1/7?KV]9#Y\7[D_$O[DB'_Y[^OW[U* MN,Z7YTZ_=?O=K/]F K3&!?DJ2O
M-G5I3+])Q_R_XX\D1>Y)0\>ED30,F2>UZ"1@8=Q*(AI&+<N"OWV+>1[S6X/$
M<>U62*/$C:.6';JWWGY(1_LQC6*>-J3^W;PUOTF'_$">9E_RS!N:G4@FGKMP
MU,(.V+MO@V%6W-]\4!"R8,,A=!+3T+^VZ4\'9=O4&C/8_BOB&3\Z/[B\/#\[
ME-[F9]H:4^N&)9#ML7W3^L'"&TCAVG+-*'*=P7ISLBP1%A$SM,;$FDR(-1QM
ML-_QG9@DOC/).^:'X^<= CF VA)%U"8>L^DFQ]*81-1S(F([891S8.9BT]UT
M7. F(\<GIA];4$-#9Y!_K!4$L1G=;$J5YVI]L1XQ?^B,DM",'>9O*'W^.F51
M6OD_P-=0_@K1B'P-(/QZF?C2A6.%+)I&,?4BZ<RWR&\;$YO7 BED+"ZX,BT9
M?O]B$5SKW/&3R>/.X!40SJ">WHD?>0VHKG#&R+(>>_QP!,?;=)",-I\!($LA
MO74B*"DX0Y?EGM+)NPBOSLRG?ARE%PE<-LVU:SPE/B.1P^T:0I6E&\^ HUUF
MF2[YEQ?GJC,6=D#["->^#366VPPZ>">3$>@7#<R0+M?/K]X-P ?5.*0@V;8$
M._VGUJ5;;_:UZT^NTQ*_AE*\3DNFE=K1FAL/J?**1Z/J&.0#P;<;_+[LU.\;
MBB#O5/C\I\+X"O6 ;UI<4_CQ69AL2Q%+0HO.HF7,A)5.3I8R_U6HAF4&M4YE
M>+6NV>#[,H6P9X&_%7!K;+KW+A[0>09MLO:LR]@,4SF'DKK9S"OU!CP<FKXS
M7"*W$CY2%4U!'^7XR.CUT$<Y/NJI.OIHLX_:LMI%'^7YJ-M!'^7X2&EC7,OS
M45M!UG)]U,'8G^>CCHQZE.<C3=;01SD^TGL&^BC'1UV,:_D^,E"/\GQD]-!'
M>3[JR=BGS?61H:*/-ONHHRG8ALSW$=:C/!_UNJA'.3[29+7*K"WLN&;B6^-L
MAJ!"K@PIO\3RY--\6BYWAN_M8UZYJ5R!,9#M#U\NRLEV-EW9^@['?P]I:^#X
M+6[,CG+W-.]FJR3HQ'(3.YOT>OKD-C@G"JVT]'GA\U4)#IPR2SR:;Q"7SV>3
MB:%?ZQTI9PX_+W._2"=9JC909YE@L<2&TNG!YXL_/_ZSWU%U;>VIIXJA]?(3
MEN*Q U1#INZN</GGB30V?3N=,X0O?18#IZ8]E88LE&89<WSIP]E5Z\N%-*7K
MY^)/-YKX2UIG)2LTHS%("_/YI3>EU5.?#ME:?R_J4>+O+\^'9YN)[\3?I,^)
M[W/'L'!$S,"$ND+&9@B59TK2Y429*)#[&D+&?,Z0'#LAM>+#:4P/D^&0AE<_
MKSAZ>)'WIN,F(>5JRP*:NEJR77=77-MT:"9NW'*=P7<G#AV^_H!)JBPKRS5J
M;O()R XW$\X)S7 JN<RT4_C"D(7]UR(M?[W6Z"/3Y[7;\:/8]&,'X@;D8^W1
MIQ?_G/Q]<B[KZHETYF<KB"0@(,MB6F@ *I29E8:@;&7.E_7IO3\X.S\YYB<X
M_BV[H5R[ER/J_&@S""'NVG1GZK[2EWTI\>$+QX><1E-OP-Q^MGKHVF7L)@FR
M-4#7@^FU;WKT.N$"?#U@+([BT)Q_R^L&#=?F-%6%(OB:>7C'N"M:UR ?S8](
M>.T(;PYC8K5L6\(?(K4*ZN<2JVL=<LK?D=G:,8M1N9I1>1$J0:&XVS$(5(KA
M@67!9T@WTHUT%T/W,EFB$#<,8@XL&^%N/-S-P;7DYO9#ILIH;QO083^94 N9
M16:1V6*8?<C4TT/QTH]K=_H#KA9DN)5EN#7+</8CW?L3YO,N/,-JZ\))?QN:
MGEZP0JGD+Q_VF7M+[4]F:'HH5HT7*^P]%"96*_%:T]:HI2A=C4/VPQRXM'1U
M.N63M3BC6$-]:HY"U&R^82U@@@8YC(Y,+ATO<.$KY+QVG&.GJ:J=II^X*F6P
M ]E%=K$/47P?XA'L[B(T:RHY=FZA:B#<C8>[.;B6'9@7J&K&>*;6W<70@=8E
M*%2-%RILA10F5!E/HEH?NH(X(\Z(<U$XSW@J92! ;Y-3_H[ (K (;%' /H!*
M3!!696@#7$Y]7,Z$7"/7Q7"]P%03NO^J;+0W+V>:_Z+Y3J% 0TZNBA4RHXV]
M"10Q%+&B1&S&T[K>Q JD__R$2"/2B/0+0MKAY1>$T Y9;T<I:/,O(]XXZDO*
M[W/0H[XD_RZ=\'J4;5XY'I6H:P;0]( #B6YTI8A:3VAM/3,W'12J^@E5<Z2B
M7DL8[W@J8203TM:1U2JPVASZZM1\>@*KNL!)1%7NJ8AS%7#&T/LR<)[Q5$KH
M15;KR"KVYZO:GR^1547&L;<:LMH<6FH65^<\"6HF*PKB7$.<,?16-/3.>1*%
MLZ:0+Q=G<+Z"5%> ZN:04B?]VI[J1:R> ??25-HV5O1T<LY8<#)9O2IOOITZ
MZS.-H![T)66M"7M[>W._[?'M_G.,D7Y5)#IQXK2V_[9KV5.U'CGE[RAXV(S!
M9LSS!>\.*$'M&%57R.>C$VS#(-*(=$%(WR,E".IV6[N[N<%Y1L G,QXCY @Y
M0EX,Y!L0:\0/#O1.IW69!#0\XB<7?ZL!?@%R"(7(73$R8_@0Y0OE"^6K&/E:
M39>@YHK>[9'C)$"^D6_DNR"^[Y$2!#5_Q L2C40CT<40/>=)%,[=-CGSP2=.
M/$6L$6O$NB"L?^*JC)6$AFP0N )BB]@BML5@^P"I4HCMZ.0C^T)#9XC1%K%%
M;(O"]B>N!#6F#0CZGRD^$PS)1K*+(OL>*6%0XRTH:DAT<YBJV5+@.4^B<.[U
MR(7I3P_"453X?7)DHG65I]XG9]6M_,Z*O>]73WUYM^AH#N@-4.V::=F<IPK<
M]RL7[:?IF6YH N[[U9;5+CD849^OP7II@E5+C)NCLB]9L):X:L*:QK;<,5H7
MTY.)10.^(JKX18W\"N24OZ-.87,#AWT*T*DY4"7,PK1E'9]VAK BK(7!JHM\
MVEE;Q@%:Q!EQ+@YGH0.T;;EGD ]1^)%]IOCP9,0:L2X*ZY^X*J5EC>PBN\BN
M$'9W$)H512;O'>K:R#:RC6P7P_8"5*+ 5A5RRM\1:H0:H2X ZCE0HH!NR^3(
M=-V/9NS<TDJM<ZK1Q*&BR=EY5RPUEC[^(:P%/[&1FX*#G%40Z.:(WG:A:'N)
MG-7HO'&(W<>XIZ_7+)SZKH;45X%Z;)954:&VUYP93X):9:JBDX-+O"DK$HU$
M%T3T Z1$0:UJY!.+'-[1^A"%C^YK;;,(6U[N;!5A]L?T'G%;F:UM8;5:CM4?
M>D?,"\#P@;N-Y>UM.K>ZB$7OJLH7O<$[!@<,#A@<"@@.<Z#$/&^DK6HZ22M$
MF 0Q%QG[?Z;#A[Q6:M9\.ZT>)3]]9+-I0I]%TE:--N$^P#N<HRBB*!8OBJOQ
M$M5Z-G"$JX9T-X>OFOW ;\Z3()S;2I?\0>-T/<,Q!0=#28W21PD@Y+6#'$-X
M14/X9LI$H=]1R&7,@JLQU ;[S.?]"02^5L W![F:1?55;(G"W)#).?-'5^S0
MB3&JUP]RC.I5C>I+9 E#7,4^>17 ;@XL=9*P)X"M;G>7L">D_;?8Z80[,\1.
M'73D#CGE[RA=M6J3-$?H:B9==T ):HIT.CJY3 ;PAPV2VE&-/8V*]C06J1*$
MMB9K=X.8%\QVA@Z4#E)>.\J;PUG-8O=:P,JX\X>&8P;5@+<Y.-:I,;(]O#EC
M!L]A55=ZY,_!=VK%?+B1SR4@N14@%\/NBR!W-5V"&MFZAF$9X4:X"X-;6Q^6
M=X*S@3@CSHAS83@;Y;6RD55D%5G=":N["+T]!7%&G!'GHG">\20,9X/</1'J
MG%DF_X]LUXIMG%^NZ/SR2K@$@=Y57MXC;QO =G/HJEG<GO,D"N>V3"YC&ERH
M'Y'H6A&-T;JBT?H!4L*@QJ$R)+I!C)8=H]M"A\JZ&@Z5(<Z(<V$X:T*'RKH&
M/E^UAC@W![^Z]: -H<]7-7! K(XX8W2N:'0V-@R(/9M5%9=O(JLXU%48JZK0
MY9N&KO+?78:'#'RS_!@QA+K*4#<'JYJUIQ>I$H5V#QKUZ=W9_@A9$AR-H:!#
MBBM*ZL4X!NZJ!N[5>)71YN[)!CE+2PM;WHT'N#E(EARD%ZD2%*1[<H^\=Z!*
M./_2\(&<(.2-AARC=&&0K^9+%.X:3EPAWHAW87AK0B>N>H9*3KP@GE[&IG5S
M%9H61;*1;"2[ +*7T1(#>4?NME]<S&Y.Q4,-J]C@^!U/)8R4O4A6L09C%!84
MA3>R^KC0^]6F+HWI-^F8_P>;R_%R:GL+;,]RT4K=0:,69+:59;8URVPKS>S]
M";/,ML8=5>^V/E./W=(+2M($"M4F2)[\Y<,^<V^I?1"&YO3$I1Y*5:VDJCEB
M4;-FQ1J\!'4:-$4A?QQ=F:,1M9'P6A&.C9&*-D8>,B4,:Y7?P/PH"4/JQ]E\
MPE&07#D>#OPAY4AY(92O14P8]#AIAX0CX<41OG[2#EE%5I'5>K"ZB]#;[:4?
M(\Z(,^)< ,XSGD3AW-,P.B/.B'-1.,]X$H8SWK<!<6X0H"5/8<UY*J-CK./*
M<V0562V,55WHRO..WM7(L7/+G^>'5%> ZN9P5:>NP_94+V)51B#NRMAHK@2R
M=:K(S9&7K9&=\R0H$..=A1'G1@%:<@06>V?ACJ&_O.C<G+J)PE6U!O6<)U$X
M=W'4"RLY-K8+P[E;WM(M9!59;11]98?>#:SN(/3VNCUR$,=P\,)2;J2[T71C
M)"Z([C5XE1"8-5G%(2Y$%]$M"-T[GL0$9DW6NX@SXHPX%X7SC"=1./<ZY,QW
MN4^R6Z4AVN+1;@XN=1*Q[=%>P58I+>QM&.9?1EQ,^E+[]SG145^2?Y=.N!NS
MS?3WTM0U@XC:\ '155V*J(72\]*EITY -D<F7X;T(,/(,#)<.,./["6D.^$W
MZ9![B]=AV-OMW13YGJ;*RKY,X-K+!GZEUI@]38?25%>DF&VG5?8SC:#<^Y*R
M]L)[>WOSVKO'M_O;FR#]JDATXL1IG?ZMRF6@E%(&JYR[XS)0ZE,&:BEEH(HO
M [4^9= NI0S:SRV#3P>7E^#_[5V_XLK5<7:G%&=WA#E[Q96KXVRM%&=KPIR]
MXLK5<;9>BK-U\5*N;Y;R53?HCKV@Y9F^,X04]WDBNQ[45F6=?&&N&4/7!7_C
MB+U2[)46URM=Q589(TO(,#*,#->:X:YAX%(1Q!9!S ,DC[U\X5O8\<P;NA]2
M[NK%=G667O8-6!N:?C1DH2?%C@>ETU'UCK?\T)IY5^+M(U_K.T%W.9>X*S@U
MF2G2#S.2HIB%4#2.OV+DNB@+=M$SS+($"<2>6VQ.%G922Z&0>0<PZJ\_[O"O
ML_/C5?7KN;[@E2S;)!//[6M=HR]=C:DT9*[+?MQ)HL0LBZ\PMJ4?8] -Z$E2
M*TG+/AX[D<1G-_K%VQ6;X8@^*!8"_<S43$7.S(2@\X._\2^EX6P1Q'HO7K$8
M-###1)4\QT_@1(@4?$T$\^W%,U=VS2T63$&(X9WG73&D(7@CXDCG9GA6R-F3
MIZ#(1VF/^=6L0OWK! \&0&#O$3*[.L5KB'Q=194[UZK2U@DD]>H5+]%9D0&V
M,QWZX<1C*+Z%LIY8-.#']%\]M1)LL-JTS0#DX6>#YY^G)=OM+!3LXI'W1?RF
M9;Y[TPI""N\#9D_A'R?UW?\!4$L! A0#"@    @ U*R$-]!TW/SO$   N\T!
M !(              *2!     &5X96-U=&EO;E]L;V<N:'1M;%!+!08     
. 0 ! $     ?$0     ! 
end

Mime
View raw message