harmony-alerts mailing list archives

Site index · List index
Message view « Date » · « Thread »
Top « Date » · « Thread »
From nom...@intel.com
Subject [build-test alert] FAILED Linux x86: drlvm-reg-test debug
Date Tue, 04 Dec 2007 15:36:26 GMT

BUILD FAILED:
	Ant Error Message:
/export/users/cc/cc-common/scripts/cc-exec-adaptor.xml:104: The following error occurred while
executing this line: /export/users/cc/cc-common/adaptors/drlvm-reg-test/adaptor.xml:74: There
were drlvm-reg-test failures

Date of build:	2007-12-04 21:33:10 +0600
Time to build:	3 minutes 8 seconds
Last changed:	12/04/2007 18:30:12
Last log entry:	hdk

***********************************************************
Errors/Warnings:	(125)
            
[junit] Test org.apache.harmony.drlvm.tests.regression.h0000.DirectByteBufferTest FAILED
[junit] Test org.apache.harmony.drlvm.tests.regression.h1578.NaNTest FAILED
[junit] Test org.apache.harmony.drlvm.tests.regression.h1654.H1654Test FAILED
[junit] Test org.apache.harmony.drlvm.tests.regression.h1748.IntfAccessTest FAILED
[junit] Test org.apache.harmony.drlvm.tests.regression.h1788.abcdTest FAILED
[junit] Test org.apache.harmony.drlvm.tests.regression.h1800.ExecTest FAILED
[junit] Test org.apache.harmony.drlvm.tests.regression.h1802.UnresolvedParamTest FAILED
[junit] Test org.apache.harmony.drlvm.tests.regression.h1802.UnresolvedHandlerTest FAILED
[junit] Test org.apache.harmony.drlvm.tests.regression.h1840.SimplestTest FAILED
[junit] Test org.apache.harmony.drlvm.tests.regression.h1840.SimplestTest FAILED
[junit] Test org.apache.harmony.drlvm.tests.regression.h1852.DivIntTest FAILED
[junit] Test org.apache.harmony.drlvm.tests.regression.h1857.Test FAILED
[junit] Test org.apache.harmony.drlvm.tests.regression.h1859.Test FAILED
[junit] Test org.apache.harmony.drlvm.tests.regression.h1859.Test FAILED
[junit] Test org.apache.harmony.drlvm.tests.regression.h1861.Test FAILED
[junit] Test org.apache.harmony.drlvm.tests.regression.h1863.H1863Test FAILED
[junit] Test org.apache.harmony.drlvm.tests.regression.h2057.SyncTest FAILED
[junit] Test org.apache.harmony.drlvm.tests.regression.h2083.Test FAILED
[junit] Test org.apache.harmony.drlvm.tests.regression.h2083.Test FAILED
[junit] Test org.apache.harmony.drlvm.tests.regression.h2084.Test FAILED
[junit] Test org.apache.harmony.drlvm.tests.regression.h2086.Test FAILED
[junit] Test org.apache.harmony.drlvm.tests.regression.h2092.Test FAILED
[junit] Test org.apache.harmony.drlvm.tests.regression.h2092.Test FAILED
[junit] Test org.apache.harmony.drlvm.tests.regression.h2103.Test FAILED
[junit] Test org.apache.harmony.drlvm.tests.regression.h2113.Test FAILED
[junit] Test org.apache.harmony.drlvm.tests.regression.h2151.VMInit1Test FAILED
[java] Java Result: 1
[junit] Test org.apache.harmony.drlvm.tests.regression.h2259.H2259 FAILED
[junit] Test org.apache.harmony.drlvm.tests.regression.h2261.RCETest FAILED
[junit] Test org.apache.harmony.drlvm.tests.regression.h2335.SimplestLibraryPathTest FAILED
[junit] Test org.apache.harmony.drlvm.tests.regression.h2644.BootDelegationTest FAILED
[junit] Test org.apache.harmony.drlvm.tests.regression.h2679.DupTest FAILED
[junit] Test org.apache.harmony.drlvm.tests.regression.h2748.Test FAILED
[junit] Test org.apache.harmony.drlvm.tests.regression.h2773.InfinityTest FAILED
[junit] Test org.apache.harmony.drlvm.tests.regression.h2808.finTest FAILED
[junit] Test org.apache.harmony.drlvm.tests.regression.h2846.NoVerifyTest FAILED
[junit] Test org.apache.harmony.drlvm.tests.regression.h2873.RemTest FAILED
[junit] Test org.apache.harmony.drlvm.tests.regression.h2874.Test FAILED
[junit] Test org.apache.harmony.drlvm.tests.regression.h2926.Test FAILED
[junit] Test org.apache.harmony.drlvm.tests.regression.h3027.AgentLibTest FAILED
[junit] Test org.apache.harmony.drlvm.tests.regression.h3048.H3048 FAILED
[junit] Test org.apache.harmony.drlvm.tests.regression.h3067.Test FAILED
[junit] Test org.apache.harmony.drlvm.tests.regression.h3074.Test FAILED
[junit] Test org.apache.harmony.drlvm.tests.regression.h3098.JsrNoRetTest FAILED
[junit] Test org.apache.harmony.drlvm.tests.regression.h3098.JsrNoRetTest FAILED
[junit] Test org.apache.harmony.drlvm.tests.regression.h3110.FieldTest FAILED
[junit] Test org.apache.harmony.drlvm.tests.regression.h3121.H3121 FAILED
[junit] Test org.apache.harmony.drlvm.tests.regression.h3150.Test FAILED
[junit] Test org.apache.harmony.drlvm.tests.regression.h3175.Test FAILED
[junit] Test org.apache.harmony.drlvm.tests.regression.h3216.ASETest FAILED
[junit] Test org.apache.harmony.drlvm.tests.regression.h3228.H3228 FAILED
[java] Java Result: 1
[junit] Test org.apache.harmony.drlvm.tests.regression.h3283.JavaLibraryPathTest FAILED
[junit] Test org.apache.harmony.drlvm.tests.regression.h3285.Test FAILED
[junit] Test org.apache.harmony.drlvm.tests.regression.h3317.GetFieldDeclaringClassTest FAILED
[junit] Test org.apache.harmony.drlvm.tests.regression.h3341.StopThreadInWait FAILED
[junit] Test org.apache.harmony.drlvm.tests.regression.h3380.LongToBitsTest FAILED
[junit] Test org.apache.harmony.drlvm.tests.regression.h3382.Test FAILED
[java] Java Result: 1
[junit] Test org.apache.harmony.drlvm.tests.regression.h3404.H3404 FAILED
[junit] Test org.apache.harmony.drlvm.tests.regression.h3446.SubSubTest FAILED
[junit] Test org.apache.harmony.drlvm.tests.regression.h3505.GetFieldModifiersTest FAILED
[junit] Test org.apache.harmony.drlvm.tests.regression.h3582.Test FAILED
[junit] Test org.apache.harmony.drlvm.tests.regression.h3619.ObjectLongWaitTest FAILED
[junit] Test org.apache.harmony.drlvm.tests.regression.h3652.Test FAILED
[junit] Test org.apache.harmony.drlvm.tests.regression.h3658.Test FAILED
[junit] Test org.apache.harmony.drlvm.tests.regression.h3658.Test FAILED
[junit] Test org.apache.harmony.drlvm.tests.regression.h3691.Test FAILED
[junit] Test org.apache.harmony.drlvm.tests.regression.h3698.ExceptionLocation FAILED
[junit] Test org.apache.harmony.drlvm.tests.regression.h3716.Test FAILED
[junit] Test org.apache.harmony.drlvm.tests.regression.h3730.StepM2N FAILED
[junit] Test org.apache.harmony.drlvm.tests.regression.h3738.Test FAILED
[junit] Test org.apache.harmony.drlvm.tests.regression.h3751.Test FAILED
[junit] Test org.apache.harmony.drlvm.tests.regression.h3784.Test FAILED
[junit] Test org.apache.harmony.drlvm.tests.regression.h3816.Test FAILED
[junit] Test org.apache.harmony.drlvm.tests.regression.h3822.Test FAILED
[junit] Test org.apache.harmony.drlvm.tests.regression.h3862.SubrBounds FAILED
[junit] Test org.apache.harmony.drlvm.tests.regression.h3894.ThreadGroupChildren FAILED
[junit] Test org.apache.harmony.drlvm.tests.regression.h3908.InvokeTest FAILED
[junit] Test org.apache.harmony.drlvm.tests.regression.h3909.FinalizerThreadGroup FAILED
[junit] Test org.apache.harmony.drlvm.tests.regression.h3954.Test FAILED
[junit] Test org.apache.harmony.drlvm.tests.regression.h3982.EmptyStackTrace FAILED
[junit] Test org.apache.harmony.drlvm.tests.regression.h4073.Test FAILED
[junit] Test org.apache.harmony.drlvm.tests.regression.h4073.Test FAILED
[junit] Test org.apache.harmony.drlvm.tests.regression.h4265.Test FAILED
[junit] Test org.apache.harmony.drlvm.tests.regression.h4265.Test FAILED
[junit] Test org.apache.harmony.drlvm.tests.regression.h4267.UnresolvedArrayElem FAILED
[junit] Test org.apache.harmony.drlvm.tests.regression.h4292.Test FAILED
[junit] Test org.apache.harmony.drlvm.tests.regression.h4292.Test FAILED
[junit] Test org.apache.harmony.drlvm.tests.regression.h4511.GCTagged FAILED
[junit] Test org.apache.harmony.drlvm.tests.regression.h4512.GetCurrentThreadCpuTime FAILED
[junit] Test org.apache.harmony.drlvm.tests.regression.h4514.Test FAILED
[junit] Test org.apache.harmony.drlvm.tests.regression.h4514.Test FAILED
[junit] Test org.apache.harmony.drlvm.tests.regression.h4579.test FAILED
[junit] Test org.apache.harmony.drlvm.tests.regression.h4595.Test FAILED
[junit] Test org.apache.harmony.drlvm.tests.regression.h4596.Test FAILED
[junit] Test org.apache.harmony.drlvm.tests.regression.h4654.Test FAILED
[junit] Test org.apache.harmony.drlvm.tests.regression.h4675.DivLongTest FAILED
[junit] Test org.apache.harmony.drlvm.tests.regression.h4706.Test FAILED
[junit] Test org.apache.harmony.drlvm.tests.regression.h4751.Test FAILED
[junit] Test org.apache.harmony.drlvm.tests.regression.h4866.Test FAILED
[junit] Test org.apache.harmony.drlvm.tests.regression.h4874.Test FAILED
[junit] Test org.apache.harmony.drlvm.tests.regression.h4874.Test FAILED
[junit] Test org.apache.harmony.drlvm.tests.regression.h4979.AttachCurrentThread FAILED
[junit] Test org.apache.harmony.drlvm.tests.regression.h5021.Test FAILED
[junit] Test org.apache.harmony.drlvm.tests.regression.h5067.Test FAILED
[junit] Test org.apache.harmony.drlvm.tests.regression.h5094.InlinedStackTest FAILED
[junit] Test org.apache.harmony.drlvm.tests.regression.h5094.InlinedStackTest FAILED
[junit] Test org.apache.harmony.drlvm.tests.regression.h5094.InlinedStackTest FAILED
[java] Java Result: 1
[java] Java Result: 1
[java] Java Result: 1
[java] Java Result: 1
[java] Java Result: 1
[java] Java Result: 1
[java] Java Result: 1
[junit] Test org.apache.harmony.drlvm.tests.regression.h5206.VolatileLongTest FAILED
[junit] Test org.apache.harmony.drlvm.tests.regression.h5206.VolatileLongTest FAILED
[junit] Test org.apache.harmony.drlvm.tests.regression.h788.Test FAILED
BUILD FAILED
/export/users/cc/cc-common/build/checkouts/hdk/working_vm/build/make/build.xml:578: The following
error occurred while executing this line:
/export/users/cc/cc-common/build/checkouts/hdk/working_vm/build/make/targets/reg.test.run.xml:108:
There were test failures
Total time: 3 minutes 4 seconds
The execution FAILED with the following exception:
The following error occurred while executing this line:
/export/users/cc/cc-common/adaptors/drlvm-reg-test/adaptor.xml:74: There were drlvm-reg-test
failures

***********************************************************
Unit Tests: (36)
        
failure: test org.apache.harmony.drlvm.tests.regression.h2196.LoopExcTest
failure: test org.apache.harmony.drlvm.tests.regression.h3256.InterruptTimedWaitingTest
failure: test org.apache.harmony.drlvm.tests.regression.h3382.TestX
failure: test org.apache.harmony.drlvm.tests.regression.h5201-0
failure: test org.apache.harmony.drlvm.tests.regression.h5201-1
failure: test org.apache.harmony.drlvm.tests.regression.h5201-2
failure: test org.apache.harmony.drlvm.tests.regression.h5201-6
Unit Test Error Details:	(7)
                
Test: testClass: org.apache.harmony.drlvm.tests.regression.h2196.LoopExcTestExit code: 1 Err:
Failure to open JIT dll /export/users/cc/cc-common/build/checkouts/hdk/working_vm/build/lnx_ia32_gcc_debug/deploy/jdk/jre/bin/default/libjitrino.so
20019
EM: JIT library loading error:'/export/users/cc/cc-common/build/checkouts/hdk/working_vm/build/lnx_ia32_gcc_debug/deploy/jdk/jre/bin/default/libjitrino.so'
Cannot instantiate EM
HMYEXEL062E Internal VM error: Failed to create Java VM
FAILED to invoke JVM.
apr code: /export/users/cc/cc-common/build/checkouts/hdk/working_vm/build/lnx_ia32_gcc_debug/deploy/jdk/jre/bin/default/libjitrino.so:
undefined symbol: class_lookup_class_by_name_using_bootstrap_class_loader
Test: testClass: org.apache.harmony.drlvm.tests.regression.h3256.InterruptTimedWaitingTestExit
code: 1 Err: Failure to open JIT dll /export/users/cc/cc-common/build/checkouts/hdk/working_vm/build/lnx_ia32_gcc_debug/deploy/jdk/jre/bin/default/libjitrino.so
20019
EM: JIT library loading error:'/export/users/cc/cc-common/build/checkouts/hdk/working_vm/build/lnx_ia32_gcc_debug/deploy/jdk/jre/bin/default/libjitrino.so'
Cannot instantiate EM
HMYEXEL062E Internal VM error: Failed to create Java VM
FAILED to invoke JVM.
apr code: /export/users/cc/cc-common/build/checkouts/hdk/working_vm/build/lnx_ia32_gcc_debug/deploy/jdk/jre/bin/default/libjitrino.so:
undefined symbol: class_lookup_class_by_name_using_bootstrap_class_loader
Test: testClass: org.apache.harmony.drlvm.tests.regression.h3382.TestXExit code: 1 Err: Failure
to open JIT dll /export/users/cc/cc-common/build/checkouts/hdk/working_vm/build/lnx_ia32_gcc_debug/deploy/jdk/jre/bin/default/libjitrino.so
20019
EM: JIT library loading error:'/export/users/cc/cc-common/build/checkouts/hdk/working_vm/build/lnx_ia32_gcc_debug/deploy/jdk/jre/bin/default/libjitrino.so'
Cannot instantiate EM
HMYEXEL062E Internal VM error: Failed to create Java VM
FAILED to invoke JVM.
apr code: /export/users/cc/cc-common/build/checkouts/hdk/working_vm/build/lnx_ia32_gcc_debug/deploy/jdk/jre/bin/default/libjitrino.so:
undefined symbol: class_lookup_class_by_name_using_bootstrap_class_loader
Test: testClass: org.apache.harmony.drlvm.tests.regression.h5201-0Exit code: 1 Err: Failure
to open JIT dll /export/users/cc/cc-common/build/checkouts/hdk/working_vm/build/lnx_ia32_gcc_debug/deploy/jdk/jre/bin/default/libjitrino.so
20019
EM: JIT library loading error:'/export/users/cc/cc-common/build/checkouts/hdk/working_vm/build/lnx_ia32_gcc_debug/deploy/jdk/jre/bin/default/libjitrino.so'
Cannot instantiate EM
HMYEXEL062E Internal VM error: Failed to create Java VM
FAILED to invoke JVM.
apr code: /export/users/cc/cc-common/build/checkouts/hdk/working_vm/build/lnx_ia32_gcc_debug/deploy/jdk/jre/bin/default/libjitrino.so:
undefined symbol: class_lookup_class_by_name_using_bootstrap_class_loader
Test: testClass: org.apache.harmony.drlvm.tests.regression.h5201-1Exit code: 1 Err: Failure
to open JIT dll /export/users/cc/cc-common/build/checkouts/hdk/working_vm/build/lnx_ia32_gcc_debug/deploy/jdk/jre/bin/default/libjitrino.so
20019
EM: JIT library loading error:'/export/users/cc/cc-common/build/checkouts/hdk/working_vm/build/lnx_ia32_gcc_debug/deploy/jdk/jre/bin/default/libjitrino.so'
Cannot instantiate EM
HMYEXEL062E Internal VM error: Failed to create Java VM
FAILED to invoke JVM.
apr code: /export/users/cc/cc-common/build/checkouts/hdk/working_vm/build/lnx_ia32_gcc_debug/deploy/jdk/jre/bin/default/libjitrino.so:
undefined symbol: class_lookup_class_by_name_using_bootstrap_class_loader
Test: testClass: org.apache.harmony.drlvm.tests.regression.h5201-2Exit code: 1 Err: Failure
to open JIT dll /export/users/cc/cc-common/build/checkouts/hdk/working_vm/build/lnx_ia32_gcc_debug/deploy/jdk/jre/bin/default/libjitrino.so
20019
EM: JIT library loading error:'/export/users/cc/cc-common/build/checkouts/hdk/working_vm/build/lnx_ia32_gcc_debug/deploy/jdk/jre/bin/default/libjitrino.so'
Cannot instantiate EM
HMYEXEL062E Internal VM error: Failed to create Java VM
FAILED to invoke JVM.
apr code: /export/users/cc/cc-common/build/checkouts/hdk/working_vm/build/lnx_ia32_gcc_debug/deploy/jdk/jre/bin/default/libjitrino.so:
undefined symbol: class_lookup_class_by_name_using_bootstrap_class_loader
Test: testClass: org.apache.harmony.drlvm.tests.regression.h5201-6Exit code: 1 Err: Failure
to open JIT dll /export/users/cc/cc-common/build/checkouts/hdk/working_vm/build/lnx_ia32_gcc_debug/deploy/jdk/jre/bin/default/libjitrino.so
20019
EM: JIT library loading error:'/export/users/cc/cc-common/build/checkouts/hdk/working_vm/build/lnx_ia32_gcc_debug/deploy/jdk/jre/bin/default/libjitrino.so'
Cannot instantiate EM
HMYEXEL062E Internal VM error: Failed to create Java VM
FAILED to invoke JVM.
apr code: /export/users/cc/cc-common/build/checkouts/hdk/working_vm/build/lnx_ia32_gcc_debug/deploy/jdk/jre/bin/default/libjitrino.so:
undefined symbol: class_lookup_class_by_name_using_bootstrap_class_loader

***********************************************************
Modifications since last successful build:	(2)
            
add cc-hdk log20071204183012Lbuild.486 12/04/2007 18:30:12hdk
add cc-hdk log20071204183012Lbuild.486 12/04/2007 18:30:12hdk

begin 644 execution_log.zip
M4$L#! H    ( (JLA#?)[I74Z1   )'A 0 2    97AE8W5T:6]N7VQO9RYH
M=&UL[9UK<YNZ%H:_]U?PY4SWSC0R8'/SZ>Y,;MU))^GN-&G/.=/I9##(-@T@
M1D!J]]<?"4P2U[?8!LN$E<DX..8B+:WG7;I9>CM, O_=VQYQQ^_>1A2_>VM+
M<3+V\5^O^R1,#F/O%^Y*IORO?[]^]RJ-7#O!A_%]V'WUZC!_QXYHRMY+DO3-
MQ3Y.\'?IE/_UPH&D**K4]WP<2WU* JF%1Q&A22N-,8U;CL-^#QT2!"1L]5+/
M=UL4QZF?Q"V7^O?!(<6#PP3'";\WN_L/^][^+AWS$_D]NU)@W^'\0C0*_*FS
MIMZP]!ZZ+&%.TEU^4D1)M.04/$HP#6]=_-M)^3%VAH0=?XEYQD\NCZZO+R^.
MI;]69]H98N>.I"S;0_>N]9/0.W:'6\>WX]CW>HN3DV<)D1C9U!DB9S1"3G^P
M)/U>Z"4H#;W1JG-^>N&J4U@.F+?$,7910%R\S+ X03$.O!BY'HU7G)B;V/:7
MG1?YZ< +D1TF#O-0ZO56G^M$46+'=\ONRG.UN%A/2-CW!BFU$X^$2TJ?_YR3
M.'/^#^QC5OX*TI!\*^O2']=I*%UY#B7Q.$YP$$L7H8/^7'JSP@LD2DA2LC/-
M)/SQA\3L69=>F(Z>=P5W0':%9[?59SZ">2N[8. XSSV_/V#GN[B7#I9?P3B6
M*+[W8E90[ I=EBW96O40[LTDQ&$29P^)?#)>F:[A&(4$Q1Y/5Y]Y+%YZ!3O;
M)X[MHU^\-.==,?6&21_BTK?$87F:F0P^J&3,Y M'-L6S[ODMN&/L,2^FF"FV
M*[$WW4U=Z3Z8?.R'HUM>X+>L$&^S@FEER6@5:6<WY6Z'X[U)3\CPO5]B]5F3
M_EA2 *LN9?__K2B^,2_@APX7%'Y^%B/EMA23E#IX$BH3(JIL5N0H-]_^N%>>
MGM:YS'Y:MZ3W8Y9 ]LYAUE:841/;?S1P#Q?Y<]'"JZX3FV9*SLKI;CFK..CQ
M2&B'7G^&VGTPD:IH"IAHN8E,RP(3+3>1I>I@HJ4F:LNJ 29:82*C R9:;B*E
M#1%MA8G:"H"VRD0="/HK3-2108M6F$B3-3#1<A/IE@DF6FXB R+:2A.9H$4K
M3&1:8*(5)K)D:,:N,I&I@HF6FJBC*5!U7&DB\*(5)K(,T*+E)M)D=9]!FWKC
MVVGH#//!@/VQ),7\";.#3,7HV\J!O+^>\[/R+C<L,2S7'[Y>59+K?%"R]8.=
M_H/B5L\+6SPM.\K<9L;-IT+@D>.G;CZXM?D(-K--3)VL\'G9\ZD''KMD<O.X
M.$ ^'[1&(U.75HS2K\K96QQ$R?C=LVXR]V;3G*7AX>QX;GZ8AE[R7?J<AB$W
M%Z$#9$<VLP(:VI2998RRV3"YMZ/'O*,A'_="IQ[%3G(\3O!QVN]C>O/[A)FG
M#WEO>WY*,5<1$N%0^G!Q([F^OR.'=7'?3OVDY7N]'UY"/3Y\3B15EI79 ?HB
MQ6<,)YY*=@VUZ5CRB>UF7D4IH=W7 A/^>F&:3^PP)(GDA7%BAXG'U)!E8^'9
MYU?_._OOV:6LJV?219A/?Y&^7DURF!49TQ568DXFK/FTDJ^+[_?^Z.+R[)1?
MX(7WY YS29J-$\79=D19-''QKD1KKBF[4AJR#[R0930>!SWB=_.9+[<^(7=I
ME,]?N>V-;T,[P+<IUY7;'B%)G%"[^)1[!J8+,\JY* 6NB8%WS+JB&2;Z:'\$
MO %OP'M[O)_R-(_H;7'5M0XZYZ\ +  +P)8 [!11@H*PT3$1\XG^D>.P_P':
M#4>[,;"NIV%KHSV+E2B^31/9/<<%LAM.-@3MDLA^ E05U6R3-=+/1M@!8!L.
M;&,0K#@4/P5J\R \\TW077[=J,7RV\KSVYKD-_]"Z>,%Q? !SZ_:NO*R[S%F
MEY>L3BKZ$K+WQ+_'[B>;V@$(5<.%"FH6=1>*FR$E/^V>CU<HQ@;:.U<NJJDW
M/7W4N1VZ/@P=-EZ;7KK:[*X2M8 N0=T:9D=&UUX0^>PC@+SAD$,%I"3(?X.J
MDC -X *XC4.QZNC\#'!W$90U%9UZ]\PS@.R&DPTAN22RIY!J1/>E9JS9*[&9
M5!D(1$JX2#4&_#JI\08BE<,DK-IA <OB6:Z3BS=&=S9@V5K(,H#:0% ;@TKM
M@NYB4'<1='4%6*X;RQ!T]S3H3F"J).CJ;73.7X'6FM':&%[J%GF?$B4F_*HR
M:W)?C\.7-DNX,2[_\M6K7E!/ =6 ;G95-MO+9PD7JX(\J!/3C[.;<D7,;+^T
M-@0(& B8( &;P+2H#3&'YW\^ <^-;V5 G\!>]@ELPK/'BR^BK *R.!V5<,T_
MC'FMJ"LI;PK*XZXDOY'.N!OEAS=>@"7LVQ&K=+ 3D6)H4HR=#:I96^:F RH%
M*@4J58Y*=:KJN63WU@%4 !5 +0=47>!PH2I;*K ,+ /+I; \@:F2H N@ J@ 
MZOZ#JLC0V0:@ JBE@%K )*AVK"C <NU8;@Q--1L(*V 2Q;*FH*]7%^QZ!9 &
MI 'I,I">9FH+LF=&S=9)A:6C2T*BL]'\:7?%<6:LSSAF)=N5E(5).#@X*.QV
MP(^[VR1&^D.1\,A+,O?]<]>:IVH6.N>OH'8U4CMHC.QG8^2!)D$U&%57T.>3
M,ZB]U(SGQA!5L]K+$YX$$=UN:P_K UWF_O_)3H9 .! .A)= ^!*^FO!= KW3
M:5VG$:8G_.+R5^OA#T#'S(.X)09VPOX)T@72!=)5@G3-1TM0/44W+'2:1@ W
MP UPEP'W(T^"B.;[H '.@#/@7 +.!4RB6#;:Z")D)>(E8V :F :FRV#Z-ZBJ
MF"IHRB9B3P!F:\8L#-#MYP#=$YXJP;6CHX_D*Z9>'^)LW9AM##4UB[._0R6H
M#FVR</\9PYZ9@#5@70K6CSP)(QJ6DZ@=SE"SWM.:M;%X.8E=L&Q9Z,H.QT=T
M$)>^X(V,F%AMNN#-O-7X+LI=O<M28;F-/1"RQHA#G11[;2$K8-J#U;M6<KWA
MZEV*@,6[VK)JH*,!#ODT*Q KX6)5)X8;(ZSKBM4,5 V8L]B6.V;K:GPV<G#$
M)SV5/VF1/P&=\U?0*- HT*AM-:J@J8(1E[:LPVZ@0"J06@ZINLC=0-LR],<"
MR\!R22P+[8]MRY:)/L3T(_F,$V"Z9DPWAJIZ=4W.0%5)A1K K2^X$(SW-!@_
M ]P=!&5%D=%[#_LN@ U@ ]@E@#U%E"BJ506=\U<@&H@&HK<ENJ!)%,UM&9W8
MOO_13KQ[7,E4)G/#X?_Z#!$JFIQ?=T.RM.+G[Y1:\LZ*/"DOK5.S,>(!46C/
M.D *F,I<1K8"Y WMI2$/)$!]3%!]; *3H.J8JNCHZ!I65 6< ><R<'["DRBB
M50U](K''FU<?8OKL%M8Z32S+F&EBE9'LC]DZ;VLE6WM^JBVUDD1_L$Y($+%T
M]_QU$MY>IT4K9$*[JO)Y;>P5 @,$!@@,VP:&@B8Q6X2T54U'F3_0-$JXPKC_
ML3W>R357L(KCS#LJWC!D>=*$;A_25LTVXC: I<GW21$;HS)UDO[U%7$^6Z*J
MS29T:NT!VG7R^,;(T 9H"^W4:BL&^ALGV<2%4\RRR&PUR'8  ,*!<""\!,*7
M(R:*^XZ"KA,2W0R9,[@7(6]& .U .]"^+>USP!+%N"FC2Q(.;LBQET \%T]X
M8ZBIDY2M3_@,5L+X5J$=+I[J.CE[8Q1H ZK5]=;ZVN#>_Q4[>/"0#+$#!1VY
M@\[Y*^@6Z!;HUI:Z]4"3H$I(IZ.CZ[3'?J$J D@#TF4@/864(*XU67OHM;PB
MKM?W6.$ XH X(%X"X@OIJF(=#PWZ"8!<(+<D<E?T$VP#JJY8Z)_>#^PDO'^1
MCQP MC7#MC'@U*S3?CY:@NK6N@8!N79D0T#>SX!<P"2,91-8%L]R8_BHDVAM
MP+)97>4:0-T'4.ODOXT1E5)!W470M11@&5@&EDMA>0*3,)9-]+"#TR5Q;/X7
MP :P >RMP9Y#EB#*#07VI06P >Q2P"Y@$L5R6T;7"8ZNU(^ ,^ ,.&^+\R-/
MPHB&OC' &7 N"6>A?6.&!GUCC6>Y,716/"!5P"2*91.V06T\RQ"72V+9%+H-
MJ@D]8, RL%P.R^:2'K"M055A=B: "J"6 ZHJ=':FJ:O\JY3TF##;S&[Z!40#
MT4#TFD1/(26*:XO5Y;,5UOZF)(U.ALS2%,.T$0 < -\:\/EL55'5MF03762%
M!15NH!?H+8'>::0$A6=+MM![CWF$]PO3)UH"A /A0/C6A,^'2Q3K&HQ1 =O 
M=CEL:T+'J"Q316=!E(RO$]NYNZ&V@P%KP!JPWA;K6:[$$-Z1C39$:\ :L"X!
MZP>8*N@: U !5 !U%Z#N(.BJ.FR8"2P#RZ6P7,!41= %4 %4 '4'H#XOZ'YS
ML8\3_%TZY7]9FBLQ<I;T%DMZGHE69@T<MUA>6WE>6Y.\MK*\/EXPR6N+Y]5H
M?<8!N<=7&&4W*%F7#/0E9.^)?X_=(TKM\9F/ Y ID"F0J:UE:BY;HIH*%DP^
M![0![7+0MBI;JQ] !5 !U%V NH.@JRD*^OODQAX,L L\ \_ \Y8\/P5*&-,J
MWV'K)*44ATD^3>XD2F^\ *:T .* ^/:(+^1+&/$P$;5V>#<&L'KMQ/$ 4Q5-
M9P"UAJ!"'-[7."QRQGA',ZSLW\ R;'\%VU]MR_($)E$L6S#[90]8KI.+-T9W
MUF?9VG;VRY8LPVJ#>\!R8_BHDVAMP')EJPUV=/CZ]#Z "LMUOX#ENA]@$A1T
M=4-#I]X]WV$>D!:.=&.@>M&Q]S>FJ@C!A@QUY3W@M4YNW!AM69O7 B9!(1AV
MOP&6@>6R6!:Z^TW'U"$N \O <BDL%S")8MF ;J[&L[R^TQK/FX74&.S74T, 
MM;:@-L:CZU2[*%6_=A!T+<-"1TG"3IZ:I@UH-S@&0WVZ'+07L%5!_[0FJ]"G
MU7AN&T-BM2'Y 28Q(5F3=0-8!I:!Y5)8GL DBF6K@RY"GULP7]<;N&XVUU"W
M+HGK.6!54K%>!V#^8<R5I"NUWQ0XQUU)?B.=<7_)#[/O/V/?CF+LLG\@2[&D
M&#N@.Z [H#N@.P P  P "P?XF8V#[ W]+AUS8W$/9N]VN@0Q?Z>ILG(H(_;H
MV?1]P\Z0;*9!V5WGW#$_SASV,XY9L7<E9>&##PX."M\]X,?=]9,@_:%(>.0E
MF4?_N<=%H%12!/-LN^,B4&I3!&HE1:"*+P*U-D70KJ0(VML6P:>CZVMF_O4M
M/^?)>V/K3B6V[@BS]9PG[XVMM4ILK0FS]9PG[XVM]4ILK8N7<7VYC,_;SB()
MHE9@AUZ?W?&0WV37G=BJK*.OQ+<3UF2!+R[N15NT,>V[.C6ZUVZ+S@.KBLXD
M 'CO *Z37S=&;/858,,T849(TYEM#(75!MV"I95]OH%]AP\IYI:>KD[G3\X_
M8<^G=ACW"0VDQ M8X72LMAS,;NU6M"#^>N;/XK;/0UXDGCG.3)X4Z:<=2W%"
M*"L:+YS34UU6"G;0'LQSQ*Y/ K_<C$R]R1+*RI@W^^+NXO..OUQ<GLYSF&U-
MP7TL/T2CP.]JAMF5;H98ZA/?)S\?]% BCL-G$+O2SR%3#=9^Q$Z:%7TR]&*)
M#V9TRT]78M,!?E(LB+4NLV0J<IY,%G!^\A?^H=2?S'98;,4;DC %S"EI2X$7
MINQ"J</G/I#0G;YP;GO<(=&8J3![Y5E73*G/C!%SH5B9WTD9Y[LSLA(?9,WD
M5Q-_^N5%3SH]V+MG:.S\.]ZRJ&<HJMRY595V&[%;O7K%"W128@S:B;K]])(A
M*[VIHAXY..+G=%]MZ@-+4FV[=L3$X?<$%__/"M;H3)7K])F/)?RV9;][VXHH
M9J\]XH[9'P[JN_\#4$L! A0#"@    @ BJR$-\GNE=3I$   D>$! !(     
M         *2!     &5X96-U=&EO;E]L;V<N:'1M;%!+!08      0 ! $  
(   9$0     ! 
end

Mime
View raw message