harmony-alerts mailing list archives

Site index · List index
Message view « Date » · « Thread »
Top « Date » · « Thread »
From nom...@intel.com
Subject [build-test alert] FAILED Linux x86: jdktools-test debug
Date Tue, 04 Dec 2007 12:30:08 GMT

BUILD FAILED:
	Ant Error Message:
/export/users/cc/cc-common/scripts/cc-exec-adaptor.xml:104: The following error occurred while
executing this line: /export/users/cc/cc-common/adaptors/jdktools-test/adaptor.xml:28: The
following error occurred while executing this line: /export/users/cc/cc-common/build/checkouts/hdk/working_jdktools/build.xml:242:
The following error occurred while executing this line: /export/users/cc/cc-common/build/checkouts/hdk/working_jdktools/make/build-test.xml:98:
There were test failures.

Date of build:	2007-12-04 18:10:57 +0600
Time to build:	19 minutes 3 seconds
Last changed:	12/04/2007 15:02:57
Last log entry:	hdk

***********************************************************
Errors/Warnings:	(226)
            
Result: 1
========================================
Testing jdktools binaries...
========================================
Compiling JPDA tests
Since fork is false, ignoring memoryMaximumSize setting
----------
1. WARNING in /export/users/cc/cc-common/build/checkouts/hdk/working_jdktools/modules/jpda/test/common/unit/org/apache/harmony/jpda/tests/framework/DebuggeeRegister.java
(at line 58)
registered.add(debuggee);
^^^^^^^^^^^^^^^^^^^^^^^^
Type safety: The method add(Object) belongs to the raw type LinkedList. References to generic
type LinkedList<E> should be parameterized
----------
----------
2. WARNING in /export/users/cc/cc-common/build/checkouts/hdk/working_jdktools/modules/jpda/test/common/unit/org/apache/harmony/jpda/tests/framework/TestOptions.java
(at line 505)
internalProperties.put(name, value);
^^^^^^^^^^^^^^^^^^^^^^^^^^^^^^^^^^^
Type safety: The method put(Object, Object) belongs to the raw type HashMap. References to
generic type HashMap<K,V> should be parameterized
----------
----------
3. WARNING in /export/users/cc/cc-common/build/checkouts/hdk/working_jdktools/modules/jpda/test/common/unit/org/apache/harmony/jpda/tests/framework/jdwp/PacketDispatcher.java
(at line 114)
eventQueue.add(eventPacket);
^^^^^^^^^^^^^^^^^^^^^^^^^^^
Type safety: The method add(Object) belongs to the raw type List. References to generic type
List<E> should be parameterized
----------
4. WARNING in /export/users/cc/cc-common/build/checkouts/hdk/working_jdktools/modules/jpda/test/common/unit/org/apache/harmony/jpda/tests/framework/jdwp/PacketDispatcher.java
(at line 249)
replies.put(new Integer(replyPacket.getId()),
replyPacket);
^^^^^^^^^^^^^^^^^^^^^^^^^^^^^^^^^^^^^^^^^^^^^^^^^^^^^^^^^^^^^^^^^^^^^^^^^^^^^^^^^^^^^^^^^^
Type safety: The method put(Object, Object) belongs to the raw type Hashtable. References
to generic type Hashtable<K,V> should be parameterized
----------
5. WARNING in /export/users/cc/cc-common/build/checkouts/hdk/working_jdktools/modules/jpda/test/common/unit/org/apache/harmony/jpda/tests/framework/jdwp/PacketDispatcher.java
(at line 284)
commands.put(Id, command);
^^^^^^^^^^^^^^^^^^^^^^^^^
Type safety: The method put(Object, Object) belongs to the raw type Hashtable. References
to generic type Hashtable<K,V> should be parameterized
----------
6. WARNING in /export/users/cc/cc-common/build/checkouts/hdk/working_jdktools/modules/jpda/test/common/unit/org/apache/harmony/jpda/tests/framework/jdwp/PacketDispatcher.java
(at line 355)
commands.put(Id, command);
^^^^^^^^^^^^^^^^^^^^^^^^^
Type safety: The method put(Object, Object) belongs to the raw type Hashtable. References
to generic type Hashtable<K,V> should be parameterized
----------
----------
7. WARNING in /export/users/cc/cc-common/build/checkouts/hdk/working_jdktools/modules/jpda/test/common/unit/org/apache/harmony/jpda/tests/framework/jdwp/VmMirror.java
(at line 1834)
frames.add(frame);
^^^^^^^^^^^^^^^^^
Type safety: The method add(Object) belongs to the raw type ArrayList. References to generic
type ArrayList<E> should be parameterized
----------
8. WARNING in /export/users/cc/cc-common/build/checkouts/hdk/working_jdktools/modules/jpda/test/common/unit/org/apache/harmony/jpda/tests/framework/jdwp/VmMirror.java
(at line 1902)
vars.add(var);
^^^^^^^^^^^^^
Type safety: The method add(Object) belongs to the raw type ArrayList. References to generic
type ArrayList<E> should be parameterized
----------
9. WARNING in /export/users/cc/cc-common/build/checkouts/hdk/working_jdktools/modules/jpda/test/common/unit/org/apache/harmony/jpda/tests/framework/jdwp/VmMirror.java
(at line 2122)
fields.add(superClassFields.toArray()[i]);
^^^^^^^^^^^^^^^^^^^^^^^^^^^^^^^^^^^^^^^^^
Type safety: The method add(Object) belongs to the raw type ArrayList. References to generic
type ArrayList<E> should be parameterized
----------
10. WARNING in /export/users/cc/cc-common/build/checkouts/hdk/working_jdktools/modules/jpda/test/common/unit/org/apache/harmony/jpda/tests/framework/jdwp/VmMirror.java
(at line 2132)
fields.add(field);
^^^^^^^^^^^^^^^^^
Type safety: The method add(Object) belongs to the raw type ArrayList. References to generic
type ArrayList<E> should be parameterized
----------
----------
11. WARNING in /export/users/cc/cc-common/build/checkouts/hdk/working_jdktools/modules/jpda/test/common/unit/org/apache/harmony/jpda/tests/jdwp/DebuggerOnDemand/OnthowDebuggerLaunchDebuggee.java
(at line 94)
class ExceptionForDebugger extends Exception {
^^^^^^^^^^^^^^^^^^^^
The serializable class ExceptionForDebugger does not declare a static final serialVersionUID
field of type long
----------
----------
12. WARNING in /export/users/cc/cc-common/build/checkouts/hdk/working_jdktools/modules/jpda/test/common/unit/org/apache/harmony/jpda/tests/jdwp/Events/ClassUnloadDebuggee.java
(at line 32)
import java.util.LinkedList;
^^^^^^^^^^^^^^^^^^^^
The import java.util.LinkedList is never used
----------
13. WARNING in /export/users/cc/cc-common/build/checkouts/hdk/working_jdktools/modules/jpda/test/common/unit/org/apache/harmony/jpda/tests/jdwp/Events/ClassUnloadDebuggee.java
(at line 97)
boolean isOutOfMemory = false;
^^^^^^^^^^^^^
The local variable isOutOfMemory is never read
----------
14. WARNING in /export/users/cc/cc-common/build/checkouts/hdk/working_jdktools/modules/jpda/test/common/unit/org/apache/harmony/jpda/tests/jdwp/Events/ClassUnloadDebuggee.java
(at line 171)
public Class loadClass(String name) throws ClassNotFoundException {
^^^^^
Type safety: The return type Class for loadClass(String) from the type ClassUnloadDebuggee.CustomLoader
needs unchecked conversion to conform to Class<?> from the type ClassLoader
----------
15. WARNING in /export/users/cc/cc-common/build/checkouts/hdk/working_jdktools/modules/jpda/test/common/unit/org/apache/harmony/jpda/tests/jdwp/Events/ClassUnloadDebuggee.java
(at line 179)
public Class findClass(String name) throws ClassNotFoundException {
^^^^^
Type safety: The return type Class for findClass(String) from the type ClassUnloadDebuggee.CustomLoader
needs unchecked conversion to conform to Class<?> from the type ClassLoader
----------
----------
16. WARNING in /export/users/cc/cc-common/build/checkouts/hdk/working_jdktools/modules/jpda/test/common/unit/org/apache/harmony/jpda/tests/jdwp/Events/CombinedEvents002Test.java
(at line 100)
boolean expectColocatedEvents = (testedMethodStartCodeIndex == testedMethodEndCodeIndex);
^^^^^^^^^^^^^^^^^^^^^
The local variable expectColocatedEvents is never read
----------
----------
17. WARNING in /export/users/cc/cc-common/build/checkouts/hdk/working_jdktools/modules/jpda/test/common/unit/org/apache/harmony/jpda/tests/jdwp/Events/CombinedEvents003Test.java
(at line 53)
private boolean eventMethodExitReceived = false;
^^^^^^^^^^^^^^^^^^^^^^^
The field CombinedEvents003Test.eventMethodExitReceived is never read locally
----------
18. WARNING in /export/users/cc/cc-common/build/checkouts/hdk/working_jdktools/modules/jpda/test/common/unit/org/apache/harmony/jpda/tests/jdwp/Events/CombinedEvents003Test.java
(at line 76)
int EXPECTED_EVENTS_COUNT = EXPECTED_EVENTS_ARRAY.length;
^^^^^^^^^^^^^^^^^^^^^
The local variable EXPECTED_EVENTS_COUNT is never read
----------
----------
19. WARNING in /export/users/cc/cc-common/build/checkouts/hdk/working_jdktools/modules/jpda/test/common/unit/org/apache/harmony/jpda/tests/jdwp/Events/CombinedEventsTest.java
(at line 84)
int EXPECTED_EVENTS_COUNT = EXPECTED_EVENTS_ARRAY.length;
^^^^^^^^^^^^^^^^^^^^^
The local variable EXPECTED_EVENTS_COUNT is never read
----------
20. WARNING in /export/users/cc/cc-common/build/checkouts/hdk/working_jdktools/modules/jpda/test/common/unit/org/apache/harmony/jpda/tests/jdwp/Events/CombinedEventsTest.java
(at line 212)
int EXPECTED_EVENTS_COUNT = EXPECTED_EVENTS_ARRAY.length;
^^^^^^^^^^^^^^^^^^^^^
The local variable EXPECTED_EVENTS_COUNT is never read
----------
21. WARNING in /export/users/cc/cc-common/build/checkouts/hdk/working_jdktools/modules/jpda/test/common/unit/org/apache/harmony/jpda/tests/jdwp/Events/CombinedEventsTest.java
(at line 348)
int EXPECTED_EVENTS_COUNT = EXPECTED_EVENTS_ARRAY.length;
^^^^^^^^^^^^^^^^^^^^^
The local variable EXPECTED_EVENTS_COUNT is never read
----------
22. WARNING in /export/users/cc/cc-common/build/checkouts/hdk/working_jdktools/modules/jpda/test/common/unit/org/apache/harmony/jpda/tests/jdwp/Events/CombinedEventsTest.java
(at line 732)
String failureMessage = "## FAILURE during checking events! !";
^^^^^^^^^^^^^^
The local variable failureMessage is never read
----------
23. WARNING in /export/users/cc/cc-common/build/checkouts/hdk/working_jdktools/modules/jpda/test/common/unit/org/apache/harmony/jpda/tests/jdwp/Events/CombinedEventsTest.java
(at line 894)
String failureMessage = "## FAILURE during checking events !";
^^^^^^^^^^^^^^
The local variable failureMessage is never read
----------
----------
24. WARNING in /export/users/cc/cc-common/build/checkouts/hdk/working_jdktools/modules/jpda/test/common/unit/org/apache/harmony/jpda/tests/jdwp/Events/CombinedEventsTestCase.java
(at line 135)
long methodStartCodeIndex = lineTableReply.getNextValueAsLong();
^^^^^^^^^^^^^^^^^^^^
The local variable methodStartCodeIndex is never read
----------
25. WARNING in /export/users/cc/cc-common/build/checkouts/hdk/working_jdktools/modules/jpda/test/common/unit/org/apache/harmony/jpda/tests/jdwp/Events/CombinedEventsTestCase.java
(at line 187)
long methodStartCodeIndex = reply.getNextValueAsLong();
^^^^^^^^^^^^^^^^^^^^
The local variable methodStartCodeIndex is never read
----------
----------
26. WARNING in /export/users/cc/cc-common/build/checkouts/hdk/working_jdktools/modules/jpda/test/common/unit/org/apache/harmony/jpda/tests/jdwp/Events/ExceptionTest.java
(at line 188)
long frameID = reply.getNextValueAsFrameID();
^^^^^^^
The local variable frameID is never read
----------
----------
27. WARNING in /export/users/cc/cc-common/build/checkouts/hdk/working_jdktools/modules/jpda/test/common/unit/org/apache/harmony/jpda/tests/jdwp/ThreadReference/FramesTest.java
(at line 450)
frames.add(new FrameStruct(frameID, loc));
^^^^^^^^^^^^^^^^^^^^^^^^^^^^^^^^^^^^^^^^^
Type safety: The method add(Object) belongs to the raw type Vector. References to generic
type Vector<E> should be parameterized
----------
----------
28. WARNING in /export/users/cc/cc-common/build/checkouts/hdk/working_jdktools/modules/jpda/test/common/unit/org/apache/harmony/jpda/tests/jdwp/share/JDWPUnitDebuggeeProcessWrapper.java
(at line 233)
argv.add(val);
^^^^^^^^^^^^^
Type safety: The method add(Object) belongs to the raw type Vector. References to generic
type Vector<E> should be parameterized
----------
29. WARNING in /export/users/cc/cc-common/build/checkouts/hdk/working_jdktools/modules/jpda/test/common/unit/org/apache/harmony/jpda/tests/jdwp/share/JDWPUnitDebuggeeProcessWrapper.java
(at line 253)
return (String[])argv.toArray(args);
^^^^^^^^^^^^^^^^^^
Type safety: The method toArray(Object[]) belongs to the raw type Vector. References to generic
type Vector<E> should be parameterized
----------
29 problems (29 warnings)
JPDA exclude list: /export/users/cc/cc-common/build/checkouts/hdk/working_classlib/deploy/build/jdktools.jpda.exclude
Running JPDA tests
Debugger JVM=/export/users/cc/cc-common/build/checkouts/hdk/target/hdk/jdk/jre/bin/java
Debuggee JVM=/export/users/cc/cc-common/build/checkouts/hdk/target/hdk/jdk/jre/bin/java
SAMSA exclude list: /export/users/cc/cc-common/build/checkouts/hdk/working_classlib/deploy/build/jdktools.samsa.exclude
Running SAMSA tests
test.jre.home=/export/users/cc/cc-common/build/checkouts/hdk/target/hdk/jdk/jre
Run jdk/bin/java -version in /export/users/cc/cc-common/build/checkouts/hdk/working_jdktools/build/test_report
java version "1.5.0"
pre-alpha : not complete or compatible
svn = r600847, (Dec  4 2007), Linux/ia32/gcc 4.1.0, debug build
http://harmony.apache.org
Run jdk/bin/javac -version in /export/users/cc/cc-common/build/checkouts/hdk/working_jdktools/build/test_report
Run jdk/bin/javah in /export/users/cc/cc-common/build/checkouts/hdk/working_jdktools/build/test_report
Run jdk/bin/javadoc in /export/users/cc/cc-common/build/checkouts/hdk/working_jdktools/build/test_report
Run jdk/bin/jarsigner in /export/users/cc/cc-common/build/checkouts/hdk/working_jdktools/build/test_report
Run jdk/bin/keytool -help in /export/users/cc/cc-common/build/checkouts/hdk/working_jdktools/build/test_report
Compiling TOOLS tests
Since fork is false, ignoring memoryMaximumSize setting
----------
1. WARNING in /export/users/cc/cc-common/build/checkouts/hdk/working_jdktools/modules/tools/src/test/java/org/apache/harmony/tests/tools/javah/Test/Test01.java
(at line 24)
private static final long xxx2 = 1;
^^^^
The field Test01.xxx2 is never read locally
----------
1 problem (1 warning)
TOOLS exclude list: /export/users/cc/cc-common/build/checkouts/hdk/working_classlib/deploy/build/jdktools.tools.exclude
Running TOOLS tests
test.jre.home=/export/users/cc/cc-common/build/checkouts/hdk/target/hdk/jdk/jre
The test report is in /export/users/cc/cc-common/build/checkouts/hdk/working_jdktools/build/test_report/html/index.html
The execution FAILED with the following exception:
The following error occurred while executing this line:
/export/users/cc/cc-common/adaptors/jdktools-test/adaptor.xml:28: The following error occurred
while executing this line:
/export/users/cc/cc-common/build/checkouts/hdk/working_jdktools/build.xml:242: The following
error occurred while executing this line:
/export/users/cc/cc-common/build/checkouts/hdk/working_jdktools/make/build-test.xml:98: There
were test failures.

***********************************************************
Unit Tests: (160)
        
failure: testThreadGroup002 org.apache.harmony.jpda.tests.jdwp.ThreadReference.ThreadGroup002Test
Unit Test Error Details:	(1)
                
Test: testThreadGroup002Class: org.apache.harmony.jpda.tests.jdwp.ThreadReference.ThreadGroup002Testjunit.framework.AssertionFailedError:

testThreadGroup002 FAILED:
## Unexpected thread status found out for some tested threads!

	at org.apache.harmony.jpda.tests.jdwp.share.JDWPTestCase.printErrorAndFail(JDWPTestCase.java:753)
	at org.apache.harmony.jpda.tests.jdwp.ThreadReference.ThreadGroup002Test.testThreadGroup002(ThreadGroup002Test.java:286)
	at java.lang.reflect.VMReflection.invokeMethod(VMReflection.java)

***********************************************************
Modifications since last successful build:	(1)
            
add cc-hdk log20071204150257Lbuild.485 12/04/2007 15:02:57hdk

begin 644 execution_log.zip
M4$L#! H    ( ,&3A#>T=ZSS9!(  -Q^   2    97AE8W5T:6]N7VQO9RYH
M=&UL[5U[4^.XEO^;? K=N;5UH8HX;_*8-%LLT-/T- U+:&:WNGHI82N)P;%\
M)1O([9KOON=(=A([B1- ,.FNF^JF_)".CO0[+QW+<G<8CKS][@UWQOO=0+#]
M+B4R''OLW3_ZW ^+TOT7ZY!6^3]^_<=^(0H<&K*BO/<[A4)1LC *BK?.7<BY
M)XL/$B_&1=)71005CJ+ <VVXZ9! \%MFA\2G(T9<G[BC@(O0(N?Q]4L>%#^Q
M>^9AR8")<$P<UG=]-W2Y+_4QD.F[0H98O\0>D4 IDDS(DFW#OZ+-1R/NEZ0M
MW""4I9B0RZ3U./((]1U"!Q3;SJU^$[F>4[*'S+[C$9 9.G>E!R[N7']PG?2Q
M-*)W+-- H1 R&78*!']?F3WDWTCAW9J_PB74A19(T@*Y<7TJD+1EK4^E8'N,
M^D5D1!:!^R "A@HV#\;%6\&*?==C"(X]''$G?24NTM&]*,+]2-U1G1G=.:[X
M1@X%4UC"2>?%(Z@+86/7@B&EMVA*%@KJ1(]0&JM#/@I<#S'X>'YT0'3QM^"I
M9'M42A8W=DOOJ3W+3;59(9)'PF9$H45"_NJM]UP?FX-JQ)6D3SW)=HD[\+E 
MCD9LQ,7XE#ZZHVC4 VM!P"Z@]*9H%">_U.6*1?XXN/A\\ODW(WJHY;1T"S9(
M]:<4UX[ <I2X&)1H0(%&:4@%7!Y/"\I27X M0HJE(W83#0:,7;"!*T,F+.0U
MQ379IB$!.!AIM'92=[9$7(DY%G6<;2>FM?,K29?[OR6_5*G+<0"C2?LL''?(
MY9#!6(=##H8+*)_=H*7<(3?,X_Y R4$()01]("%6^^3Z=\SY!,Q8Y(+U@2, 
M414;,)\)U\X6ZQ[O$SGDD>< 31)0' _H" #JK(/DDLO5#008K>M9H%Q)+K;E
M1@9<UX<!\:EW/C7U8%.WT8OMDGOJ18#S>C _%7%L1B.^2U8A_X'*X2D-<F&/
MRW1_W[UZ#=1K&XCZK?,0E,ZI?<?"(U<&-(0:N;I=J=0S^$-$XH?_';&(*>56
MIYKB$W WJ.$K=?O%6EW_&8"LUMMS5AI"T41[V0,Y <4>,+&-U\>:M#5@X8FS
MO;.SFZ:ZXC=#X1FVX)F_5S$A(;WQV$HCHDJ]V(PT?@HQ:V7M!38+$PTM9R?.
M+HDOK"T9/SRP>S\#L+5&-A#X-[!++C<W%>^KT:DK!,]W^*U:5H,5%:F\O3I<
M"; Q[WX@!!VO=/&34B_T\ZT?&K=VN9K![9X*C1H<Y&+V@^+5_I'QJE:J6;SZ
M+O,<C9B,8&YUB&F(]_IBR-6H;>]\=;\].Z;Z07&NE']LH&LY0*O#G]6@+L-S
M<Q)>"L4XUR7._".& 4SIS(<!?4@N?Z*1;P^3A%@>U.VYV!<UF!P_VDQE6MYS
MD1 E[#%D$#Q-;Y+OZ;IZ*K5:C8>8:Q0N]=Q_85!#<MIT.(#M\Y X#$H)1O I
M!PT!]K[K4R^F<P4P0,4O)T=$22?A?2T6*%(O@7USTF *]F/,7,B2LK)??(]3
M9QV,YY19/[8A>&I%H>M9TVSBKXL070_2'*J8?_;9/> )0[>> =V<5-0+1K[=
MS(S\#7##J _C<1:%9_U3E8,G[W1R?O'8D_Q1][@-:@#ADJM4*4UX,NR"T?6&
M?7,21R\8]DJSDAGW(+KQP&8H.@3)J*/M7J@>A6 B> >\CN /4I?YS,/W//*=
M%::.K.'J! LCX6MSI-OO<S''PP[I"SY2GF]:,M/CPTB&?/0)+@&B/F-@BM',
M P+,@9FL?Z^M(/I&.(-61GBH*'7_<W]1 YK66H*Q.:F>%PE&-J.8$@QP*7^Y
M8&1YV'3!6"8OFY-!2LD+']W@$@1]6BY7\9E2KL24RTM,./0(XM9#C@8X3"B"
M*=_&5IESJB+<7D@%E''8B>^P1_+N'9F]>PQ0)_>R ?5"Z[^N%UC,VY.]P3)L
M-R=;E(=M;16VC5K6& CW'L:+3"!&2C%4CVYXP6SFWH-*Y?OK7.068*<CUL7<
M+^,@!:5&WQNOA=WF9(Q>A%US;_X9+SG^G_/CP\OCH^OCJ^//E[WKP[,OGR\!
MK>SU@XN+@_^U/.8/PN$"$)^E<HO;-J9RFY,X6@[;*LSFGK/\))A5-R?9\WQP
MJI6Y6>)/@LZ&I6Z>A4ZMGEVP]+.@LZ$9EB>ATYS+L,3SASYUO4BP4R8E'3! 
MYI>__YV\/SCY].7BF#B1*J-ZA ?*U\N_D;_]LDX29A4^F::?#LR&)F">YG'F
MTIO/!V9#<%D&UX8F;N;@.J0R?XI>RSZTQQQN_, @.YU252YQ7"]P_0ZN_?G,
M'L,K7-)W )-8?["]<%[U'(.WD(.GJ]6&YE&>CE,KF]O,PTG\(/ L0VTSLQF3
M)-3*+$8K&SXHL-2CP9.C)?B\UW=S(5II[>(6C &Q8:F'RR%V:/)<LJ3&;*5;
MJC>R2:69]2JXKE&1 5<5V>%V/(2[.+0[?_US]"NXRT7NLUA=Y)76I6]8_D+"
M#5;Z>/3'^1>HD61DSP6'@9%_"!H$*Q8?UK))*"H&]_$2&.]MEL"\%:35#4MB
MO!B[N01BG-*/4_=?O^TH,).%,' BEZ5Y)[]GJF[2AL8:6MX M/$E0' "(TFV
MX>2!"A\&1>X4"@&X&QCZ(GNTO<AAZ3>XU'M;\1T89QD^^S4MM:S <V]*#G@W
M/H[+)O)CH3A8<4/J5<=%[Y-=1+Z_X&VRY#8ADY4*'Z].WSV140A6P.6JPUO\
M#]((45AI(G)SK;#7:.7K+2K,M*N@.9;6'"O6'#U4JO<6:HYUY8HPHMXI% )%
ML.+E%^CV4A3Q@B3X$BFI[)+W>N8C.Z2\2XYQ#9(^O'1'C#"/!I(Y';)GM:I$
M,OO%A.I6M=XT1*G<-L53O=8V1&EOKV*$4LUJ[YGJ7:N\9XA2+;=SM74)5:I6
ML]S((U5=EU3+:N13>HH\F1',/6NO96J8ZODB7E^7% 1H-4/=@W&JF:$$,EZI
M&^*IF3OD:Q-J6)5*KK+LK=VYNM6HYZK+$V2\8LQF5O)Y6IM2&^QXS1A/I@A5
M3)G,2KX*KZUW%7"<AL8)M,64DRJ7S;%DS'&VC$E!S5CO*L9,9M.4LI3-*8NI
MSM6K9HPO>A8SU@EMBK&HH)WK$)Y@Q?=:QD:\::IWU88I!:[53!G?<M64C)?K
MQBBUC,FX,9;*YI3%V*3%D (#I8:I24NY9HJ2N?BBW#3F6<IF!!-&W)R(M\R8
MIZK5-F0*4#+-2 '&/,9<L"&]0\DT!5W%F#C5C'E@0^$J4C(F!(;BBP;,RW,I
MK9TMJ((S;YJR="U#=ARZ9XA2TVJTC4TXC3D$0X8.G90I0L;2AA5C/JJ6'ZDT
MUE:[BM5JF,MB&1,G8[GQ6L4,3RVK82A4J4#WJN9(&4KU(*FZ.:Z,S3K;IA)^
M93.S,B!DR"4TK&9C_5&JY+N$!<@=]R[7><256=D1G_\F>!3$KPVI]8+'1R9\
M8'[N?6TTFU8KWY(^B9*98 &DOMHR%@LUC 7IAK(12&GC'L,9BM'-1=85:\\4
M<+6&L9RKL2FVL1"V73<FE<8>==0;IB;K-4,1%<KELG%:8).?OZ[A _=F5L0:
M\)'-_ SO^@]^F];>$YQDOJ6O&;)@>U;#D*CL67N&)DY R5 6%(7.4.\ O/R'
M?D^9JM;,= \H-0R)0=.J-\TPI4B9$JF&L21VV]#SASU,@FFF"B&/[&$Q?CE$
MJAW=.\E5I@A,KK')SNZ=%4OI>@>GO;=92R?I2$X7TR$'-O=M"@/SF0,#KMX6
M7^]\CEOX^YSX#%^$)R%[#'>)P]5V"SP<X@;DJQ;CZ7ZI JG[>,6Z%6#?^8B]
M?)E<MFW<UG^R=(X4DUT5#"QE7;R-/C3]R.QOY$ Y+?)!.RVB-W=B@G3(MKU#
M#GDP%NY@&))*NPVR5RV7FVIE:%RMQ_OA ^Z<I/:MH&K/"BZ("^+JN3;S)<C6
M+J& 2Z"^\X![4:::5[U-.OM+Q6I8Y5](J@0(89%ZP9 "2[A7$W0]\%C(L!T\
MAD:!:JJ*O/?QM8.]<KE5;^Z2[2-F$U)7S._LXN[FT6/)I;5J:6#;&-%:H#UJ
M4W:BQBI%:QB&0:>4+/--?#RX^UP [3=$\-CV7-!Y\A&'4G\4 / K6\TF  8Q
M+?9NBN/)?YW"F0AP-,H:4(L<>!Y1M\'*,&#RGCE6;O^&K]^MCY]/BNJ;(V3(
MU-XC6L'56F**BXQ3I5,G7_#MM\ZBF"Q>G(L]L$[Q0Q]?N=[S_1OIZHW"<%<6
MN;^<]J1"ZBHAQ1O.0T4")')(NOAW7ZG*P(4HCZBK#RX,-*YWAOXRWT$+Q3-T
M%O]PD;7#^C3RPGA#,Z27,P3 T!PS^%O"$"Y'?VU^..DBA/LI0BAY2$Q_B63"
MCV".*YB--MSUG\"3#)CM]EWU&9BLJ<GRXY"N;H2+\82IA)^4S"5<V?'G/4!N
M4HVMQ=ZD+?(P=.WA/-$^F$W]+A.^(D#%.)]]UP=%R#9RHB[&W^N8$3?UU@$T
M0J.0C\!BJBT]\NF#_;KA8%:R<.%N12+VE:CM,(/)YS6E6+.T5-"@=M/#C4HB
MX(C\$R9(&K^92FL-K\1010WDS1CW\0.]S^!_P22(*X10N9;-X?8;V#9HZ @;
MTML/NNC1<""!^S$+<_@#ES) A-^ 0]'330V9%U@+S.O6E)OOL4W\DWP\N%"A
M) $8:1JXF?(H6VY_O*#><BF*ZVS!C\35 66DYV!M,E>[>,?&$O2-D6YR=*WL
MX)9ZCU"'*EKVDOOI^NJ2>F5E2@!/@8"ZNKIR@"(\V[J4 (,#!":\)=?F6)_4
MG:FV19)-A.#ZI"K9!M/AN/T^R('>;FM!DSL9]M3  2+:)E^CGB%]]>VMN&.Y
M@PLW%<Z+JUN]]RH2MXX@E%8V= Y+95NV5)?XO0LS".HXZDM>U(N=0;9!#Q0D
M70.ZRQX2UP%G 9=R+A@LVDQ 7*,$QW%EX-$QP4M@9G#_*DFV08/ 5((W3.02
M64]XS Q<*"GI7O8.KK]<?-I'DBE9@AD8($]' 1K:(1=N.)ZKCFUK$GATK11E
M5B+4A00#*#;+;)H8C,/CF'2''%081@\B-[G_O=-%7=[_4PT3W%;1'&@Q%")Q
M(=4_++5+F#6P=$%+%[3 A'0JU5I]05-:%_#O!/!914BUM_WA\O(<0_3>V>'O
MO9TY:@B@T#9>^P>D-K7Y2-,6XR#D T$#\)>*+LPH$O#%8HJJ;C?A+KFJ2&8T
M3"YFXDD\J#WU1M2G W2&BPW!M*$T;U,+L)Q)4#)37*+YUT*.:DU#3 0L;2S-
MZ:1"'JLHI.9YG=73Y>W-LCM;)8_?D6.>VU&\[8;C#F:S!]D&TZ.;KK28Y;E 
M (0'G3@IHG-^_6 @=?)[W':DHH#4K82M[\5N_.T+;2C^G+VB?3Y>Z^K#:_61
MK/T_+<LBQ8]=#,*20CE<^/S!3[ZP(=-L;"GI$.R?6UN_Z=DB2XD%W(F2E/M,
M'1PA6WA;6X=XE/81@MTG=AYWB(YDMK+:!S.$NOI@JMXA!W/+PZ&6%HB],S4=
MALD,\"07;,3O&0$G!U,$Y<87&I2MHH8::ARK@U37L#7E<-'TRM#A4;8]F#\#
M7:C=8S#S4(QB61U0N"*97T-/,Q51U*#:Y1""5B5VB>1R'2,2&!N:()*IJW=O
MAMHG>AMGFF)ZVQ["5'P'"5%RV+O0&T9D2 "#ML=]&*G))T.A-+*M1FR^M I]
M'$23^H-TQ)0I#$&5']H*OG,\Q%'48Y=A5*$R%PMM%27S^KK^1-X@-H6+<9R5
M(J),Q21K"6QEB2618YKYG'!Q:QH;7R61\6R+:GB7J]('!"]'F[61^9Y1Z70*
M"L*(SE:FAI:T=+N9!/,:7]J\/#O[U)O]U&;\!OBT1./?W[Y<M8N!/I/"UEL9
M8%N+]C#0/=:%58Y,?151_2E7\C^FMF2ST]1V^FI;F,?'QRIY1RJKMBJ8_!;N
M!*.W-8T94R2?OVEILI, V:XD^PBLVD9 "^5;//O0?]_JV4=6V5[SV<<:3]"G
M0X!;_LOX83H$(#TTAGH;Z1X%T/.>H*^]+*EJ5=K&UA 8>B^\G*RH??8S/!W7
M%,%8%=DH",=X*<X'3BYDSS$75]1Q8*>@V==GT E!?:DW^09&.Z11:[=&:6%!
M_40>B*Z#FOD:$6H)OU%><G$K+@L/"P4),^YPPG<!_,_T1(^"&AJA\X"% C**
M?BE2<9U>W*'=LTI(<LQUJBWZDIVP.JK*S T<=\)M.Q("-.YAZ'H3BG [Q% )
M[6.GD--[ZE"88@@YT7G%97(9/QO>J;;T=BR&6UY_W#47]>I?QX;ZFOHT7% ,
MM?6P0%CT@'^4S"4*8A6Z);K?+:F/UY?TA^R5Q.S_/U!+ 0(4 PH    ( ,&3
MA#>T=ZSS9!(  -Q^   2              "D@0    !E>&5C=71I;VY?;&]G
;+FAT;6Q02P4&      $  0!     E!(      
end

Mime
View raw message