harmony-alerts mailing list archives

Site index · List index
Message view « Date » · « Thread »
Top « Date » · « Thread »
From nom...@intel.com
Subject [build-test alert] FAILED Linux x86_64: jdktools-test debug
Date Tue, 04 Dec 2007 09:45:50 GMT

BUILD FAILED:
	Ant Error Message:
/export/users/cc/cc-common/scripts/cc-exec-adaptor.xml:104: The following error occurred while
executing this line: /export/users/cc/cc-common/adaptors/jdktools-test/adaptor.xml:23: The
following error occurred while executing this line: /export/users/cc/cc-common/build/checkouts/hdk/working_jdktools/build.xml:242:
The following error occurred while executing this line: /export/users/cc/cc-common/build/checkouts/hdk/working_jdktools/make/build-test.xml:97:
There were test errors.

Date of build:	2007-12-04 15:27:57 +0600
Time to build:	17 minutes 46 seconds
Last changed:	12/04/2007 15:06:25
Last log entry:	hdk

***********************************************************
Errors/Warnings:	(226)
            
Tests FAILED
========================================
Testing jdktools binaries...
========================================
Compiling JPDA tests
Since fork is false, ignoring memoryMaximumSize setting
----------
1. WARNING in /export/users/cc/cc-common/build/checkouts/hdk/working_jdktools/modules/jpda/test/common/unit/org/apache/harmony/jpda/tests/framework/DebuggeeRegister.java
(at line 58)
registered.add(debuggee);
^^^^^^^^^^^^^^^^^^^^^^^^
Type safety: The method add(Object) belongs to the raw type LinkedList. References to generic
type LinkedList<E> should be parameterized
----------
----------
2. WARNING in /export/users/cc/cc-common/build/checkouts/hdk/working_jdktools/modules/jpda/test/common/unit/org/apache/harmony/jpda/tests/framework/TestOptions.java
(at line 505)
internalProperties.put(name, value);
^^^^^^^^^^^^^^^^^^^^^^^^^^^^^^^^^^^
Type safety: The method put(Object, Object) belongs to the raw type HashMap. References to
generic type HashMap<K,V> should be parameterized
----------
----------
3. WARNING in /export/users/cc/cc-common/build/checkouts/hdk/working_jdktools/modules/jpda/test/common/unit/org/apache/harmony/jpda/tests/framework/jdwp/PacketDispatcher.java
(at line 114)
eventQueue.add(eventPacket);
^^^^^^^^^^^^^^^^^^^^^^^^^^^
Type safety: The method add(Object) belongs to the raw type List. References to generic type
List<E> should be parameterized
----------
4. WARNING in /export/users/cc/cc-common/build/checkouts/hdk/working_jdktools/modules/jpda/test/common/unit/org/apache/harmony/jpda/tests/framework/jdwp/PacketDispatcher.java
(at line 249)
replies.put(new Integer(replyPacket.getId()),
replyPacket);
^^^^^^^^^^^^^^^^^^^^^^^^^^^^^^^^^^^^^^^^^^^^^^^^^^^^^^^^^^^^^^^^^^^^^^^^^^^^^^^^^^^^^^^^^^
Type safety: The method put(Object, Object) belongs to the raw type Hashtable. References
to generic type Hashtable<K,V> should be parameterized
----------
5. WARNING in /export/users/cc/cc-common/build/checkouts/hdk/working_jdktools/modules/jpda/test/common/unit/org/apache/harmony/jpda/tests/framework/jdwp/PacketDispatcher.java
(at line 284)
commands.put(Id, command);
^^^^^^^^^^^^^^^^^^^^^^^^^
Type safety: The method put(Object, Object) belongs to the raw type Hashtable. References
to generic type Hashtable<K,V> should be parameterized
----------
6. WARNING in /export/users/cc/cc-common/build/checkouts/hdk/working_jdktools/modules/jpda/test/common/unit/org/apache/harmony/jpda/tests/framework/jdwp/PacketDispatcher.java
(at line 355)
commands.put(Id, command);
^^^^^^^^^^^^^^^^^^^^^^^^^
Type safety: The method put(Object, Object) belongs to the raw type Hashtable. References
to generic type Hashtable<K,V> should be parameterized
----------
----------
7. WARNING in /export/users/cc/cc-common/build/checkouts/hdk/working_jdktools/modules/jpda/test/common/unit/org/apache/harmony/jpda/tests/framework/jdwp/VmMirror.java
(at line 1834)
frames.add(frame);
^^^^^^^^^^^^^^^^^
Type safety: The method add(Object) belongs to the raw type ArrayList. References to generic
type ArrayList<E> should be parameterized
----------
8. WARNING in /export/users/cc/cc-common/build/checkouts/hdk/working_jdktools/modules/jpda/test/common/unit/org/apache/harmony/jpda/tests/framework/jdwp/VmMirror.java
(at line 1902)
vars.add(var);
^^^^^^^^^^^^^
Type safety: The method add(Object) belongs to the raw type ArrayList. References to generic
type ArrayList<E> should be parameterized
----------
9. WARNING in /export/users/cc/cc-common/build/checkouts/hdk/working_jdktools/modules/jpda/test/common/unit/org/apache/harmony/jpda/tests/framework/jdwp/VmMirror.java
(at line 2122)
fields.add(superClassFields.toArray()[i]);
^^^^^^^^^^^^^^^^^^^^^^^^^^^^^^^^^^^^^^^^^
Type safety: The method add(Object) belongs to the raw type ArrayList. References to generic
type ArrayList<E> should be parameterized
----------
10. WARNING in /export/users/cc/cc-common/build/checkouts/hdk/working_jdktools/modules/jpda/test/common/unit/org/apache/harmony/jpda/tests/framework/jdwp/VmMirror.java
(at line 2132)
fields.add(field);
^^^^^^^^^^^^^^^^^
Type safety: The method add(Object) belongs to the raw type ArrayList. References to generic
type ArrayList<E> should be parameterized
----------
----------
11. WARNING in /export/users/cc/cc-common/build/checkouts/hdk/working_jdktools/modules/jpda/test/common/unit/org/apache/harmony/jpda/tests/jdwp/DebuggerOnDemand/OnthowDebuggerLaunchDebuggee.java
(at line 94)
class ExceptionForDebugger extends Exception {
^^^^^^^^^^^^^^^^^^^^
The serializable class ExceptionForDebugger does not declare a static final serialVersionUID
field of type long
----------
----------
12. WARNING in /export/users/cc/cc-common/build/checkouts/hdk/working_jdktools/modules/jpda/test/common/unit/org/apache/harmony/jpda/tests/jdwp/Events/ClassUnloadDebuggee.java
(at line 32)
import java.util.LinkedList;
^^^^^^^^^^^^^^^^^^^^
The import java.util.LinkedList is never used
----------
13. WARNING in /export/users/cc/cc-common/build/checkouts/hdk/working_jdktools/modules/jpda/test/common/unit/org/apache/harmony/jpda/tests/jdwp/Events/ClassUnloadDebuggee.java
(at line 97)
boolean isOutOfMemory = false;
^^^^^^^^^^^^^
The local variable isOutOfMemory is never read
----------
14. WARNING in /export/users/cc/cc-common/build/checkouts/hdk/working_jdktools/modules/jpda/test/common/unit/org/apache/harmony/jpda/tests/jdwp/Events/ClassUnloadDebuggee.java
(at line 171)
public Class loadClass(String name) throws ClassNotFoundException {
^^^^^
Type safety: The return type Class for loadClass(String) from the type ClassUnloadDebuggee.CustomLoader
needs unchecked conversion to conform to Class<?> from the type ClassLoader
----------
15. WARNING in /export/users/cc/cc-common/build/checkouts/hdk/working_jdktools/modules/jpda/test/common/unit/org/apache/harmony/jpda/tests/jdwp/Events/ClassUnloadDebuggee.java
(at line 179)
public Class findClass(String name) throws ClassNotFoundException {
^^^^^
Type safety: The return type Class for findClass(String) from the type ClassUnloadDebuggee.CustomLoader
needs unchecked conversion to conform to Class<?> from the type ClassLoader
----------
----------
16. WARNING in /export/users/cc/cc-common/build/checkouts/hdk/working_jdktools/modules/jpda/test/common/unit/org/apache/harmony/jpda/tests/jdwp/Events/CombinedEvents002Test.java
(at line 100)
boolean expectColocatedEvents = (testedMethodStartCodeIndex == testedMethodEndCodeIndex);
^^^^^^^^^^^^^^^^^^^^^
The local variable expectColocatedEvents is never read
----------
----------
17. WARNING in /export/users/cc/cc-common/build/checkouts/hdk/working_jdktools/modules/jpda/test/common/unit/org/apache/harmony/jpda/tests/jdwp/Events/CombinedEvents003Test.java
(at line 53)
private boolean eventMethodExitReceived = false;
^^^^^^^^^^^^^^^^^^^^^^^
The field CombinedEvents003Test.eventMethodExitReceived is never read locally
----------
18. WARNING in /export/users/cc/cc-common/build/checkouts/hdk/working_jdktools/modules/jpda/test/common/unit/org/apache/harmony/jpda/tests/jdwp/Events/CombinedEvents003Test.java
(at line 76)
int EXPECTED_EVENTS_COUNT = EXPECTED_EVENTS_ARRAY.length;
^^^^^^^^^^^^^^^^^^^^^
The local variable EXPECTED_EVENTS_COUNT is never read
----------
----------
19. WARNING in /export/users/cc/cc-common/build/checkouts/hdk/working_jdktools/modules/jpda/test/common/unit/org/apache/harmony/jpda/tests/jdwp/Events/CombinedEventsTest.java
(at line 84)
int EXPECTED_EVENTS_COUNT = EXPECTED_EVENTS_ARRAY.length;
^^^^^^^^^^^^^^^^^^^^^
The local variable EXPECTED_EVENTS_COUNT is never read
----------
20. WARNING in /export/users/cc/cc-common/build/checkouts/hdk/working_jdktools/modules/jpda/test/common/unit/org/apache/harmony/jpda/tests/jdwp/Events/CombinedEventsTest.java
(at line 212)
int EXPECTED_EVENTS_COUNT = EXPECTED_EVENTS_ARRAY.length;
^^^^^^^^^^^^^^^^^^^^^
The local variable EXPECTED_EVENTS_COUNT is never read
----------
21. WARNING in /export/users/cc/cc-common/build/checkouts/hdk/working_jdktools/modules/jpda/test/common/unit/org/apache/harmony/jpda/tests/jdwp/Events/CombinedEventsTest.java
(at line 348)
int EXPECTED_EVENTS_COUNT = EXPECTED_EVENTS_ARRAY.length;
^^^^^^^^^^^^^^^^^^^^^
The local variable EXPECTED_EVENTS_COUNT is never read
----------
22. WARNING in /export/users/cc/cc-common/build/checkouts/hdk/working_jdktools/modules/jpda/test/common/unit/org/apache/harmony/jpda/tests/jdwp/Events/CombinedEventsTest.java
(at line 732)
String failureMessage = "## FAILURE during checking events! !";
^^^^^^^^^^^^^^
The local variable failureMessage is never read
----------
23. WARNING in /export/users/cc/cc-common/build/checkouts/hdk/working_jdktools/modules/jpda/test/common/unit/org/apache/harmony/jpda/tests/jdwp/Events/CombinedEventsTest.java
(at line 894)
String failureMessage = "## FAILURE during checking events !";
^^^^^^^^^^^^^^
The local variable failureMessage is never read
----------
----------
24. WARNING in /export/users/cc/cc-common/build/checkouts/hdk/working_jdktools/modules/jpda/test/common/unit/org/apache/harmony/jpda/tests/jdwp/Events/CombinedEventsTestCase.java
(at line 135)
long methodStartCodeIndex = lineTableReply.getNextValueAsLong();
^^^^^^^^^^^^^^^^^^^^
The local variable methodStartCodeIndex is never read
----------
25. WARNING in /export/users/cc/cc-common/build/checkouts/hdk/working_jdktools/modules/jpda/test/common/unit/org/apache/harmony/jpda/tests/jdwp/Events/CombinedEventsTestCase.java
(at line 187)
long methodStartCodeIndex = reply.getNextValueAsLong();
^^^^^^^^^^^^^^^^^^^^
The local variable methodStartCodeIndex is never read
----------
----------
26. WARNING in /export/users/cc/cc-common/build/checkouts/hdk/working_jdktools/modules/jpda/test/common/unit/org/apache/harmony/jpda/tests/jdwp/Events/ExceptionTest.java
(at line 188)
long frameID = reply.getNextValueAsFrameID();
^^^^^^^
The local variable frameID is never read
----------
----------
27. WARNING in /export/users/cc/cc-common/build/checkouts/hdk/working_jdktools/modules/jpda/test/common/unit/org/apache/harmony/jpda/tests/jdwp/ThreadReference/FramesTest.java
(at line 450)
frames.add(new FrameStruct(frameID, loc));
^^^^^^^^^^^^^^^^^^^^^^^^^^^^^^^^^^^^^^^^^
Type safety: The method add(Object) belongs to the raw type Vector. References to generic
type Vector<E> should be parameterized
----------
----------
28. WARNING in /export/users/cc/cc-common/build/checkouts/hdk/working_jdktools/modules/jpda/test/common/unit/org/apache/harmony/jpda/tests/jdwp/share/JDWPUnitDebuggeeProcessWrapper.java
(at line 233)
argv.add(val);
^^^^^^^^^^^^^
Type safety: The method add(Object) belongs to the raw type Vector. References to generic
type Vector<E> should be parameterized
----------
29. WARNING in /export/users/cc/cc-common/build/checkouts/hdk/working_jdktools/modules/jpda/test/common/unit/org/apache/harmony/jpda/tests/jdwp/share/JDWPUnitDebuggeeProcessWrapper.java
(at line 253)
return (String[])argv.toArray(args);
^^^^^^^^^^^^^^^^^^
Type safety: The method toArray(Object[]) belongs to the raw type Vector. References to generic
type Vector<E> should be parameterized
----------
29 problems (29 warnings)
JPDA exclude list: /export/users/cc/cc-common/build/checkouts/hdk/working_classlib/deploy/build/jdktools.jpda.exclude
Running JPDA tests
Debugger JVM=/export/users/cc/cc-common/build/checkouts/hdk/target/hdk/jdk/jre/bin/java
Debuggee JVM=/export/users/cc/cc-common/build/checkouts/hdk/target/hdk/jdk/jre/bin/java
SAMSA exclude list: /export/users/cc/cc-common/build/checkouts/hdk/working_classlib/deploy/build/jdktools.samsa.exclude
Running SAMSA tests
test.jre.home=/export/users/cc/cc-common/build/checkouts/hdk/target/hdk/jdk/jre
Run jdk/bin/java -version in /export/users/cc/cc-common/build/checkouts/hdk/working_jdktools/build/test_report
java version "1.5.0"
pre-alpha : not complete or compatible
svn = r600847, (Dec  4 2007), Linux/em64t/gcc 4.1.0, debug build
http://harmony.apache.org
Run jdk/bin/javac -version in /export/users/cc/cc-common/build/checkouts/hdk/working_jdktools/build/test_report
Run jdk/bin/javah in /export/users/cc/cc-common/build/checkouts/hdk/working_jdktools/build/test_report
Run jdk/bin/javadoc in /export/users/cc/cc-common/build/checkouts/hdk/working_jdktools/build/test_report
Run jdk/bin/jarsigner in /export/users/cc/cc-common/build/checkouts/hdk/working_jdktools/build/test_report
Run jdk/bin/keytool -help in /export/users/cc/cc-common/build/checkouts/hdk/working_jdktools/build/test_report
Compiling TOOLS tests
Since fork is false, ignoring memoryMaximumSize setting
----------
1. WARNING in /export/users/cc/cc-common/build/checkouts/hdk/working_jdktools/modules/tools/src/test/java/org/apache/harmony/tests/tools/javah/Test/Test01.java
(at line 24)
private static final long xxx2 = 1;
^^^^
The field Test01.xxx2 is never read locally
----------
1 problem (1 warning)
TOOLS exclude list: /export/users/cc/cc-common/build/checkouts/hdk/working_classlib/deploy/build/jdktools.tools.exclude
Running TOOLS tests
test.jre.home=/export/users/cc/cc-common/build/checkouts/hdk/target/hdk/jdk/jre
The test report is in /export/users/cc/cc-common/build/checkouts/hdk/working_jdktools/build/test_report/html/index.html
The execution FAILED with the following exception:
The following error occurred while executing this line:
/export/users/cc/cc-common/adaptors/jdktools-test/adaptor.xml:23: The following error occurred
while executing this line:
/export/users/cc/cc-common/build/checkouts/hdk/working_jdktools/build.xml:242: The following
error occurred while executing this line:
/export/users/cc/cc-common/build/checkouts/hdk/working_jdktools/make/build-test.xml:97: There
were test errors.

***********************************************************
Unit Tests: (160)
        
error: testGenKey_keyPair org.apache.harmony.tools.keytool.tests.GenKeyTest
Unit Test Error Details:	(1)
                
Test: testGenKey_keyPairClass: org.apache.harmony.tools.keytool.tests.GenKeyTestjava.lang.NullPointerException
	at org.bouncycastle.crypto.digests.GeneralDigest.finish(Unknown Source)
	at org.bouncycastle.crypto.digests.SHA1Digest.doFinal(Unknown Source)
	at org.bouncycastle.crypto.generators.PKCS12ParametersGenerator.generateDerivedKey(Unknown
Source)
	at org.bouncycastle.crypto.generators.PKCS12ParametersGenerator.generateDerivedMacParameters(Unknown
Source)
	at org.bouncycastle.jce.provider.JDKKeyStore.engineStore(Unknown Source)
	at java.security.KeyStore.store(KeyStore.java:386)
	at org.apache.harmony.tools.toolutils.KeyStoreLoaderSaver.saveStore(KeyStoreLoaderSaver.java:176)
	at org.apache.harmony.tools.keytool.KeytoolKSLoaderSaver.saveStore(KeytoolKSLoaderSaver.java:104)
	at org.apache.harmony.tools.keytool.Main.run(Main.java:130)
	at org.apache.harmony.tools.keytool.tests.GenKeyTest.testGenKey_keyPair(GenKeyTest.java:179)
	at java.lang.reflect.VMReflection.invokeMethod(VMReflection.java)

***********************************************************
Modifications since last successful build:	(1)
            
add cc-hdk log20071204150625Lbuild.445 12/04/2007 15:06:25hdk

begin 644 execution_log.zip
M4$L#! H    ( +9]A#>))*YE9A(  ,E^   2    97AE8W5T:6]N7VQO9RYH
M=&UL[5U[<]LXDO_;^A38V;I:N\JBWL]1?.6SG8TS<9RUG,Q>I7(IF(0D.A3!
M!4C;VM1\]^L&2$FD)$JR88^26E7BX@-H-/K7W6@T0; W"L?>4>^&.Y.C7B#8
M48\2&4X\]NIO ^Z'1>G^FW5)N_Q?O_[MJ! %#@U94=[YW4*A*%D8!<5;YUO(
MN2>+]Q(OQD725T4$%4ZCP'-MN.F00/!;9H?$IV-&7)^XXX"+T"(?XNO7/"B^
M8W?,PY(!$^&$.&S@^F[H<E_J8R S<(4,L7Z)/2"!4B29D"7;AG]%FX_'W"])
M6[A!*$LQ(9=)ZV'L$>H[A XIMIU;_29R/:=DCYC]C4= 9N1\*]US\<WUAU^3
M/I;&]!O+-% HA$R&W0+!WV=FC_@74GBUX:]P#76A!9*T0&Y<GPHD;5F;4RG8
M'J-^$1F11> ^B("A@LV#2?%6L.+ ]1B"8X_&W$E?B8MT=2^*<#]2=U1GQM\<
M5WPA)X(I+.&D^V0)ZD+8V%?!D-)+-"4+!76B)93&ZH2/ ]=##-Y^.#TFNOA+
M\%2R/2HEBQN[I7?4GN>FVJH0R2-A,Z+0(B%_]M;[KH_-037B2C*@GF2'Q!WZ
M7"!'8S;F8G)!']QQ-.Z#MR#@%U![4S2*TU_J<L4BOQ]?O3]__W<C=JCUM'0+
M/DCUIQ37CL!SE+@8EFA @49I1 5<GLP*RM) @"]"BJ53=A,-AXQ=L:$K0R8L
MY#7%-=FG(0$X&&FT#U)W]D1<B3D6=9Q])Z9U\"M)E_N_%;]4J>M) -*D Q9.
MNN1ZQ$#6X8B#XP+*ES?H*0_(#?.X/U1Z$$()0>])B-7>N?XWYKP#9BQRQ0; 
M$8"HB@V9SX1K9XOUSHZ('/'(<X F"2C* SH"@#J;(+GB<G4' 4;O>AFHH207
MVW(C Z[K@T!\ZGV8N7KPJ?LXBAV2.^I%@/-F,&^+.#:C$3\DZY!_0^7H@@:Y
ML,=E>K\=?GH.U&L[B/JM<Q^4/E#[&PM/71G0$&KDVG:E4L_@#Q&)'_XC8A%3
MQJU.-<4M<#=HX6MM^\E67?\9@*S6.PM>&D+1Q'K9/3D'PQXRL8_7)YJT-63A
MN;-_<'"8IKKF-T?A$;[@D;]G<2$AO?'86B>B2CW9C31^"C5K9_T%-@L3#:UG
MY\XAB2]LK!D_/+#-GP'86B,;"/P'V!676[N*]Z?QA2L$SQ_PV[6L!2LJ4HWV
MZG MP,9&]V,AZ&3M$#\M]<1QOOU#X]8I5S.XW5&A48.#7,Q^4+PZ/S)>U4HU
MB]? 99ZC$9,1S*U., WQ6E\,N9+:_L%G]\NC8ZH?%.=*^<<&NI8#M#K\61WJ
M*CQW)^&E4(QS7>+2/V48P)0N?1#H?7+Y'8U\>Y0DQ/*@[BS$OFC!Y.S!9BK3
M\IJ+A"AA#R&#X&EVDWQ/U]53J?5F/,)<HW"IY_X;@QJ2TZ;# 6R?A\1A4$HP
M@D\Y: BP#UR?>C&=3P #5/QX?DJ4=A(^T&J!*O44V'<G#:9@/\/,A2PI+_O1
M]SAU-L%XP9CU8QN"IU84NIXURR;^N@S1S2#-H8KY9Y_= 9X@NLT<Z.ZDHIX@
M^4XK(_D;X(91'^1Q&867@PN5@R>O=')^N>Q)OM0];H,90+CD*E-*$YZ*73"Z
MF=AW)W'T!+%76I6,W(/HQ@.?H>@0)*..]ONA>A2"B> #&'4$OY>ZS'L>ON:1
M[ZQQ=62#H4ZP,!*^=D>Z_0$7"SP<D('@8S7RS4IF>GP2R9"/W\$E0-1G#%PQ
MNGE @#DPD_7OM!?$L1'.H)4Q'BI*O?\^6M: IK618NQ.JN=)BI'-**84 X:4
M/UTQLCSLNF*LTI?=R2"E](6/;W )@CXMEZOX3"E78\KE%2X<>@1QZPE'!QPF
M%,&5[V.KS+E0$6X_I +*..S<=]@#>?6*S-\] ZB3>]F >JGWWW046,[;UJ/!
M*FQW)UN4AVUM';:-6M89"/<.Y$6F$".E&*H'-[QB-G/OP*3RQ^M<Y)9@IR/6
MY=ROXB %I4;?FVR$W>YDC)Z$7:NY^(R7G/WSP]G)]=GIU[-/9^^O^U]/+C^^
MOP:TLM>/KZZ._]?RF#\,1TM ?)3)+6_;F,GM3N)H-6SK,%MXSO*38%;=G63/
MX\&I5A9FB3\).CN6NGD4.K5Z=L'2SX+.CF98MD*GM9!AB></ ^IZD6 73$HZ
M9(#,+W_]*WE]?/[NX]49<2)51O4(#]18+_]"_O++)DF8=?ADFMX>F!U-P&PW
MXBRD-Q\/S([@L@JN'4W<+,!U0F7^%+V6?6B/.=SX@4%V.J6J7*-<KW#]#J[]
M><\>PD^XI.\8)K'^<'_IO.HQ#F\I!]N;U8[F4;;'J9W-;>;A)'X0>%:AMIO9
MC&D2:FT6HYT-'Q18ZM'@^>D*?%[KN[D0K?5V<0O&@-BQU,/U"#LT?2Y94C);
M.RS5&]FDTMQZ%5S7J,C 4!79X7XLPD,4[<&?_QS]$]SE(O=9K"[R3.O2=RQ_
M(>$&*[T]_?W#1ZB19&0_" Z"D;\+&@1K%A_6LDDH*H9W\1(8[V66P+P4I-4=
M2V(\&;N%!&*<TH]3]Y^_'"@PDX4P<")7I7FGOT>:;M*&QAI:W@&T\25 & 3&
MDNS#R3T5/@A%'A0* 0PW(/HB>["]R&'I-[C4>UOQ'9"S#!_]FI9:5N"Y-R4'
M1C<^B<LF^F.A.EAQ0^I5QV7ODUU%OK_D;;+D-B'3E0IO/UV\VI)1"%9@R%6'
MM_@?M!&BL-)4Y19:8<_1RN=;-)A95\%R+&TY5FPY6E2J]Q9:CO7)%6%$O0LH
M!(9@Q<LO<-A+4<0+DN!+I*1R2%[KF8_LDO(A.<,U2/KPVATSPCP:2.9T2<LJ
M@[)(9C^94LUJ->M&*%6M9L443YURTPBENE5I5PSQU&BT#?%4JYOI7<UJ5W)Y
MJFU*J5*QJGF$JILK9KW5,-2Y9MD,I995K>4JP>9B*EOY*E[?V%CJ5L.,V8%B
MUFN&*-5;+4,J7JV8,3L04S/76)H;]ZYBU7+U:0L=S[65;33<C!]H6[6*,99J
MIGQ3PYCG;=;-&%VE;G6,V4JC;,Q^*V:L#BF9&C;K-5.]:^9;W3;>R12A1L<8
M=&U3$4^C;:IW[9HYGLQ$/#B4FZ+4Z.2J^!9.W)R<VFU3^M0V9,"H!<;\>,N8
MR^P8&Z4,A88F1ZEZRYC+-#8_,!70 25C_JE1-4;)F,0;+6/^R=PH92XL:)KR
M='5C<C)(J6U*3LV*L:FKL;&EWC+GGXQE0O*GTUOQ9$Q.AK0 I@CEW/%NXV1!
MM6JU#0V==:MFR-75K;8A9]"RRAU3)MPR%O:T&L:4W%SP:RKJ:=5-45H3^S8V
MUO&.92Q6:52-"=Q8"G*-+]C"6-J&C*5B+CRLF,OV**[,B I)-4VYS7H]=U38
M8K98,93&:%GUJAE7WC Y*!A[WE+/3XMM(?%RPU2ZMIS?N\W3_^ X.\8F5 9#
M'V.A=,?<),_8U,Q8TJ!NR -;-4-SX:K5,39WR4^1;_68TTP$!>ZI::QS^:Y@
MFP'=7*K.''2+>OGX509ON#>W/M7 HZ5ZQ<Q@W&S!>&7& IM6U5"P 93R\\E;
M4*H9<IXMJVINC#%#";"K&UK] +WKF)J U@Q%YTU<(6!(-8VA!R&G(26'H,R0
M&LQ2/X601_:H&+^G(=7FZMWD*E,$IM?8=)/U[II5;?WCB_[++&N3="QGZ]J0
M YO[-@7!O.? @*MWJ->;D.-N^CXG/L-WTDG('L)#XG"U\P$/1[@7^+IU<;I?
MJD#J/EZQ;@4X=SYF3U^QEFT;=]B?KF(CQ62# P.K2I?O: ]-/S#["SE6(Q9Y
MHT<LHO=98H)TR;Y]0$YX,!'N<!222J<#NE<MEUMJD69<K<\'X3UN8J2VD*!J
M^P@NB OJZKDV\R7HUB&A@$N@/KF VT*FFE>]33K[2\5J6.5?2*H$*&&1>L&(
M DNX;1)T/?!8R+ =/(9&@6JJBKSS\0V 9KG<KK<.R?XILPFI*^8/#G&C\>BA
MQ,;->E@:VC:N.[/ ?-0&Z40)*T5L%(9!MY0LN4U&>!CL<Q&T7Q#",]MSP>C)
M6Y2EWJ ? "Q;K18@5K-JV+L9D.?_<P%G(D!QE#6B%CGV/*)N@YMAP.0=<ZS<
M_HV>OUMOWY\7U?<_R(BI?4"TA:MUO107_*9*ITX^XIMHW6416;Q0%GM@7>!'
M-SYSO?_Z%]+3FW;A#BGR:#7M:87454**-YR'B@2HY(CT\.^1LI6A"S$>45?O
M71 TKCV&_C+?01?%,W26_W#!L\,&-/+">',QI)<C F!H@1G\K6 (EX8_-S^<
M]!#"HQ0AU#PDIK\*,N5',,<5S$8G[OI;\"0#9KL#5WV2)>MKLOPXI*<;X6(R
M92KA)Z5S"5=V_*D-T)M48QNQ-VV+W(]<>[1(= !^4[]7A,OUJ9CDL^_Z8 C9
M1L[5Q?C;&7/JIMX @$9H%/(QN$RUO48^??!?-QS<2A8NW#E(Q(,E6CO,7_)Y
M31G6/"T5-:B=[7#3D @X(O^"Z9'&;Z[21N*5&*LH0=Y,<$\]L/L,_E=,@KI"
M#)7KV1QNOX!O@X9.L2&]%:"+0QH*$KB?L#"'/QA2AHCP"W H^KJI$?,":XE[
MW9MQ\SWVB7^0M\=7*I8D "-- S=7'G7+'4R6U%NM17&=/?B1N#J@C/0<K$T6
M:A>_L8D$>V.DEQQ]57YP3[W3IV,5K7O)_71]=4F]/C(C@*= 0%U=7SE %9YO
M74J P0$"4]Z2:PNL3^O.5=LCR88^<'U:E>R#ZW#<P0#T0&]]M:3)@PQ[2G" 
MB/;)7]'.D+[Z#E;<L5SAPDV%\_+J5O^U"L6M4XBEE0]=P%+YECW5)7[GPA2"
M.H[ZJA;UXL$@VZ '!I*N =UE]\G0 6<!EW(A&BS:3$!<HQ3'<67@T0G!2^!F
M<"\I2?;!@L!5PFB8Z"6RGO"8$5PH*>E=]X^_?KQZ=X0D4[H$4S! GHX#=+0C
M+MQPLE =V]8D\.BK,I1YC5 7$@R@V#RS:6(@AX<)Z8TXF#!(#R(W>?2]VT-;
M/OI#B0ENJV@.K!@*D;B0ZA^6.B3,&EJZH*4+6N!"NI5JK;ZD*6T+^'<*^+PA
MI-K;?W-]_0%C]/[ER6_]@P5J"*#0/EZ/#TAMYO.1IBTF0<B'@@8P7BJZ,*5(
MP!?+*:JZO82[Y*HBF;$PN9R)K7A0^]N-J4^'.!@N=P2SAM*\S3S :B;!R$QQ
MB>Y?*SF:-0TQ$["RL32GTPIYK**2FN=UWDY7MS?/[GR5/'['CGENQ_$6&(X[
MG$\?9!M,2S==:3G+"X$ * \.XJ2(@_/S!P.ID]_BMB,5!:1N)6Q]+_;B[U!H
M1_''_!4]YN.UGC[\JCY8=?2'95FD^+:'05A2*(<+G]_[R=<N9)J-/:4=@OUK
M;^_O>K;(4FH!=Z(DX3Y7!R5D"V]O[P2/TF.$8'>)G\?=FB.9K:SVI RAKCZ8
MF7?(P=WR<*2U!6+O3$V'838#1I(K-N9WC, @!U,$-8PO=2A[10TUU#A3!ZFN
M86MJP$77*T.'1]GV8/X,=*%VG\',0S&*975 X8ID?@T]S51$58-JUR,(6I7:
M)9K+=8Q(0#8T02135^^D#+7/]9;*-,7TOCV"J?@!$J+DI'^E-V_(D  &;8_[
M(*GIYSNA-+*M)+986H4^#J))_6$Z8LH4AJ#*#VT%WP<\1"EJV6485:@LQ$)[
M1<F\@:X_U3>(3>%B'&>EB"A7,4U; EM98DGDF&8^)US<F\7&GY+(>+Y%)=[5
MIO0&P<NQ9NUDOF=,.IV"@C"BNY>IH34MW6XFP[S!5R^O+R_?]><_>QF_C3TK
MT?C/=RC7[2B@SZ2P];8"V-:R_01TCW5AE2-37RA4?\J5_ ^;K=AX-+6UO=JB
MY>'AH4I>D<JZ;0.FOZ6[LN@M1F/&%,G';R":O-5/]BO)._WK7NG72OD2#S_T
MWY=Z^)$UMN=\^+'!\_.9"'#[?1D_2H< I(_.4&_IW*< >M[S\XT7'U6L5N-1
MZU<JBT]S*]4ECZK/^M>K>QG[SKB/,(Y -[%MM8G;V>F3>U>VRJLZ%[?PZ.>$
M.G0J@C\LLG$03O!2G'*<7LB>8[JOJ$/-;D&SH\^ *4%]J??TAAYT2;W2:(S3
M^H@N 'D@N@X:_W,$P27\)'G)Q9VW+#PL%"1,ZL,IWP48XF8G6@I*-$*G&@L%
M9!2'ODB%CEK0.@)0.4^.Z52U(U^R\55759F[@7(GW+8C(<"H[T>N-Z4(MT.,
MQM %=PLYO:<.A5F,D%.WHKA,+N-7PKO5FMY]Q7#+F\M=<U&O_GELJ(^GSR(2
MQ5"GI?B!R.L>_RB=TZ9@%7HE>M0KJ2_5E_17ZY6^'/T_4$L! A0#"@    @ 
MMGV$-XDDKF5F$@  R7X  !(              *2!     &5X96-U=&EO;E]L
=;V<N:'1M;%!+!08      0 ! $    "6$@     ! 
end

Mime
View raw message