harmony-alerts mailing list archives

Site index · List index
Message view « Date » · « Thread »
Top « Date » · « Thread »
From nom...@intel.com
Subject [build-test alert] FAILED Linux x86_64: struts_test
Date Tue, 04 Dec 2007 08:04:44 GMT
svn.revision=600616
BUILD FAILED:
	Ant Error Message:
/export/users/cc/cc-suites/scripts/cc-exec-adaptor.xml:104: The following error occurred while
executing this line: /export/users/cc/cc-suites/adaptors/struts_test/adaptor.xml:67: The following
error occurred while executing this line: /export/users/cc/cc-suites/adaptors/struts_test/adaptor.xml:229:
Test failed

Date of build:	2007-12-04 14:04:14 +0600
Time to build:	23 seconds
Last changed:	12/04/2007 13:45:08
Last log entry:	snapshot

***********************************************************
Errors/Warnings:	(2)
            
The execution FAILED with the following exception:
The following error occurred while executing this line:
/export/users/cc/cc-suites/adaptors/struts_test/adaptor.xml:67: The following error occurred
while executing this line:
/export/users/cc/cc-suites/adaptors/struts_test/adaptor.xml:229: Test failed

***********************************************************
Unit Tests: (1)
        
error: unknown org.apache.harmony.struts.test.WebAppTest
Unit Test Error Details:	(1)
                
Test: unknownClass: org.apache.harmony.struts.test.WebAppTestjunit.framework.AssertionFailedError:
Lines number mismatch: local=154, remote=53
	at org.apache.harmony.struts.test.WebAppTest.checkResponse(Unknown Source)
	at org.apache.harmony.struts.test.WebAppTest.performTest(Unknown Source)
	at org.apache.harmony.struts.test.WebAppTest.launchSpiderR(Unknown Source)
	at org.apache.harmony.struts.test.WebAppTest.test(Unknown Source)
	at org.junit.internal.runners.TestMethodRunner.executeMethodBody(TestMethodRunner.java:99)
	at org.junit.internal.runners.TestMethodRunner.runUnprotected(TestMethodRunner.java:81)
	at org.junit.internal.runners.BeforeAndAfterRunner.runProtected(BeforeAndAfterRunner.java:34)
	at org.junit.internal.runners.TestMethodRunner.runMethod(TestMethodRunner.java:75)
	at org.junit.internal.runners.TestMethodRunner.run(TestMethodRunner.java:45)
	at org.junit.internal.runners.TestClassMethodsRunner.invokeTestMethod(TestClassMethodsRunner.java:71)
	at org.junit.internal.runners.TestClassMethodsRunner.run(TestClassMethodsRunner.java:35)
	at org.junit.internal.runners.TestClassRunner$1.runUnprotected(TestClassRunner.java:42)
	at org.junit.internal.runners.BeforeAndAfterRunner.runProtected(BeforeAndAfterRunner.java:34)
	at org.junit.internal.runners.TestClassRunner.run(TestClassRunner.java:52)
	at junit.framework.JUnit4TestAdapter.run(JUnit4TestAdapter.java:32)

***********************************************************
Modifications since last successful build:	(1)
            
add cc-snapshot log20071204134508Lbuild.49 12/04/2007 13:45:08snapshot

begin 644 execution_log.zip
M4$L#! H    ( )-PA#<ZG(DC?0(  "(&   2    97AE8W5T:6]N7VQO9RYH
M=&ULQ55-3]M $+W[5\REXL)ZDT "N"$2*B!5HA=$U0-"U68]Q@OK76L_\M%?
MSVSLJ$VA+:6'6K%CSWCF[;PWGIW6H=&SZ=R6Z]FT=3B;"O!AK?%TK[(F,*^^
M80''@W?O]V99;$L1D/F%*;*,>0RQ9=*:4@5EC2>;B^0!@-L2-0:\@_/TK\Q]
M 1Q7K76!1X_.<RGIQWQ4 3V?1Z5+[M!''3SWP<7@OY(C<"F"T,J(W,;P8EXH
ME4,9K%N_#2!=6.]( '#;/%+*._C@D$HM4_XWKGTG=<:(VU8X9%N*"$K:=DU(
M=$V5#*%2&B'8/\/)&N4C44* 1K2^MH'7Y2-_2*=#KM6<SZT-G49TN@4ZEE(F
MV6A)SXT^"+<UIN>E4(%5UFW?V_BQ[&5GBT:X^Y]S1/-+%Q7-$A]=Y;</T:AP
M!]?1F%2Y=?>Y: 55E=?"-=:L\X[(/,7D7W!^UK8W=+L3S>CX?'T%PP$=.=WE
M/?TC1HPLI?#(1OD@G_#M8_[@VP)2SH0*2Q7J#>?CT>!P<CP^.,K3Q[ #<J4,
M>C"QF:.#1OE&!%D7H*T4^G0X/MP'AXT->#H^V(E+J_60M(;A/EP*I2/Q7L!@
M'RZ<L\YO[#>J04!-$A*U,,E'HT/P*)]E>CU#<'GV\>KB/.NBJ>5( ,KAA/&D
M9@.!$ LX&8P;WS=A8Q?T/7VRB[_LP1=:GH2NE%&^WNBM*E91W5W3?+<7_XC[
MZMZ_J8G;%<J8AE//2Z=Y($]EM;;+A(TKB6UZI]B$_.!(0H&5,CI'DV!9IR7V
M&<D=:N6!AA,6V6\6+4K1TGC:'0V],5\UNI@<%? _<$>CDZ)KKDZE;,K%;,HW
M6P#OM@.^V1N> %!+ 0(4 PH    ( )-PA#<ZG(DC?0(  "(&   2        
M      "D@0    !E>&5C=71I;VY?;&]G+FAT;6Q02P4&      $  0!     
&K0(      
end

Mime
View raw message